{"text_format":"1","workbook":"xlsx","n_sheets":2,"sheets":["Chemical_Addition_Form","DD_Lists"],"not_rendered":{"charts":0,"images":1,"macros":1,"external_links":0,"defined_names":5,"comments":0,"pivot_tables":0},"unopened":[],"bounds":{"document_bytes":16777216,"sheet_cells":100000,"rows_first":2000,"rows_last":500,"rows_between":2000,"halvings":0,"cell_chars":16384,"cell_head_chars":4096},"cells_cut":0,"cells_raw":0,"read":"whole","date_system":"1900"}

{"sheet":"Chemical_Addition_Form","index":0,"n_rows":133,"n_cols":53,"rows_kept":133,"cut":false,"hidden":false,"merged":[[111,3,111,5],[111,7,111,9],[111,11,111,13],[111,39,111,41],[111,15,111,37],[107,35,107,41],[109,27,109,29],[109,31,109,33],[109,35,109,41],[107,27,107,29],[107,23,107,25],[17,0,17,41],[37,0,37,41],[23,11,23,17],[19,35,19,39],[101,35,101,41],[99,35,99,41],[105,35,105,41],[93,19,93,21],[95,19,95,21],[97,19,97,21],[99,19,99,21],[99,27,99,29],[99,31,99,33],[103,31,103,33],[101,31,101,33],[105,31,105,33],[91,23,91,25],[91,27,91,29],[91,31,91,33],[97,23,97,25],[99,23,99,25],[101,23,101,25],[103,23,103,25],[105,23,105,25],[1,5,5,33],[3,35,3,41],[21,11,21,17],[123,0,123,41],[129,1,129,9],[130,1,130,9],[129,13,129,17],[129,21,129,29],[130,13,130,17],[130,21,130,29],[129,33,129,41],[130,33,130,41],[113,1,115,41],[27,39,27,41],[107,31,107,33],[101,19,101,21],[103,19,103,21],[105,19,105,21],[107,19,107,21],[121,3,121,41],[7,0,7,41],[117,3,117,41],[119,3,119,41],[103,35,103,41],[95,23,95,25],[93,23,93,25],[91,35,91,41],[93,35,93,41],[95,35,95,41],[97,35,97,41],[105,27,105,29],[103,27,103,29],[101,27,101,29],[85,31,85,33],[85,27,85,29],[87,27,87,29],[87,31,87,33],[89,31,89,33],[89,27,89,29],[93,31,93,33],[95,31,95,33],[97,31,97,33],[97,27,97,29],[95,27,95,29],[93,27,93,29],[83,27,83,29],[83,31,83,33],[83,35,83,41],[85,35,85,41],[87,35,87,41],[89,35,89,41],[107,15,107,17],[109,15,109,17],[109,19,109,21],[109,23,109,25],[83,19,83,21],[83,23,83,25],[85,23,85,25],[85,19,85,21],[87,19,87,21],[87,23,87,25],[95,15,95,17],[97,15,97,17],[99,15,99,17],[101,15,101,17],[103,15,103,17],[105,15,105,17],[83,15,83,17],[85,15,85,17],[99,11,99,13],[97,11,97,13],[95,11,95,13],[87,15,87,17],[89,15,89,17],[91,15,91,17],[93,15,93,17],[93,11,93,13],[91,11,91,13],[89,11,89,13],[87,11,87,13],[103,7,103,9],[105,7,105,9],[107,7,107,9],[109,7,109,9],[75,11,75,13],[75,15,75,17],[77,15,77,17],[79,15,79,17],[81,15,81,17],[81,11,81,13],[91,7,91,9],[93,7,93,9],[95,7,95,9],[97,7,97,9],[99,7,99,9],[101,7,101,9],[83,11,83,13],[79,11,79,13],[77,11,77,13],[109,11,109,13],[107,11,107,13],[105,11,105,13],[103,11,103,13],[101,11,101,13],[77,35,77,41],[79,35,79,41],[81,35,81,41],[75,7,75,9],[77,7,77,9],[79,7,79,9],[81,7,81,9],[75,19,75,21],[75,23,75,25],[75,27,75,29],[77,23,77,25],[79,23,79,25],[81,23,81,25],[77,19,77,21],[79,19,79,21],[81,19,81,21],[75,31,75,33],[77,31,77,33],[79,31,79,33],[81,31,81,33],[77,27,77,29],[79,27,79,29],[81,27,81,29],[73,23,73,25],[83,7,83,9],[85,7,85,9],[87,7,87,9],[89,7,89,9],[79,3,79,5],[81,3,81,5],[83,3,83,5],[85,3,85,5],[87,3,87,5],[89,3,89,5],[85,11,85,13],[89,23,89,25],[89,19,89,21],[71,35,71,41],[69,35,69,41],[67,35,67,41],[65,35,65,41],[73,3,73,5],[75,3,75,5],[73,27,73,29],[73,31,73,33],[73,35,73,41],[75,35,75,41],[71,23,71,25],[67,27,67,29],[71,19,71,21],[69,19,69,21],[67,19,67,21],[65,19,65,21],[67,11,67,13],[69,11,69,13],[71,11,71,13],[71,15,71,17],[69,15,69,17],[67,15,67,17],[73,7,73,9],[73,11,73,13],[71,27,71,29],[51,31,51,33],[53,31,53,33],[55,31,55,33],[57,31,57,33],[59,31,59,33],[67,31,67,33],[69,31,69,33],[71,31,71,33],[51,27,51,29],[53,27,53,29],[55,27,55,29],[57,27,57,29],[59,27,59,29],[61,27,61,29],[63,27,63,29],[65,27,65,29],[59,23,59,25],[61,23,61,25],[63,23,63,25],[65,23,65,25],[67,23,67,25],[69,23,69,25],[55,35,55,41],[57,35,57,41],[51,23,51,25],[53,23,53,25],[55,23,55,25],[57,23,57,25],[59,35,59,41],[61,35,61,41],[63,35,63,41],[61,31,61,33],[63,31,63,33],[65,31,65,33],[69,27,69,29],[51,35,51,41],[53,35,53,41],[59,15,59,17],[51,19,51,21],[53,19,53,21],[55,19,55,21],[57,19,57,21],[59,19,59,21],[51,15,51,17],[53,15,53,17],[55,15,55,17],[57,15,57,17],[71,7,71,9],[77,3,77,5],[63,3,63,5],[65,3,65,5],[91,3,91,5],[63,19,63,21],[61,19,61,21],[65,15,65,17],[63,15,63,17],[61,15,61,17],[73,15,73,17],[73,19,73,21],[91,19,91,21],[55,3,55,5],[57,3,57,5],[55,7,55,9],[57,7,57,9],[109,3,109,5],[107,3,107,5],[105,3,105,5],[103,3,103,5],[101,3,101,5],[99,3,99,5],[97,3,97,5],[95,3,95,5],[59,3,59,5],[61,3,61,5],[61,7,61,9],[59,7,59,9],[93,3,93,5],[67,3,67,5],[69,3,69,5],[71,3,71,5],[63,7,63,9],[65,7,65,9],[67,7,67,9],[69,7,69,9],[55,11,55,13],[57,11,57,13],[59,11,59,13],[61,11,61,13],[63,11,63,13],[65,11,65,13],[11,33,11,41],[11,1,11,6],[11,11,11,27],[49,27,49,29],[49,31,49,33],[49,35,49,41],[49,23,49,25],[19,13,19,17],[25,1,25,9],[21,1,21,9],[40,35,47,41],[49,3,49,5],[46,27,47,29],[46,31,47,33],[42,27,45,29],[42,31,45,33],[15,33,15,35],[15,39,15,41],[27,52,27,54],[51,3,51,5],[53,3,53,5],[49,7,49,9],[51,7,51,9],[53,7,53,9],[49,11,49,13],[49,15,49,17],[49,19,49,21],[46,23,47,25],[39,19,47,21],[39,15,47,17],[41,11,47,13],[42,23,45,25],[41,7,47,9],[39,3,47,5],[51,11,51,13],[53,11,53,13],[39,23,41,33],[39,7,39,13],[29,52,29,54],[5,52,5,54],[13,44,13,50],[15,44,15,50],[17,44,17,50],[3,52,3,54],[7,52,7,54],[29,1,29,9],[33,1,35,41],[21,35,21,39],[23,35,23,39],[25,35,25,39],[15,15,15,29],[33,44,33,60],[21,44,21,60],[11,44,11,60],[25,13,25,17],[27,23,27,37],[3,44,3,50],[7,44,7,50],[13,52,13,54],[15,52,15,54],[17,52,17,54],[23,52,23,54],[25,52,25,54],[132,39,132,41],[132,0,132,38],[125,1,127,41],[1,37,2,41],[1,44,1,60],[45,44,47,50],[45,52,47,54],[15,1,15,11],[23,44,23,50],[25,44,25,50],[27,44,27,50],[29,44,29,50],[35,44,35,50],[37,44,37,50],[39,44,39,50],[41,44,41,50],[43,44,43,50],[41,52,41,54],[43,52,43,54],[35,52,35,54],[37,52,37,54],[39,52,39,54],[39,1,47,1],[39,35,39,41]]}
[]
[null,null,null,null,null,"Massachusetts Department of Environmental Protection - Drinking Water Program\nChemical Addition Report - 310 CMR 22.15(4) Chemical Addition Reporting Requirements",null,null,null,null,null,null,null,null,null,null,null,null,null,null,null,null,null,null,null,null,null,null,null,null,null,null,null,null,null,null,null,"C-ADD-XLSM",null,null,null,null,null,null,"9Specific Gravity to Density Calculator"]
[]
[null,null,null,null,null,null,null,null,null,null,null,null,null,null,null,null,null,null,null,null,null,null,null,null,null,null,null,null,null,null,null,null,null,null,null,"Reporting Period3",null,null,null,null,null,null,null,null,"Specific Gravity"]
[]
[null,null,null,null,null,null,null,null,null,null,null,null,null,null,null,null,null,null,null,null,null,null,null,null,null,null,null,null,null,null,null,null,null,null,null,"Month",null,null,null,"Year",null,null,null,null,null,null,null,null,null,null,null,null,"x   8.34"]
[]
["I.  PWS Information - Refer to \"MassDEP Chemical Addition Report Guidance and Instructions\" for details.",null,null,null,null,null,null,null,null,null,null,null,null,null,null,null,null,null,null,null,null,null,null,null,null,null,null,null,null,null,null,null,null,null,null,null,null,null,null,null,null,null,null,null,"Density (lbs/gal) = ",null,null,null,null,null,null,null,{"$f":"ROUND(BA4*8.34, 1)","v":0}]
[]
[null,"PWS ID1",null,null,null,null,null,null,null,null,null,"PWS Name1",null,null,null,null,null,null,null,null,null,null,null,null,null,null,null,null,null,null,null,null,null,"Town1"]
[]
[null,"Select PWS ID",null,null,null,null,null,null,null,null,null,{"$f":"IFERROR(VLOOKUP(B12,DD_Lists!A1:C877,2,FALSE),\"\")","v":" "},null,null,null,null,null,null,null,null,null,null,null,null,null,null,null,null,null,null,null,null,null,{"$f":"IFERROR(VLOOKUP(B12,DD_Lists!A1:C877,3,FALSE ),\"\")","v":" "},null,null,null,null,null,null,null,null,null,null,"10Dilution Factor (for liquids) Calculator"]
[]
[null,"Treatment Plant ID #2",null,null,null,null,null,null,null,null,null,null,null,null,null,"Treatment Plant Name2",null,null,null,null,null,null,null,null,null,null,null,null,null,null,null,null,null,"Plant Availability",null,null,null,null,null,"Plant Status",null,null,null,null,"# Parts Chemical"]
[]
[null,"Select Treatment Plant ID #",null,null,null,null,null,null,null,null,null,null,null,null,null,{"$f":"IFERROR(VLOOKUP(B16,DD_Lists!F2:I1431,2,FALSE),\"\")","v":""},null,null,null,null,null,null,null,null,null,null,null,null,null,null,null,null,null,{"$f":"IFERROR(VLOOKUP(B16,DD_Lists!F2:I1431,3,FALSE),\"\")","v":""},null,null,null,null,null,{"$f":"IFERROR(VLOOKUP(B16,DD_Lists!F2:I1431,4,FALSE),\"\")","v":""},null,null,null,null,"# Parts Water"]
[]
["II. Chemical & Operational Information",null,null,null,null,null,null,null,null,null,null,null,null,null,null,null,null,null,null,null,null,null,null,null,null,null,null,null,null,null,null,null,null,null,null,null,null,null,null,null,null,null,null,null,"Dilution Factor = ",null,null,null,null,null,null,null,{"$f":"IFERROR((BA14/(BA14+BA16)),\"\")","v":""}]
[]
[null,"Chemical Name4",null,null,null,null,null,null,null,null,null,null,null,"Purchased Strength8",null,null,null,null,null,null,null,null,null,null,null,null,null,null,null,null,null,null,null,null,null,"Target Range / min12"]
[]
[null,null,null,null,null,null,null,null,null,null,null,"Purchased Density(lbs/gal)9",null,null,null,null,null,null,null,null,null,null,null,null,null,null,null,null,null,null,null,null,null,null,null,"Target Dose13",null,null,null,null,null,null,null,null,"10Mix Ratio (for dry chemicals) Calculator"]
[]
[null,"Manufacturer5",null,null,null,null,null,null,null,null,null,"Dilution Factor or Mix Ratio10",null,null,null,null,null,null,null,1,null,null,null,null,null,null,null,null,null,null,null,null,null,null,null,"Alarm Setting (low)14",null,null,null,null,null,null,null,null,"Mesurement Type",null,null,null,null,null,null,null,"Scale"]
[]
[null,null,null,null,null,null,null,null,null,null,null,null,null,"NSF Approved11",null,null,null,null,null,null,null,null,null,null,null,null,null,null,null,null,null,null,null,null,null,"Alarm Setting (high)14",null,null,null,null,null,null,null,null,"Weight of chemical (lbs)"]
[]
[null,"Product Name6",null,null,null,null,null,null,null,null,null,null,null,null,null,null,null,null,null,null,null,null,null,"Date of last anti-siphon valve inspection/replacement15",null,null,null,null,null,null,null,null,null,null,null,null,null,null,null,null,null,null,null,null,"Volume of water (gallons)"]
[]
[null,null,null,null,null,null,null,null,null,null,null,null,null,null,null,null,null,null,null,null,null,null,null,null,null,null,null,null,null,null,null,null,null,null,null,null,null,null,null,null,null,null,null,null,"Mix Ratio = ",null,null,null,null,null,null,null,{"$f":"IFERROR(IF(BA24=\"Scale\",(BA26/BA28)/8.34, IF(BA24=\"Day Tank\", BA26/BA28)),\"\")","v":""}]
[]
[null,"Reason for Adding Chemical7"]
[]
[null,null,null,null,null,null,null,null,null,null,null,null,null,null,null,null,null,null,null,null,null,null,null,null,null,null,null,null,null,null,null,null,null,null,null,null,null,null,null,null,null,null,null,null,"17gallons/inch Calculator"]
[]
[null,null,null,null,null,null,null,null,null,null,null,null,null,null,null,null,null,null,null,null,null,null,null,null,null,null,null,null,null,null,null,null,null,null,null,null,null,null,null,null,null,null,null,null,"Day Tank Diameter (feet)"]
[]
["III. Daily Reporting",null,null,null,null,null,null,null,null,null,null,null,null,null,null,null,null,null,null,null,null,null,null,null,null,null,null,null,null,null,null,null,null,null,null,null,null,null,null,null,null,null,null,null,"Day Tank Height (feet)"]
[]
[null,"Day",null,"\nTreated Water16",null,null,null,"Measured Chemical Used",null,null,null,null,null,null,null,"Calculated Chemical Used18 (lbs)",null,null,null,"Chemical Dosage19 (mg/L)",null,null,null,"Parameters Measured*, Results, Units and Method20 - (G)rab or Continuous (A)nalyzer21",null,null,null,null,null,null,null,null,null,null,null,"O&M Notes/Comments22",null,null,null,null,null,null,null,null,"gallons/inch = ",null,null,null,null,null,null,null,{"$f":"IFERROR((0.785*POWER(BA36,2)*BA38*7.48)/(BA38*12), \"\")","v":""}]
[null,null,null,null,null,null,null,null,null,null,null,null,null,null,null,null,null,null,null,null,null,null,null,null,null,null,null,null,null,null,null,null,null,null,null,"PWS note any equipment breakdown, off-line status, changes in purchased product or batch mixing day, measured parameters or dosages that are out of target range, etc. "]
[null,null,null,null,null,null,null,"Volume17 (gal/day)",null,null,null,"Weight17\n(lbs/day)",null,null,null,null,null,null,null,null,null,null,null,null,null,null,null,null,null,null,null,null,null,null,null,null,null,null,null,null,null,null,null,null,"Starting inch value"]
[null,null,null,null,null,null,null,null,null,null,null,null,null,null,null,null,null,null,null,null,null,null,null,"a. ",null,null,null,"b. ",null,null,null,"c. "]
[null,null,null,null,null,null,null,null,null,null,null,null,null,null,null,null,null,null,null,null,null,null,null,null,null,null,null,null,null,null,null,null,null,null,null,null,null,null,null,null,null,null,null,null,"Ending inch value"]
[]
[null,null,null,null,null,null,null,null,null,null,null,null,null,null,null,null,null,null,null,null,null,null,null,null,null,null,null,null,null,null,null,null,null,null,null,null,null,null,null,null,null,null,null,null,{"$f":"IFERROR(CONCATENATE(\"Gallons Used @ \", ROUND(BA40,2), \" gallons/inch = \"),\"Enter tank diameter, height, starting and ending inch values above.\")","v":"Enter tank diameter, height, starting and ending inch values above."},null,null,null,null,null,null,null,{"$f":"IFERROR((BA42-BA44)*BA40, \"\")","v":""}]
[]
[]
[]
[null,1,null,0]
[null,null,null,0]
[null,2,null,0]
[null,null,null,0]
[null,3,null,0]
[null,null,null,0]
[null,4,null,0]
[null,null,null,0]
[null,5,null,0]
[null,null,null,0]
[null,6,null,0]
[null,null,null,0]
[null,7,null,0]
[null,null,null,0]
[null,8,null,0]
[null,null,null,0]
[null,9,null,0]
[null,null,null,0]
[null,10,null,0]
[null,null,null,0]
[null,11,null,0]
[null,null,null,0]
[null,12,null,0]
[null,null,null,0]
[null,13,null,0]
[null,null,null,0]
[null,14,null,0]
[null,null,null,0]
[null,15,null,0]
[null,null,null,0]
[null,16,null,0]
{"$rows_left_out":54}
{"sheet":"DD_Lists","index":1,"n_rows":1431,"n_cols":13,"rows_kept":1431,"cut":false,"hidden":true,"merged":[]}
["Select PWS ID"," "," ",null,null,"Select Treatment Plant ID #"," "]
["1004000","ADAMS FIRE DISTRICT","ADAMS",null,"1004000","1004000-02T","CHESHIRE HARBOR WELL #2A WTP","A","ACTIVE",null,"Scale",null,"Yes"]
["1004001","DCR MT GREYLOCK STATE RESERVATION","ADAMS",null,"1004000","1004000-03T","CHESHIRE HARBOR WELL #3 WTP","A","ACTIVE",null,"Day Tank",null,"No"]
["1008000","AMHERST DPW  WATER DIVISION","AMHERST",null,"1004000","1004000-04T","CHESHIRE HARBOR WELL #4 WTP","A","ACTIVE"]
["1008006","DCR NOTCH VISITORS CENTER","AMHERST",null,"1004001","1004001-01T","BASCOM LODGE DISINFECTION SYSTEM","A","ACTIVE"]
["1015000","ATHOL DPW  WATER DIVISION","ATHOL",null,"1008000","1008000-01T","CENTENNIAL WTP  INACTIVE","A","ACTIVE",null,"JAN",2018]
["1015001","ADAMS FARM SLAUGHTERHOUSE LLC","ATHOL",null,"1008000","1008000-02T","ATKINS WTP","A","ACTIVE",null,"FEB",2019]
["1022002","THE NEON NEWT","BECKET",null,"1008000","1008000-03T","WELL #1  #2 WTP","A","ACTIVE",null,"MAR",2020]
["1022004","PAPA BOBS LLC","BECKET",null,"1008000","1008000-04T","BABY CARRIAGE BROOK WTP","A","ACTIVE",null,"APR",2021]
["1022006","CAMP WATITOH","BECKET",null,"1008000","1008000-05T","WELL #3 WTP","A","ACTIVE",null,"MAY",2022]
["1022017","CHIMNEY CORNERS CAMP","BECKET",null,"1008000","1008000-06T","WELL #5 WTP","A","ACTIVE",null,"JUN",2023]
["1022019","YMCA CAMP BECKET","BECKET",null,"1008006","1008006-01T","VISITOR CENTER DISINFECTION SYSTEM","A","ACTIVE",null,"JUL",2024]
["1022026","JACOBS PILLOW DANCE FESTIVAL","BECKET",null,"1015000","1015000-02T","SOUTH STREET WATER TREATMENT FACILITY","A","ACTIVE",null,"AUG",2025]
["1022029","LANE FARM","BECKET",null,"1015000","1015000-03T","TULLY WELLFIELD WTP","A","ACTIVE",null,"SEPT",2026]
["1022030","BECKET TOWN HALL","BECKET",null,"1015000","1015000-04T","BOOSTER PUMP STATION","A","ACTIVE",null,"OCT",2027]
["1022032","MOUNTAIN GROVE ASSOCIATION","BECKET",null,"1015000","1015000-05T","ATHOL COMMONS BOOSTER PUMP STATION","A","ACTIVE",null,"NOV",2028]
["1022033","MULLIN HOUSE","BECKET",null,"1015001","1015001-01T","TREATMENT PLANT 1","A","ACTIVE",null,"DEC",2029]
["1024000","BELCHERTOWN WATER DISTRICT","BELCHERTOWN",null,"1022002","1022002-01T","HYPOCHLORINATOR IN BASEMENT","A","ACTIVE",null,null,2030]
["1024002","PINE VALLEY PLANTATION","BELCHERTOWN",null,"1022004","1022004-01T","CHLORINATION SYSTEM","A","ACTIVE"]
["1024006","MILL VALLEY GOLF LINKS INC","BELCHERTOWN",null,"1022006","1022006-01T","CHLORINATOR","A","ACTIVE"]
["1024013","COLD SPRING COUNTRY CLUB","BELCHERTOWN",null,"1022017","1022017-01T","ADMINISTRATION BLDG","A","ACTIVE"]
["1029000","BERNARDSTON FIRE  WATER DIST","BERNARDSTON",null,"1022017","1022017-02T","INA GIBSON BLDG","A","ACTIVE"]
["1033000","BLANDFORD WATER DEPT","BLANDFORD",null,"1022017","1022017-03T","DINING HALL","A","ACTIVE"]
["1043011","HITCHCOCK FREE ACADEMY","BRIMFIELD",null,"1022019","1022019-01T","INFIRMARY WELL DISINFECTION SYSTEM","A","ACTIVE"]
["1043018","HARRINGTON PHYSICIAN SERVICES","BRIMFIELD",null,"1022026","1022026-01T","CHLORINATION WELL 1 HUNTER HS","A","ACTIVE"]
["1043027","MK FUEL INC","BRIMFIELD",null,"1022026","1022026-02T","CHLORINATION WELL 2 SYSTEM A (HUNTER)","A","ACTIVE"]
["1053027","CHARLEMONT 4FAMILY STORE","CHARLEMONT",null,"1022026","1022026-03T","CHLORINATION WELL NO 2 SYSTEM B (DUKE)","A","ACTIVE"]
["1053029","THE HINATA RETREAT LLC","CHARLEMONT",null,"1022026","1022026-04T","INTERN CABIN A HYPOCHLORINATOR","A","ACTIVE"]
["1058000","CHESHIRE WATER DEPT","CHESHIRE",null,"1022029","1022029-01T","LANE FARM DISINFECTION SYSTEM","A","ACTIVE"]
["1059000","CHESTER WATER DEPT","CHESTER",null,"1022030","1022030-01T","SOFTENER 1","A","ACTIVE"]
["1059012","CHESTER / MIDDLEFIELD ELEM SCHOOL","CHESTER",null,"1022032","1022032-01T","ULTRAVIOLET DISINFECTION UNIT","A","ACTIVE"]
["1060006","HILLTOWN COMMUNITY DEVELOPMENT CORP","CHESTERFIELD",null,"1022033","1022033-01T","CHLORINATOR","A","ACTIVE"]
["1061000","CHICOPEE WATER DEPT (MWRA)","CHICOPEE",null,"1024000","1024000-01T","JABISH BROOK PUMP HOUSE","A","ACTIVE"]
["1061003","WESTOVER ARB","CHICOPEE",null,"1024000","1024000-02T","DAIGLE WELL WTP","A","ACTIVE"]
["1061004","PRIMO WATER @ WAL MART SUPER CTR #5278","CHICOPEE",null,"1024002","1024002-01T","SODIUM HYPOCHLORITE DISINFECTION SYSTEM","A","ACTIVE"]
["1063003","BRIGGSVILLE WATER DISTRICT","CLARKSBURG",null,"1024006","1024006-01T","WELL NO. 2 CHLORINATION","A","ACTIVE"]
["1063009","DCR CLARKSBURG STATE FOREST","CLARKSBURG",null,"1024013","1024013-01T","UV SYSTEM #1","A","ACTIVE"]
["1066005","PINE HILL ORCHARDS","COLRAIN",null,"1024013","1024013-02T","UV SYSTEM #2","A","ACTIVE"]
["1068003","BAKERS COUNTRY STORE","CONWAY",null,"1029000","1029000-02T","SUGAR HOUSE WELL WTP","A","ACTIVE"]
["1069001","CUMMINGTON WATER DEPT","CUMMINGTON",null,"1033000","1033000-02T","LOND POND FILTRATION PLANT","A","ACTIVE"]
["1069002","WEST CUMMINGTON WATER DEPT","CUMMINGTON",null,"1043011","1043011-01T","CHLORINATION SYSTEM","A","ACTIVE"]
["1069003","SWIFT RIVER","CUMMINGTON",null,"1043018","1043018-01T","ION EXCHANGE","A","ACTIVE"]
["1069007","GREENWOOD MUSIC CAMP","CUMMINGTON",null,"1043027","1043027-01T","SOFTENER 1","A","ACTIVE"]
["1070000","DALTON FIRE DISTRICT","DALTON",null,"1053027","1053027-01T","4 LOG HYPOCHLORINATOR","A","ACTIVE"]
["1074000","DEERFIELD FIRE DISTRICT","DEERFIELD",null,"1053029","1053029-01T","CHLORINATION DISINFECTION","A","ACTIVE"]
["1074001","SOUTH DEERFIELD WATER SUPPLY DISTRICT","SOUTH DEERFIELD",null,"1058000","1058000-01T","PUMP HOUSE BUILDING, WTP","A","ACTIVE"]
["1085000","EAST LONGMEADOW DPW WATER DEPT","EAST LONGMEADOW",null,"1059000","1059000-01T","AUSTIN BROOK WTP","A","ACTIVE"]
["1087000","EASTHAMPTON WATER DEPT","EASTHAMPTON",null,"1059012","1059012-01T","WATER SOFTENER","A","ACTIVE"]
["1087002","RIVER VALLEY MARKET EASTHAMPTON","EASTHAMPTON",null,"1060006","1060006-01T","HILLTOWN COMMUNITY DEVELOPMENT CORP","A","ACTIVE"]
["1090000","EGREMONT WATER DEPT","SOUTH EGREMONT",null,"1061000","1061000-01T","CHICOPEE WTP","A","ACTIVE"]
["1090008","GUILDER HILLS HOMEOWNERS ASSOCIATION","SOUTH EGREMONT",null,"1061000","1061000-02T","CORROSION CONTROL FACILITY","A","ACTIVE"]
["1090012","HILLTOWN HOT PIES LLC","SOUTH EGREMONT",null,"1061003","1061003-01T","BLDG 8840 UV TREATMENT","A","ACTIVE"]
["1090014","NORTH  EGREMONT COUNTRY STORE INC","NORTH EGREMONT",null,"1061003","1061003-02T","BLDG 8842 UV TREATMENT","A","ACTIVE"]
["1090018","EGREMONT TOWN HALL","SOUTH EGREMONT",null,"1061003","1061003-03T","MIOX TREATMENT AT BLDG 7980","A","ACTIVE"]
["1091000","ERVING WATER DEPT","ERVING",null,"1061004","1061004-01T","VENDING MACHINE","A","ACTIVE"]
["1098009","MANICE EDUCATION CENTER","FLORIDA",null,"1063003","1063003-01T","SPRING CHLORINATOR","A","ACTIVE"]
["1106002","NORTHFIELD MT HERMON SCHOOL","GILL",null,"1063009","1063009-01T","NEW COMFORT STATION","A","ACTIVE"]
["1106004","GILL ELEMENTARY SCHOOL","GILL",null,"1066005","1066005-01T","DISINFECTION","A","ACTIVE"]
["1106006","BARTON COVE CAMPGROUND","GILL",null,"1068003","1068003-01T","UV UNIT","A","ACTIVE"]
["1108009","WILDWOOD CONDOMINIUM","GOSHEN",null,"1069001","1069001-01T","CORROSION CONTROL FACILITY","A","ACTIVE"]
["1111001","THE MACDUFFIE SCHOOL","GRANBY",null,"1069002","1069002-01T","CORROSION CONTROL FACILITY","A","ACTIVE"]
["1111002","GRANBY HOUSING AUTHORITY","GRANBY",null,"1069003","1069003-01T","WELL #1 CHLORINATOR","A","ACTIVE"]
["1111020","CINDYS DRIVE IN","GRANBY",null,"1069007","1069007-01T","WELL NO 3 CHLORINATION","A","ACTIVE"]
["1111029","PIZZA PALACE","GRANBY",null,"1070000","1070000-03T","WAHCONAH FALLS WELL","A","ACTIVE"]
["1111032","CHATEAU HARMONY","GRANBY",null,"1070000","1070000-04T","RESERVOIR RD TANK BOOSTER CHLORINATION","A","ACTIVE"]
["1111033","CUMBERLAND FARMS #2403","GRANBY",null,"1070000","1070000-05T","PINECREST DRIVE BOOSTER CHLORINATION","A","ACTIVE"]
["1111040","GRANBY COUNCIL OF AGING","GRANBY",null,"1074000","1074000-01T","STILLWATER PUMP STATION WTP","A","ACTIVE"]
["1111041","GRANBY PUBLIC SAFETY COMPLEX","GRANBY",null,"1074000","1074000-02T","KEATS SPRING WTP","A","ACTIVE"]
["1111043","SUBWAY GRANBY","GRANBY",null,"1074001","1074001-01T","ROARING BROOK RESERVOIR TRTMNT FACILITY","A","ACTIVE"]
["1112003","PROSPECT MOUNTAIN CAMPGROUND","GRANVILLE",null,"1085000","1085000-01T","CHESTNUT STREET PUMP STATION","A","ACTIVE"]
["1113000","GREAT BARRINGTON FIRE DIST","GREAT BARRINGTON",null,"1087000","1087000-01T","HENDRICK STREET WTP","A","ACTIVE"]
["1113003","HOUSATONIC WATER WORKS","GREAT BARRINGTON",null,"1087002","1087002-01T","VENDING MACHINE UV TREATMENT","A","ACTIVE"]
["1113006","BUTTERNUT BASIN INC","GREAT BARRINGTON",null,"1090000","1090000-01T","KARNER BROOK WTP","A","ACTIVE"]
["1113013","BERKSHIRE WALDORF SCHOOL","GREAT BARRINGTON",null,"1090008","1090008-01T","GUILDER HILLS UV DISINFECTION","A","ACTIVE"]
["1113016","MONUMENT MTN REGIONAL HS","GREAT BARRINGTON",null,"1090012","1090012-01T","SOFTENER 1","A","ACTIVE"]
["1113028","AMERICAN INSTITUTE FOR ECONOMIC RESEARCH","GREAT BARRINGTON",null,"1090012","1090012-02T","4 LOG DISINFECTION","A","ACTIVE"]
["1113030","FIDDLEHEAD GRILL","GREAT BARRINGTON",null,"1090014","1090014-02T","4_LOG INACTIVATION CHLORINATOR AND SOFTE","A","ACTIVE"]
["1113033","BERKSHIRE COOP MARKET","GREAT BARRINGTON",null,"1090018","1090018-01T","PARTICULATE FILTRATION CARTIDGE","A","ACTIVE"]
["1114000","GREENFIELD WATER DEPARTMENT","GREENFIELD",null,"1090018","1090018-02T","SOFTENER 1","A","ACTIVE"]
["1117002","HADLEY DPW WATER DIVISION","HADLEY",null,"1090018","1090018-03T","ULTRA VIOLET DISINFECTION UNIT","A","ACTIVE"]
{"$rows_left_out":1351}