{"text_format":"1","workbook":"xlsx","n_sheets":11,"sheets":["Instructions","Inputs","Input Summary","Results Table","Results Graphics","Appendix - Default Values","Appendix - Electric DF Values","Results Graphs","Original Calculator","Appendix - Gas DF Values","Appendix - Economic Model Data"],"not_rendered":{"charts":11,"images":0,"macros":1,"external_links":1,"defined_names":15,"comments":4,"pivot_tables":0},"unopened":[],"bounds":{"document_bytes":16777216,"sheet_cells":100000,"rows_first":2000,"rows_last":500,"rows_between":2000,"halvings":0,"cell_chars":16384,"cell_head_chars":4096},"cells_cut":0,"cells_raw":0,"read":"whole","date_system":"1900"}

{"sheet":"Instructions","index":0,"n_rows":37,"n_cols":6,"rows_kept":37,"cut":false,"hidden":false,"merged":[[36,0,36,12],[33,0,33,4],[2,0,2,12],[3,0,21,12],[0,0,0,12],[22,0,22,12],[30,0,30,12],[31,0,31,4],[32,0,32,4],[28,0,28,12],[29,0,29,12],[24,1,24,12],[23,1,23,12],[35,0,35,4],[35,5,35,12],[25,1,25,12],[26,1,26,12],[27,0,27,12],[34,0,34,4],[32,5,32,12],[31,5,31,12],[33,5,33,12],[34,5,34,12]]}
["Commercial Battery-Powered Electric Lawn and Garden Equipment Calculator"]
["Calculator last updated:","2023-09-12"]
["Background"]
["Statewide contract FAC116: Lawns & Grounds, Equipment, Parts and Services includes environmentally prefererable products under Category 8: Commercial Grade Battery-Electric Lawn Equipment. As Massachusetts advances the use of clean, renewable sources for electricity generation, converting from gas to electric power for landscaping can provide numerous benefits, including those outlined below:                                                                     \nEnvironmental benefits:\n• Helping the Commonwealth meet its environmental goals in greenhouse gas emissions reduction, clean air, and toxics use reduction\n• Reduction in toxic exposure and criteria air pollutants (particulate matter, sulfur dioxide, carbon monoxide)                                                                                                                                                                                                                                                             • Reduction in hazardous waste and potential spills                                                                                                                                                                                                                                                      • Reduction in noise pollution and nuisance complaints\n• Reduction in wildlife and habitat exposure to toxic emissions, excessive noise, and ground-sourced particulates\nHealth benefits:\n• Reduction in worker exposures to toxic emissions, excessive noise, excessive vibrations, and ground-sourced particulates\n• Reduction in public exposure to toxic emissions, excessive noise, and ground-sourced particulates\nCost benefits:\n• Avoided fuel costs\n• Lower maintenance costs\n• The possibility for extended work hour options and holiday operation due to lower noise levels\n\nThis calculator provides economic and environmental models for users to better understand the total cost of ownership of battery-powered landscaping equipment compared to gas alternatives, as well as the estimated greenhouse gas emissions savings associated with converting from gas to electric."]
[]
[]
[]
[]
[]
[]
{"$rows_left_out":28}
{"sheet":"Inputs","index":1,"n_rows":28,"n_cols":18,"rows_kept":28,"cut":false,"hidden":false,"merged":[[1,1,1,16],[0,1,0,16],[4,3,4,5],[4,13,4,15],[5,2,5,3],[5,12,5,13],[6,12,6,15],[6,2,6,5],[17,12,17,15],[13,7,13,8],[10,3,10,4],[12,3,12,4],[10,13,10,14],[15,7,16,9],[8,12,9,12],[8,13,9,13],[8,14,9,14],[14,2,14,5],[17,2,17,5],[11,3,11,4],[11,13,11,14],[14,12,14,15],[14,17,17,18],[8,8,12,9],[12,12,13,15],[24,3,24,4],[24,13,24,14],[19,12,19,15],[23,12,23,15],[19,2,19,5],[23,2,23,5],[20,3,20,4],[21,3,21,4],[22,3,22,4]]}
[null,"Economic and Environmental Calculator Inputs"]
[null,"This tool is provided to generate estimates only, the Commonwealth makes no guarantees about equipment savings or years of equipment performance"]
[null,null,null,null,null,null,null,"Step 1","Select Equipment","Riding Zero-Turn Mower 42\""]
[]
[null,null,"Step 2","Select \"Yes\" for each area to use default values for battery-powered equipment option. \nSelect \"No\" to input your own values in Column F.",null,null,null,null,null,null,null,null,"Step 3","Select \"Yes\" for each area to use default values for commercial gasoline equipment option. \nSelect \"No\" to input your own values in Column P."]
[]
[null,null,"Commercial Battery-Powered",null,null,null,null,null,null,null,null,null,"ICE"]
[null,null,null,"Default Data","Use Default Data?","Input (if Default not used)",null,null,null,null,null,null,null,"Default Data","Use Default Data?","Input (if Default not used)"]
[null,null,"Price of Equipment",{"$f":"IFERROR(VLOOKUP(J3,'Appendix - Default Values'!A:AB,2,FALSE),\"\")","v":5899},"Yes",null,null,null,"NOTE: Default values are based on average costs of equipment on and off statewide contracts. Agencies are encouraged to use actual values wherever possible.",null,null,null,"Price of equipment",{"$f":"IFERROR(VLOOKUP(J3,'Appendix - Default Values'!A:AB,13,FALSE),\"\")","v":3900},"Yes"]
[null,null,"Mass Save Rebate*",{"$f":"IFERROR(VLOOKUP(J3,'Appendix - Default Values'!A:AB,4,FALSE),\"\")","v":75},"Yes"]
{"$rows_left_out":19}
{"sheet":"Input Summary","index":2,"n_rows":21,"n_cols":6,"rows_kept":21,"cut":false,"hidden":false,"merged":[[14,1,14,2],[19,1,19,2],[1,1,1,2],[1,4,1,5],[3,4,3,5],[8,1,8,2],[12,1,12,2]]}
[]
[null,"BPLE",null,null,"ICE"]
[null,"Price of Equipment",{"$f":"IF(Inputs!E9=\"Yes\",Inputs!D9,Inputs!F9)","v":5899},null,"Price of equipment",{"$f":"IF(Inputs!O9=\"Yes\",Inputs!N9,Inputs!P9)","v":3900}]
[null,"Total Battery Cost",{"$f":"(IF(Inputs!E14=\"Yes\",Inputs!D14,Inputs!F14))*Inputs!F13","v":0}]
[null,"Sub total",{"$f":"C3+C4","v":5899},null,"Sub total",{"$f":"F3","v":3900}]
[null,"Prompt Pay Discount",{"$f":"Inputs!F11","v":0},null,"Prompt pay discount (PPD)",{"$f":"Inputs!P11","v":0}]
[null,"Rebate",{"$f":"IF(Inputs!E10=\"Yes\",Inputs!D10,Inputs!F10)","v":75}]
[null,"Total Cost with PPD and Rebate",{"$f":"C5-(C5*C6)-C7","v":5824},null,"Total Cost with PPD",{"$f":"F5-(F5*F6)","v":3900}]
[null,"Equipment Specifications",null,null,"Equipment Specifications"]
[null,"Battery size (kWh)",{"$f":"IF(Inputs!E16=\"Yes\",Inputs!D16,Inputs!F16)","v":3.36},null,"Horsepower",{"$f":"IF(Inputs!O16=\"Yes\",Inputs!N16,Inputs!P16)","v":23}]
{"$rows_left_out":12}
{"sheet":"Results Table","index":3,"n_rows":18,"n_cols":11,"rows_kept":18,"cut":false,"hidden":false,"merged":[[5,1,7,1],[5,10,7,10],[5,5,7,5],[12,9,12,10],[12,5,12,7],[12,1,12,3],[0,1,0,10],[9,1,11,1],[9,2,11,2],[9,3,11,3],[9,5,11,5],[9,6,11,6],[9,7,11,7],[4,1,4,2],[3,1,3,3],[3,5,3,7],[4,5,4,6],[5,9,7,9],[3,9,3,10]]}
[null,"Results Table"]
[]
[]
[null,"ICE Equipment Costs",null,null,null,"BPLE Costs",null,null,null,"Savings by Converting to BPLE"]
[null,"Initial Equipment Cost\n(Including any discounts and rebates included in Input)",null,{"$f":"IFERROR('Input Summary'!F8,\"-\")","v":3900},null,"Initial Equipment Cost\n(Including any discounts and rebates included in Input)",null,{"$f":"IFERROR('Input Summary'!C8,\"-\")","v":5824},null,"Upfront Equipment Cost Savings",{"$f":"IFERROR(D5-H5,\"-\")","v":-1924}]
[null,"Hourly Cost","Hourly Fuel Cost",{"$f":"IFERROR('Input Summary'!F11*'Input Summary'!F14,\"-\")","v":6.76},null,"Hourly Costs","Hourly Fuel Cost",{"$f":"IFERROR('Input Summary'!C12*'Input Summary'!C14,\"-\")","v":0.59246879999999991},null,"Hourly Cost Savings",{"$f":"IFERROR(D8-H8,\"-\")","v":7.2988511300699308}]
[null,null,"Hourly Maintenance Cost*",{"$f":"IFERROR('Appendix - Economic Model Data'!I18,\"-\")","v":1.737089160839161},null,null,"Hourly Maintenance Cost*",{"$f":"IFERROR('Appendix - Economic Model Data'!B18,\"-\")","v":0.60576923076923084}]
[null,null,"Total Hourly Cost",{"$f":"IFERROR(+D6+D7,\"-\")","v":8.4970891608391614},null,null,"Total Hourly Cost",{"$f":"IFERROR((+H6+H7),\"-\")","v":1.1982380307692306}]
[null,"Annual Cost","Annual operating costs",{"$f":"IFERROR(+D8*'Input Summary'!F19,\"-\")","v":6117.9041958041962},null,"Annual Cost","Annual operating costs",{"$f":"IFERROR(+H8*'Input Summary'!C19,\"-\")","v":862.73138215384608},null,"Annual Cost Savings",{"$f":"IFERROR(D9-H9,\"-\")","v":5255.1728136503498}]
[null,"Lifetime","Total operating costs over warranty period",{"$f":"IFERROR(D9*'Input Summary'!F21,\"-\")","v":18353.712587412589},null,"Lifetime","Total operating costs over warranty period",{"$f":"IFERROR(H9*'Input Summary'!C21,\"-\")","v":2588.1941464615384},null,"Total Operating Cost Savings over Warranty Period",{"$f":"IFERROR(D10-H10,\"-\")","v":15765.518440951051}]
{"$rows_left_out":9}
{"sheet":"Results Graphics","index":4,"n_rows":61,"n_cols":11,"rows_kept":61,"cut":false,"hidden":false,"merged":[[60,1,60,2],[57,1,57,2],[56,1,56,9],[2,1,3,10],[41,1,42,10],[44,1,44,2],[45,1,46,2],[47,1,47,2],[5,1,8,3],[9,2,9,3],[10,2,10,3],[11,2,11,3],[12,2,12,3],[13,2,13,3],[14,2,14,3],[15,2,15,3],[0,1,0,10],[45,3,46,3],[20,1,20,10],[58,1,58,2],[59,1,59,2],[16,2,16,3],[17,2,17,3],[18,2,18,3]]}
[null,"Results Graphics"]
[]
[null,"ICE to BPLE: Cost Savings"]
[]
[]
[null,"Estimated Battery-Powered Electric Equipment Cummulative Cost Benefit"]
[]
[]
[]
[null,{"$f":"'Appendix - Economic Model Data'!B43","v":"Year 1"},{"$f":"'Appendix - Economic Model Data'!C43","v":3331.1728136503498}]
{"$rows_left_out":52}
{"sheet":"Appendix - Default Values","index":5,"n_rows":163,"n_cols":22,"rows_kept":163,"cut":false,"hidden":false,"merged":[]}
["Equipment","Price of BPLE","Battery cost","Mass Save Rebate","Optional add-ons & extra costs","Prompt pay discount (PPD)","Battery size (kWh) Total Machine Battery","Number of batteries","Efficiency/charging loss",null,"Length of warranty (years)","Estimated battery lifetime hours*","Price of Gas Equipment","Gas Equipment Horsepower","Gallons of Gas Per Hour","Gas Equip Warranty",null,null,null,null,"BPLE Example Source","ICE Example Source"]
["Riding Zero-Turn Mower 42\"",5899,null,75,0,null,3.36,2,0.1,null,3,null,3900,23,2,3,null,null,null,null,"https://www.cubcadet.com/en_US/electric-riding-mowers/zt1-42e/34CBA2CS710.html","https://www.stihlusa.com/products/lawn-mowers/zero-turn-mowers/rz142/"]
["Riding Zero-Turn Mower 48\"",27000,null,3500,null,null,24,1,0.1,null,5,null,10719,23.5,2,4,null,null,null,null,"https://commercial.greenworkstools.com/collections/optimus/products/cz48r24x-optimusz-48-24kwh-ride-on-zero-turn-mower","https://www.deere.com/en/mowers/zero-turn-mowers/z700-series/z740r-ztrak-mower/"]
["Riding Zero-Turn Mower 52\"",27000,null,3500,null,null,24,1,0.1,null,4,null,11999,25.5,2,5,null,null,null,null,"https://commercial.greenworkstools.com/collections/optimus/products/cz52r24x-optimusz-52-24kwh-ride-on-zero-turn-mower","https://www.toro.com/en/product/74050"]
["Riding Zero-Turn Mower 60\"",32959,null,3500,null,null,16,4,0.1,null,5,null,14409,25.5,2,5,null,null,null,null,"https://www.gravely.com/en-us/power-equipment/electric/pro-turn-ev/pro-turn-ev60-rd-w-4-batteries ","https://www.deere.com/en/mowers/commercial-mowers/commercial-zero-turn/z900-series/z930m-mower/"]
["Riding Zero-Turn Mower 72-74\"",49940,null,3500,null,null,22,1,0.1,null,5,null,17999,26.5,2,5,null,null,null,null,"https://meangreenproducts.com/evo-74-ztr/","https://www.toro.com/en/product/72922"]
["Stand-on Mower 48\"",32667,null,3500,null,null,16,4,0.1,null,5,null,12199,22,2,5,null,null,null,null,"https://www.gravely.com/en-us/power-equipment/electric/pro-stance-ev/prostance-ev-48sd-w-4batteries","https://www.toro.com/en/product/71504"]
["Stand-on Mower 52\"",32893,null,3500,null,null,16,4,0.1,null,5,null,12959,23.5,2,2,null,null,null,null,"https://www.gravely.com/en-us/power-equipment/electric/pro-stance-ev/prostance-ev-52sd-w-4batteries","https://www.deere.com/en/mowers/commercial-mowers/quiktrak-mowers/652r-mower/?cid=PPC_MDS_00331_01373&gad=1&gclid=Cj0KCQjwzdOlBhCNARIsAPMwjbzFcobF_BobkqBqHZYWQdkmdcgyBgLfoN-lJYJdm5zS-AO15SGWiGcaApvLEALw_wcB&gclsrc=aw.ds"]
["Stand-on Mower 60\"",26000,null,3500,null,null,24,1,0.1,null,5,null,14399,26.5,2,5,null,null,null,null,"https://commercial.greenworkstools.com/collections/optimus/products/cz60s24x-optimusz-60-24kwh-stand-on-zero-turn-mower","https://www.toro.com/en/product/72523"]
["Push-Mower 30-32\"",2999,494,75,null,null,1.3440000000000001,3,0.1,null,2,null,3599,14.5,0.75,1,null,null,null,null,"https://commercial.greenworkstools.com/products/82v-30-self-propelled-lawn-mower-with-3-8ah-batteries-and-dual-port-charger-82lm30s-83dp_","https://www.toro.com/en/product/30672"]
{"$rows_left_out":154}
{"sheet":"Appendix - Electric DF Values","index":6,"n_rows":188,"n_cols":23,"rows_kept":188,"cut":false,"hidden":true,"merged":[]}
["Product","Manufacturer","Name","SKU/model number","Blade size (mowers)","Zero Turn?","Air Volume (cfm) (blowers)","Bar Length (in) (chain saws)","Blade Length (in) (trimmers)","Cutting Path (in) (string trimmers and edgers)","Engine Capacity (cc)","Included batteries","Built In or Swappable Batteries","Cost","Extra battery cost","Battery Voltage","Battery Ah","Total Machine Battery kWh","Commercial (Mass Save Rebate)","Source","Price Source:","Battery Price Source:","Notes/additional sources"]
["Ride-On Mower","Gravely","Pro-Turn EV ","997005 / 997008","48\"","Yes",null,null,null,null,null,4,"Swappable Batteries",32667,null,null,null,16,"Yes","https://www.gravely.com/en-us/power-equipment/electric/pro-turn-ev/pro-turn-ev48-rd-w-4-batteries",null,null,"Side / Rear Discharge"]
["Ride-On Mower","Gravely","Pro-Turn EV ","997006 / 997009 ","52\"","Yes",null,null,null,null,null,4,"Swappable Batteries",32893,null,null,null,16,"Yes","https://www.gravely.com/en-us/power-equipment/electric/pro-turn-ev/pro-turn-ev52-sd-w-4-batteries",null,null,"Side / Rear Discharge"]
["Ride-On Mower","Gravely","Pro-Turn EV ","997007 / 997010","60\"","Yes",null,null,null,null,null,4,"Swappable Batteries",32959,null,null,null,16,"Yes","https://www.gravely.com/en-us/power-equipment/electric/pro-turn-ev/pro-turn-ev60-rd-w-4-batteries ",null,null,"Side / Rear Discharge"]
["Ride-On Mower","Toro","Z Master Revolution",18748,"48\"","Yes",null,null,null,null,null,10,null,"$38,999 *dependent on dealer",null,null,null,23.4,"Yes","https://www.toro.com/en/product/18748#specifications","https://www.arcolawn.com/products/revolution-series-48-18748#:~:text=Toro%20SKU%3A,TOR-18748%20Price%3A%20%2438%2C999.00"]
["Ride-On Mower","Toro","Z Master Revolution",18752,"52\"","Yes",null,null,null,null,null,10,null,"$39,499 *dependent on dealer",null,null,null,23.4,"Yes","https://www.toro.com/en/product/18752#specifications","https://www.arcolawn.com/products/revolution-series-52-18752"]
["Ride-On Mower","Toro","Z Master Revolution",18760,"60\"","Yes",null,null,null,null,null,10,null,"$41,239 *dependent on dealer",null,null,null,23.4,"Yes","https://www.toro.com/en/product/18760#specifications","https://www.arcolawn.com/products/revolution-series-60-18760"]
["Ride-On Mower","Toro","Z Master Revolution MyRide",18765,"60\"","Yes",null,null,null,null,null,10,null,"*requires call for price, multiple vendors",null,null,null,23.4,"Yes","https://www.toro.com/en/product/18765#specifications"]
["Ride-On Mower","Greenworks","OptimusZ Ride-On Zero-Turn","7414602 (CZ48R24X)","48\"","Yes",null,null,null,null,null,1,"Built in battery",26999.99,null,null,null,24,"Yes","https://commercial.greenworkstools.com/collections/optimus/products/cz48r24x-optimusz-48-24kwh-ride-on-zero-turn-mower"]
["Ride-On Mower","Greenworks","OptimusZ Ride-On Zero-Turn","7411502 (CZ52R24X)","52\"","Yes",null,null,null,null,null,1,"Built in battery",26999.99,null,null,null,24,"Yes","https://commercial.greenworkstools.com/collections/optimus/products/cz52r24x-optimusz-52-24kwh-ride-on-zero-turn-mower"]
{"$rows_left_out":179}
{"sheet":"Results Graphs","index":7,"n_rows":103,"n_cols":13,"rows_kept":103,"cut":false,"hidden":true,"merged":[[12,3,12,8],[0,0,0,12],[1,0,1,12],[2,0,2,1],[2,11,2,12],[3,0,3,1],[3,2,3,10],[3,11,3,12],[4,0,4,1],[4,11,4,12],[10,0,10,1],[10,11,10,12],[11,5,11,7],[25,0,25,1],[25,11,25,12],[13,3,14,8],[13,9,14,9],[14,0,14,1],[14,11,14,12],[15,3,15,8],[16,11,17,12],[17,0,17,1],[17,2,17,10],[18,5,18,7],[21,0,21,1],[21,11,21,12],[23,0,23,1],[23,11,23,12],[71,7,71,8],[28,11,28,12],[58,6,61,8],[62,7,62,8],[63,7,63,8],[64,7,64,8],[65,7,65,8],[66,7,66,8],[67,7,67,8],[68,7,68,8],[69,7,69,8],[70,7,70,8],[102,0,102,4],[94,5,95,6],[94,8,95,9],[98,0,98,12],[99,0,99,4],[100,0,100,4],[101,0,101,4]]}
["Economic and Environmental Calculator"]
["This tool is provided to generate estimates only, the Commonwealth makes no guarantees about equipment savings or years of equipment performance"]
["User Input Data: Red Text Below",null,null,null,null,null,null,null,null,null,null,"User Input Data: Red Text Below"]
["Commercial Battery-Powered",null,"ENVIRONMENTAL RESULTS",null,null,null,null,null,null,null,null,"Commercial Gasoline"]
["Equipment Costs",null,null,null,null,null,null,null,null,null,null,"Equipment Costs"]
["Price of equipment",15000,null,null,null,null,null,null,null,null,null,"Price of equipment",750]
["(If applicable) Additional battery cost",0,null,null,null,null,null,null,null,null,null,"(If applicable) Additional gas can cost",0]
["Number of additional batteries",0,null,null,null,null,null,null,null,null,null,"Number of additional gas cans",0]
["Optional add-ons & extra costs",0,null,null,null,null,null,null,null,null,null,"Optional add-ons & extra costs",0]
["Prompt pay discount (PPD)",0.01,null,null,null,null,null,null,null,null,null,"Prompt pay discount (PPD)",0.01]
{"$rows_left_out":94}
{"sheet":"Original Calculator","index":8,"n_rows":103,"n_cols":13,"rows_kept":103,"cut":false,"hidden":true,"merged":[[102,0,102,4],[101,0,101,4],[23,11,23,12],[23,0,23,1],[99,0,99,4],[100,0,100,4],[28,11,28,12],[25,0,25,1],[25,11,25,12],[66,7,66,8],[62,7,62,8],[69,7,69,8],[70,7,70,8],[71,7,71,8],[58,6,61,8],[63,7,63,8],[64,7,64,8],[98,0,98,12],[21,0,21,1],[21,11,21,12],[65,7,65,8],[67,7,67,8],[68,7,68,8],[94,5,95,6],[94,8,95,9],[18,5,18,7],[0,0,0,12],[2,0,2,1],[2,11,2,12],[3,0,3,1],[3,11,3,12],[1,0,1,12],[3,2,3,10],[10,0,10,1],[17,2,17,10],[10,11,10,12],[16,11,17,12],[12,3,12,8],[13,3,14,8],[15,3,15,8],[11,5,11,7],[4,0,4,1],[4,11,4,12],[14,0,14,1],[17,0,17,1],[14,11,14,12],[13,9,14,9]]}
["Economic and Environmental Calculator"]
["This tool is provided to generate estimates only, the Commonwealth makes no guarantees about equipment savings or years of equipment performance"]
["User Input Data: Red Text Below",null,null,null,null,null,null,null,null,null,null,"User Input Data: Red Text Below"]
["Commercial Battery-Powered",null,"ENVIRONMENTAL RESULTS",null,null,null,null,null,null,null,null,"Commercial Gasoline"]
["Equipment Costs",null,null,null,null,null,null,null,null,null,null,"Equipment Costs"]
["Price of equipment",5000,null,null,null,null,null,null,null,null,null,"Price of equipment",750]
["(If applicable) Additional battery cost",0,null,null,null,null,null,null,null,null,null,"(If applicable) Additional gas can cost",0]
["Number of additional batteries",0,null,null,null,null,null,null,null,null,null,"Number of additional gas cans",0]
["Optional add-ons & extra costs",0,null,null,null,null,null,null,null,null,null,"Optional add-ons & extra costs",0]
["Prompt pay discount (PPD)",0.01,null,null,null,null,null,null,null,null,null,"Prompt pay discount (PPD)",0.01]
{"$rows_left_out":94}
{"sheet":"Appendix - Gas DF Values","index":9,"n_rows":328,"n_cols":20,"rows_kept":328,"cut":false,"hidden":false,"merged":[]}
["Product","Manufacturer","Name","SKU/model number","Blade size (mowers)","Zero Turn?","Air Volume (cubic ft/min)","Bar Length (in)","Cutting Width ","Blade Length ","Cost","Horsepower","Fuel Capacity (gal)","Fuel Capacity (oz)","MPH","Displacement ","Gallons of gas used per hour","Source","Price Source","Additional Notes"]
["Riding Mower","Stihl","RZ 152","RZ 152",52,"Yes",null,null,null,null,5649.99,25,3,null,8,724,null,"https://www.stihlusa.com/products/lawn-mowers/zero-turn-mowers/rz152/"]
["Riding Mower","Stihl","RZ 142","RZ 142",42,"Yes",null,null,null,null,3899.99,23,3,null,7,724,null,"https://www.stihlusa.com/products/lawn-mowers/zero-turn-mowers/rz142/"]
["Riding Mower","Stihl","RZ 552","RZ 552",52,"Yes",null,null,null,null,9949.99,24,5.5,null,10,null,null,"https://www.stihlusa.com/products/lawn-mowers/zero-turn-mowers/rz500series/#specifications"]
["Riding Mower","Stihl","RZ 552 K ","RZ 552 K",52,"Yes",null,null,null,null,10449.99,24,5.5,null,10,null,null,"https://www.stihlusa.com/products/lawn-mowers/zero-turn-mowers/rz500series/#specifications"]
["Riding Mower","Stihl","RZ 560","RZ 561",60,"Yes",null,null,null,null,10499.99,24,5.5,null,10,null,null,"https://www.stihlusa.com/products/lawn-mowers/zero-turn-mowers/rz500series/#specifications"]
["Riding Mower","Stihl","RZ 560 K ","RZ 560 K ",60,"Yes",null,null,null,null,10999.99,24,5.5,null,10,null,null,"https://www.stihlusa.com/products/lawn-mowers/zero-turn-mowers/rz500series/#specifications"]
["Riding Mower","Stihl","RZ 960i","RZ 960i",60,"Yes",null,null,null,null,17899.990000000002,null,null,null,12,null,null,"https://www.stihlusa.com/products/lawn-mowers/zero-turn-mowers/rz900series/"]
["Riding Mower","Stihl","RZ 960 K","RZ 960 K",60,"Yes",null,null,null,null,17899.990000000002,null,null,null,12,null,null,"https://www.stihlusa.com/products/lawn-mowers/zero-turn-mowers/rz900series/"]
["Riding Mower","Stihl","RZ 960i K ","RZ 960i K ",60,"Yes",null,null,null,null,18199.990000000002,null,null,null,12,null,null,"https://www.stihlusa.com/products/lawn-mowers/zero-turn-mowers/rz900series/"]
{"$rows_left_out":319}
{"sheet":"Appendix - Economic Model Data","index":10,"n_rows":127,"n_cols":15,"rows_kept":127,"cut":false,"hidden":false,"merged":[[94,0,94,12],[24,0,26,12],[0,0,0,12],[24,14,24,16]]}
["APPENDIX: Reference Data"]
["Maintenance Costs Reference Calculations for Economic Model"]
["Commercial Electric",null,null,null,null,null,null,"Commercial Gasoline"]
[null,null,null,null,null,null,null,null,"Frequency (per # hours)","Hours of Mowing","Times","$ Per","Cost per Year"]
["Electric",null,null,null,null,null,null,"Oil change and oil filter every 50 hrs",50,880,{"$f":"+J5/I5","v":17.600000000000001},20,{"$f":"+K5*L5","v":352}]
[null,"Frequency (per # hours)","Hours of Mowing","Times","$ Per","Cost per Year",null,"Air filter change every 100 hrs",100,880,{"$f":"+J6/I6","v":8.8000000000000007},40,{"$f":"+K6*L6","v":352}]
["Blade sharpening",78,880,{"$f":"+C7/B7","v":11.282051282051283},15,{"$f":"+D7*E7","v":169.23076923076925},null,"Blade sharpening",78,880,{"$f":"+J7/I7","v":11.282051282051283},15,{"$f":"+K7*L7","v":169.23076923076925}]
["Blade replacement",{"$f":"78*3","v":234},880,{"$f":"+C8/B8","v":3.7606837606837606},90,{"$f":"+D8*E8","v":338.46153846153845},null,"Blade replacement",{"$f":"78*3","v":234},880,{"$f":"+J8/I8","v":3.7606837606837606},90,{"$f":"+K8*L8","v":338.46153846153845}]
[null,null,null,null,null,null,null,"Belts",200,880,{"$f":"+J9/I9","v":4.4000000000000004},100,{"$f":"+K9*L9","v":440.00000000000006}]
[]
{"$rows_left_out":117}