{"text_format":"1","workbook":"xlsx","n_sheets":27,"sheets":["USER INTERFACE","ASSUMPTIONS","SUMMARY","AREA","PRICES","DESIGN","SURVEY","TTCP","ASPHALT","POROUS ASPHALT","STONE DUST","STABILIZED AGG","CONCRETE","CRUSHED STONE","MULCH","MISC","INTERSECTIONS","ENVIRONMENTAL","BRIDGE","CULVERT","RETAINING WALL","BOARDWALK","LIGHTING","SECURITY","DRAINAGE","LANDSCAPING","PARKING"],"not_rendered":{"charts":0,"images":14,"macros":1,"external_links":0,"defined_names":32,"comments":0,"pivot_tables":0},"unopened":[],"bounds":{"document_bytes":16777216,"sheet_cells":100000,"rows_first":2000,"rows_last":500,"rows_between":2000,"halvings":0,"cell_chars":16384,"cell_head_chars":4096},"cells_cut":0,"cells_raw":0,"read":"whole","date_system":"1900"}

{"sheet":"USER INTERFACE","index":0,"n_rows":113,"n_cols":33,"rows_kept":113,"cut":false,"hidden":false,"merged":[[73,2,73,3],[74,2,74,3],[75,2,75,3],[76,2,76,3],[68,2,68,3],[69,2,69,3],[70,2,70,3],[71,2,71,3],[72,2,72,3],[63,2,63,3],[64,2,64,3],[65,2,65,3],[66,2,66,3],[67,2,67,3],[58,9,58,10],[59,9,59,10],[60,9,60,10],[61,9,61,10],[62,2,62,3],[62,9,62,10],[61,2,61,3],[60,2,60,3],[59,2,59,3],[58,2,58,3],[63,9,63,10],[64,9,64,10],[65,9,65,10],[66,9,66,10],[72,11,72,12],[72,9,72,10],[71,11,71,12],[75,11,75,12],[76,11,76,12],[74,9,74,10],[75,9,75,10],[76,9,76,10],[1,8,1,9],[2,8,2,9],[3,16,5,19],[51,4,52,7],[54,2,54,9],[46,8,47,9],[48,8,48,9],[4,4,5,7],[7,2,7,9],[50,16,52,19],[49,8,49,9],[1,4,3,7],[48,4,50,7],[74,16,74,17],[75,16,75,17],[76,16,76,17],[108,3,108,5],[98,3,98,5],[103,3,103,5],[77,16,77,17],[78,16,78,17],[78,11,78,12],[77,11,77,12],[93,8,94,9],[77,2,77,3],[78,2,78,3],[77,9,77,10],[78,9,78,10],[74,11,74,12],[73,11,73,12],[66,16,66,17],[67,11,67,12],[68,11,68,12],[69,11,69,12],[70,11,70,12],[72,16,72,17],[73,16,73,17],[67,16,67,17],[68,16,68,17],[69,16,69,17],[70,16,70,17],[71,16,71,17],[73,9,73,10],[67,9,67,10],[68,9,68,10],[69,9,69,10],[70,9,70,10],[71,9,71,10],[13,26,15,34],[62,16,62,17],[63,16,63,17],[64,16,64,17],[65,16,65,17],[59,16,59,17],[60,16,60,17],[61,16,61,17],[21,26,25,33]]}
[]
[null,null,null,null,"Shared Used Path Design Guide",null,null,null,null,null,null,null,null,null,null,null,null,null,null,null,null,null,null,null,null,null,"INSTRUCTIONS & INFORMATION SEEN BELOW - WILL NOT PRINT"]
[null,null,null,null,null,null,null,null,null,null,null,null,null,null,null,null,null,null,null,null,null,null,null,null,null,null,"Press [Tab] or use your mouse to move between fields."]
[null,null,null,null,null,null,null,null,null,null,null,null,null,null,null,null,"DO NOT MOVE CELLS",null,null,null,null,null,null,null,null,null,"Color Key:"]
[null,null,null,null,"Cost Estimator"]
[]
[]
[null,null,"PROJECT INPUTS - PAGE 1 OF 2"]
[null,null,"PROJECT DESCRIPTION",null,null,null,null,null,"INPUT","CLICK INFO",null,null,null,null,null,null,"Surface Materials",null,null,null,"Bridge",null,null,"Yes/No","Landscaping"]
[null,null,null,null,null,null,null,null,null,null,null,null,null,null,null,null,"Asphalt",null,null,null,"Yes",null,null,"Yes","Minimal"]
[null,1,"What year is the project expected to begin construction? ",null,null,null,null,null,null,null,null,null,null,null,null,null,"Porous Pavement",null,null,null,"No",null,null,"No","Moderate"]
[null,null,null,null,null,null,null,null,null,null,null,null,null,null,null,null,"Unpaved",null,null,null,"Substructure Only",null,null,null,"Advanced"]
[null,2,"Should the estimate include cost of engineering design and/or traffic control?",null,null,null,null,null,null,null,null,null,null,null,null,null,"Concrete",null,null,null,"Needs replacement"]
[null,null,null,null,null,null,null,null,null,null,null,null,null,null,null,null,"Stabilized Aggregate",null,null,null,null,null,null,null,null,null,"Please make sure Calculation are set to \"Automatic\" as seen below.\nFile -> Formulas -> Calculation Options -> Automatic"]
[null,3,"How many distinct segments of path are there? (differing exist. or prop. conditons)",null,null,null,null,null,null,null,null,null,null,null,null,null,"Crushed Stone",null,null,null,"Drainage",null,null,"Security"]
[null,null,"Input a number between 1 and 4.",null,null,null,{"$f":"IF($I$15>=1,\"Segment 1\",\"\")","v":""},{"$f":"IF($I$15>=2,\"Segment 2\",\"\")","v":""},{"$f":"IF($I$15>=3,\"Segment 3\",\"\")","v":""},{"$f":"IF($I$15>=4,\"Segment 4\",\"\")","v":""},null,null,null,null,null,null,"Grass",null,null,null,"Open Drainage",null,null,"Yes, full length"]
[null,4,"What is the length of the segment of path? (in feet)",null,null,null,null,null,null,null,null,null,null,null,null,null,"Milling Mulch",null,null,null,"Closed Drainage",null,null,"Yes, partial length"]
[null,5,"What are the existing conditions of the area?",null,null,null,null,null,null,null,null,null,null,null,null,null,"Location",null,null,null,null,null,null,"Only at Crossings"]
[null,6,"What type of path is being proposed?",null,null,null,null,null,null,null,null,null,null,null,null,null,"Intersection (Stop/Signals)",null,null,null,"Design/TTCP",null,null,"Partial Length+Crossings"]
[null,7,"What material will the shared used path be?",null,null,null,null,null,null,null,null,null,null,null,null,null,"Intersection (Uncontrolled)",null,null,null,"Design",null,null,"No"]
[null,8,"What material will the shoulders be?",null,null,null,null,null,null,null,null,null,null,null,null,null,"Mid-Block",null,null,null,"Traffic Control",null,null,"Survey"]
[null,9,"What is the width of the path? (Typ. range: 10 ft to 14 ft)",null,null,null,null,null,null,null,null,null,null,null,null,null,null,null,null,null,"Both",null,null,{"$f":"SURVEY!$D$15","v":"Clear/flat"},null,null,"Please make sure that Macros are enabled as shown below.\nFile -> Options -> Trust Center -> Trust Center Settings -> Macro Settings -> Enable all macros"]
[null,10,"Will a separate equestrian path be provided?",null,null,null,null,null,null,null,null,null,null,null,null,null,null,null,null,null,"Neither",null,null,{"$f":"SURVEY!$D$17","v":"Roadway"}]
[null,null,null,null,null,null,"*Clear out any extra data shown in red*",null,null,null,null,null,null,null,null,null,null,null,null,null,null,null,null,{"$f":"SURVEY!$D$18","v":"Wooded/hilly"}]
[null,11,"What length of the path requires boardwalk due to unavoidable wetlands? ",null,null,null,null,null,null,null,null,null,null,null,null,null,"Traffic",null,"Type",null,"Proposed",null,null,"Waterfront"]
[null,null,"Please see the Guidance Document and consult the MassGIS website to locate wetlands:",null,null,null,null,null,"OLIVER",null,null,null,null,null,null,null,"Light",null,"At-Grade",null,"Rail with Trail",null,null,"Utility Corridor"]
[null,12,"Are there steep separations or resource areas that may require retaining walls?",null,null,null,null,null,null,null,null,null,null,null,null,null,"Moderate",null,"Underpass",null,"Rail Trail (w/ exist. rail)",null,null,"ROW",null,null,null,null,null,null,null,null,"This bar may show up at start-up."]
[null,null,null,null,null,null,null,null,null,null,null,null,null,null,null,null,"Heavy",null,"Overpass",null,"Rail Trail (w/o exist. rail)",null,null,"In scarce locations",null,null,"OR"]
[null,13,"Is the ROW constrained in any locations?",null,null,null,null,null,null,null,null,null,null,null,null,null,null,null,null,null,"Roadway Sidepath",null,null,"Some of the length"]
[null,null,null,null,null,null,null,null,null,null,null,null,null,null,null,null,"Parking",null,"Speed",null,"Other SUP",null,null,"Most of the length"]
[null,14,"How many crossings with roadways are there?",null,null,null,null,null,null,null,null,null,null,null,null,null,"Porous Asphalt",null,"<30",null,"Equestrian"]
[null,null,"Please fill in the information in the chart on the next page.",null,null,null,null,null,null,null,null,null,null,null,null,null,"Typical Asphalt",null,"30-40",null,"Yes, grass",null,null,"One Way"]
[null,15,"How many crossings are there over bodies of water?",null,null,null,null,null,null,null,null,null,null,null,null,null,"Unpaved",null,">40",null,"Yes, unpaved",null,null,"One Way"]
[null,null,"Please fill in the information in the chart on the next page.",null,null,null,null,null,null,null,null,null,null,null,null,null,null,null,null,null,"No",null,null,"Two Way"]
[null,16,"How many crossings are there with a active railroads?"]
[null,null,"Please fill in the information in the chart on the next page.",null,null,null,null,null,null,null,null,null,null,null,null,null,{"$f":"YEAR(TODAY())","v":2021},"<-- CURRENT YEAR"]
[null,null,null,null,null,null,null,null,null,null,null,null,null,null,null,null,null,null,null,null,"Lighting"]
[null,17,"What is the extent of landscape restoration and enhancements?",null,null,null,null,null,null,null,null,null,null,null,null,null,null,null,null,null,"Yes, new lighting"]
[null,null,null,null,null,null,null,null,null,null,null,null,null,null,null,null,null,null,null,null,"Use existing lighting"]
[null,18,"How many parking spaces will be provided?",null,null,null,null,null,null,null,null,null,null,null,null,null,null,null,null,null,"No lighting required"]
[null,"18a","What will be the material of the parking lot?"]
[]
[null,19,"Will the path require lighting along its length?"]
[null,"19a","If not along the entire length, what length requires lighting?"]
[null,"19b","If there is lighting, should security be included?"]
[null,null,null,null,null,null,null,{"$f":"IF(ISNUMBER(SEARCH(\"partial\",$I$45)),\"Input partial length -->\",\"\")","v":""},null,{"$f":"IF(ISNUMBER(SEARCH(\"partial\",$I$45)),\"ft\",\"\")","v":""}]
[null,null,null,null,null,null,null,null,"Click Button before proceeding"]
[]
[null,null,null,null,"Shared Used Path Design Guide"]
[]
[]
[null,null,null,null,"Cost Estimator"]
[]
[]
[null,null,"PROJECT INPUTS - PAGE 2 OF 2"]
[]
[null,null,"Roadway Crossing Information Table"]
[]
[null,"#","Location",null,"Speed (mph)","Total # Lanes","Traffic","Type","Lighting Needs","Treatment"]
[1,{"$f":"IF($I$31>=A60,A60,\"\")","v":""},null,null,null,null,null,null,null,{"$f":"IF(B60=\"\",\"\",IF(OR(F60=\"\",G60=\"\",H60=\"\"),\"Fill in other Inputs\",IF(Q60=\"\",\"\",IF(Q60=\"Bridge\",\"Bridge\",IF(Q60=\"Culvert\",\"Culvert\",IF(Q60=\"Nothing\",\"None\",\"Traffic Device\"))))))","v":""},null,null,null,null,null,null,{"$f":"IF(B60=\"\",\"\",IF(H60=$S$28,\"Bridge\",IF(H60=$S$27,\"Culvert\",IF(C60=$Q$19,\"Nothing\",IF(F60=1,VLOOKUP(G60,$C$100:$F$103,MATCH(E60,$C$100:$F$100,0),FALSE),IF(F60=2,VLOOKUP(G60,$C$105:$F$108,MATCH(E60,$C$105:$F$105,0),FALSE),VLOOKUP(G60,$C$110:$F$113,MATCH(E60,$C$110:$F$110,0),FALSE)))))))","v":""}]
[2,"",null,null,null,null,null,null,null,"",null,null,null,null,null,null,""]
[3,"",null,null,null,null,null,null,null,"",null,null,null,null,null,null,""]
[4,"",null,null,null,null,null,null,null,"",null,null,null,null,null,null,""]
[5,"",null,null,null,null,null,null,null,"",null,null,null,null,null,null,""]
[6,"",null,null,null,null,null,null,null,"",null,null,null,null,null,null,""]
[7,"",null,null,null,null,null,null,null,"",null,null,null,null,null,null,""]
[8,"",null,null,null,null,null,null,null,"",null,null,null,null,null,null,""]
[9,"",null,null,null,null,null,null,null,"",null,{"$f":"IF(B68=\"\",\"\",IF(OR(F68=\"\",G68=\"\",H68=\"\"),\"Fill in other Inputs\",IF(H68=$S$26,IF(F68<=2,IF(G68=\"Light\",\"RRFB\",\"HAWK\"),IF(G68=\"Light\",\"HAWK\",\"Signalization\")),IF(H68=$S$27,\"Culvert\",\"Bridge\"))))","v":""},null,null,null,null,""]
[10,"",null,null,null,null,null,null,null,"",null,"",null,null,null,null,""]
[11,"",null,null,null,null,null,null,null,"",null,"",null,null,null,null,""]
[12,"",null,null,null,null,null,null,null,"",null,"",null,null,null,null,""]
[13,"",null,null,null,null,null,null,null,"",null,"",null,null,null,null,""]
[14,"",null,null,null,null,null,null,null,"",null,"",null,null,null,null,""]
[15,"",null,null,null,null,null,null,null,"",null,"",null,null,null,null,""]
[16,"",null,null,null,null,null,null,null,"",null,"",null,null,null,null,""]
[17,"",null,null,null,null,null,null,null,"",null,"",null,null,null,null,""]
[18,"",null,null,null,null,null,null,null,"",null,"",null,null,null,null,""]
[19,"",null,null,null,null,null,null,null,"",null,"",null,null,null,null,""]
[20,"",null,null,null,null,null,null,null,"",null,"",null,null,null,null,""]
[]
[null,null,"River Crossing Information Table",null,null,null,"Railroad Crossing Information Table"]
[]
[null,"#","River Width (ft)","Existing Bridge?","Lighting Needs","#","Length (ft)","Type","Existing Structure?","Lighting Needs"]
[1,{"$f":"IF($I$33>=A84,A84,\"\")","v":""},null,null,null,{"$f":"IF($I$35>=L84,L84,\"\")","v":""},null,null,null,null,null,1]
[2,"",null,null,null,"",null,null,null,null,null,2]
[3,"",null,null,null,"",null,null,null,null,null,3]
[4,"",null,null,null,"",null,null,null,null,null,4]
[5,"",null,null,null,"",null,null,null,null,null,5]
[6,"",null,null,null,"",null,null,null,null,null,6]
[7,"",null,null,null,"",null,null,null,null,null,7]
[8,"",null,null,null,"",null,null,null,null,null,8]
[]
[]
[null,null,null,null,null,null,null,null,"Click Button before proceeding"]
[]
[]
[]
[]
[null,null,null,1]
[null,null,null,{"$f":"$S$31","v":"<30"},{"$f":"$S$32","v":"30-40"},{"$f":"$S$33","v":">40"}]
[null,null,"Light","RRFB","RRFB","RRFB"]
[null,null,"Moderate","RRFB","RRFB","RRFB"]
[null,null,"Heavy","RRFB","HAWK","HAWK"]
[null,null,null,2]
[null,null,null,{"$f":"$S$31","v":"<30"},{"$f":"$S$32","v":"30-40"},{"$f":"$S$33","v":">40"}]
[null,null,"Light","RRFB","HAWK","HAWK"]
[null,null,"Moderate","HAWK","HAWK","Signalization"]
[null,null,"Heavy","HAWK","Signalization","Signalization"]
[null,null,null,3]
[null,null,null,{"$f":"$S$31","v":"<30"},{"$f":"$S$32","v":"30-40"},{"$f":"$S$33","v":">40"}]
[null,null,"Light","HAWK","HAWK","HAWK"]
[null,null,"Moderate","HAWK","Signalization","Signalization"]
[null,null,"Heavy","Signalization","Signalization","Signalization"]

{"sheet":"ASSUMPTIONS","index":1,"n_rows":39,"n_cols":5,"rows_kept":39,"cut":false,"hidden":false,"merged":[[38,2,39,9],[15,2,16,9],[1,8,1,9],[2,8,2,9],[4,4,5,7],[7,2,7,9],[1,4,3,7]]}
[]
[null,null,null,null,"Shared Used Path Design Guide"]
[]
[]
[null,null,null,null,"Cost Estimator"]
[]
[]
[null,null,"ESTIMATING TOOL ASSUMPTIONS"]
[]
[null,null,"The statewide unit cost prices are exported from the MassDOT website."]
[]
[null,null,"Estimating tool excludes costs associated with environmental permitting and right-of-way."]
[]
[null,null,"Two (2) foot shoulders are also assumed on each side of the path."]
[]
[null,null,"Assume there is a wooden rail fence for 50% of length if area identified as hilly or waterfront; 25% otherwise. Boardwalks are assumed to have fencing along their entire length on both sides."]
[]
[]
[null,null,"For a roadway sidepath, assume closed drainage and curbing are required."]
[null,null,"Catch basins and manholes are placed every 250 feet and granite curb is estimated for the length of the segment(s)."]
[]
[null,null,"Culverts are assumed to meet the minimum size requirements using a 10' x 16' precast box."]
[]
[null,null,"Light standards are placed every 50 feet along the length of the path."]
[]
[null,null,"The tool can perform estimates for shared use paths within the following ranges:"]
[null,null,"20 roadway crossings, 5 river crossings, 5 railroad crossings"]
[]
[null,null,"Assume two (2) curb ramps at each intersection crossing, each with an area of about 15 square yards."]
[]
[null,null,"Security cameras will be hard-wired to avoid monthly fees & storage issues. Connection to data centers not included."]
[]
[null,null,"Surveillance cameras are assumed at every 500 feet along the length for which security is required."]
[]
[null,null,"The design cost associated with landscaping is included in the estimated cost."]
[]
[null,null,"Work limits do not extend on to side streets at intersections. This work must be calculated outside of the tool."]
[]
[null,null,"Survey cost is calculated using an average base price developed through analysis of current design projects and a multiplier based on existing conditions specified on Projects Inputs - Page 1 of 2."]

{"sheet":"SUMMARY","index":2,"n_rows":53,"n_cols":17,"rows_kept":53,"cut":false,"hidden":false,"merged":[[45,2,45,9],[44,2,44,9],[39,2,39,9],[40,2,40,9],[41,2,41,9],[42,2,42,9],[43,2,43,9],[1,8,1,9],[2,8,2,9],[4,4,5,7],[7,2,7,9],[38,2,38,9],[8,3,8,8],[9,3,9,8],[1,4,3,7]]}
[]
[null,null,null,null,"Shared Used Path Design Guide"]
[]
[]
[null,null,null,null,"Cost Estimator"]
[]
[]
[null,null,"PROJECT COST SUMMARY"]
[null,null,"Project Name:","Please enter Project Name here"]
[null,null,"Project Location:","Please enter Project Town here"]
[]
[null,null,"PROJECT CATEGORY",null,null,null,null,null,"ESTIMATED PRICE"]
[null,null,"Path","Length:",{"$f":"AREA!H31","v":0},"Width:",{"$f":"SMALL('USER INTERFACE'!G22:J22,COUNTIF('USER INTERFACE'!G22:J22,0)+1)&\" ft\"&IF(MAX('USER INTERFACE'!G22:J22)<>SMALL('USER INTERFACE'!G22:J22,COUNTIF('USER INTERFACE'!G22:J22,0)+1),\" to \"&MAX('USER INTERFACE'!G22:J22)&\" ft\",\"\")","v":{"$error":"#NUM!"}},null,{"$f":"ROUND(ASPHALT!$I$43+'POROUS ASPHALT'!$I$43+'STONE DUST'!I43+'STABILIZED AGG'!I43+CONCRETE!$I$43+'CRUSHED STONE'!$I$43+DRAINAGE!$I$43+INTERSECTIONS!$I$43+ENVIRONMENTAL!$I$43,-2)","v":0}]
[null,null,null,"# Segments:",{"$f":"'USER INTERFACE'!$I$15","v":0},"# Intersections:",{"$f":"'USER INTERFACE'!$I$31","v":0}]
[null,null,"Structures",null,null,null,null,null,{"$f":"ROUND('RETAINING WALL'!$I$43+BOARDWALK!$I$43+CULVERT!$I$43+BRIDGE!$I$55,-2)","v":0}]
[]
[null,null,"Landscaping Restoration & Enhancements ",null,null,null,null,null,{"$f":"ROUND(LANDSCAPING!$I$43+PARKING!$I$54+MISC!$I$43,-2)","v":0}]
[]
[null,null,"Lighting & Security",null,null,null,null,null,{"$f":"ROUND(LIGHTING!$I$64+SECURITY!$I$43,-2)","v":0}]
[]
[null,null,"CONSTRUCTION COST"]
[null,null,"Traffic Control",{"$f":"IF('USER INTERFACE'!$I$13='USER INTERFACE'!$U$21,\"Assume \"&TTCP!M21&\"% of construction cost\",IF('USER INTERFACE'!$I$13='USER INTERFACE'!$U$22,\"Assume 4% of construction cost\",\"Traffic cost not included\"))","v":"Traffic cost not included"},null,null,null,"TTCP COST",{"$f":"ROUND(IF('USER INTERFACE'!$I$13='USER INTERFACE'!$U$21,TTCP!$I$43,IF('USER INTERFACE'!$I$13='USER INTERFACE'!$U$22,TTCP!$I$43,0)),-1)","v":0}]
[null,null,null,null,null,null,null,"SUBTOTAL",{"$f":"SUM(I13:I22)","v":0}]
[null,null,null,null,null,null,null,"Contingency (assume 15%)",{"$f":"I23*0.15","v":0}]
[]
[null,null,null,null,null,null,null,"CONSTRUCTION COST",{"$f":"SUM(I23:I24)","v":0},"**"]
[]
[null,null,"Cost Escalation",null,"Construction Year:",{"$f":"'USER INTERFACE'!$I$11","v":0},null,"CONSTRUCTION TOTAL",{"$f":"ROUND(I26*1.0447^(F28-YEAR(TODAY())),-1)","v":0}]
[null,null,"Assumed 4.47% increase in costs per year",null,null,null,null,"COST PER MILE",{"$f":"IF(I28>0,ROUND($I$28/AREA!H31*5280,-1),0)","v":0}]
[]
[null,null,"**Use this estimated cost on PIF forms - escalation is already included on the MassDOT Website"]
[null,null,"NON-CONSTRUCTION COSTS (NOT ESCALATED)"]
[null,null,"Survey","Based on existing conditons",null,null,null,"SURVEY COST",{"$f":"ROUND(SURVEY!$I$43,-2)","v":0}]
[null,null,"Design",{"$f":"IF('USER INTERFACE'!$I$13='USER INTERFACE'!$U$20,\"Assume \"&DESIGN!M21&\"% of construction cost\",IF('USER INTERFACE'!$I$13='USER INTERFACE'!$U$22,\"Assume \"&DESIGN!M21&\"% of construction cost\",\"Design cost not included\"))","v":"Design cost not included"},null,null,null,"DESIGN COST",{"$f":"IF('USER INTERFACE'!$I$13='USER INTERFACE'!$U$20,DESIGN!$I$43,IF('USER INTERFACE'!$I$13='USER INTERFACE'!$U$22,DESIGN!$I$43,0))","v":0}]
[]
[null,null,null,null,null,null,null,"PROJECT TOTAL",{"$f":"I28+SUM(I33:I34)","v":0}]
[]
[null,null,null,null,null,null,null,null,null,null,null,null,"DO NOT MOVE CELLS"]
[null,null,"-Costs for ROW and permitting are not included in this estimate.",null,null,null,null,null,null,null,null,"-","-Costs for ROW and permitting are not included in this estimate."]
[null,null,"-Environmental mitigation from paving a parking lot may be required. Cost not included.",null,null,null,null,null,null,null,null,"-",{"$f":"IF(AND('USER INTERFACE'!I40>0,'USER INTERFACE'!I41='USER INTERFACE'!Q32),\"-Environmental mitigation from paving a parking lot may be required. Cost not included.\",\"\")","v":""}]
[null,null,"-Your project includes culverts and/or bridges. Please consult a structural engineer for more accurate costs.",null,null,null,null,null,null,null,null,"-",{"$f":"IF(OR('USER INTERFACE'!I33>0,COUNTIF('USER INTERFACE'!Q60:R79,\"Culvert\")),\"-Your project includes culverts and/or bridges. Please consult a structural engineer for more accurate costs.\",\"\")","v":""}]
[null,null,null,null,null,null,null,null,null,null,null,"-",{"$f":"IF('USER INTERFACE'!I44>AREA!$H$31,\"-ERROR: Lighting length should not be more than total trail length.\",\"\")","v":""}]
[null,null,null,null,null,null,null,null,null,null,null,"-",{"$f":"IF('USER INTERFACE'!I46>AREA!$H$31,\"-ERROR: Security length should not be more than total trail length.\",\"\")","v":""}]
[null,null,null,null,null,null,null,null,null,null,null,"-",{"$f":"IF(COUNTIF('USER INTERFACE'!G20:J20,'USER INTERFACE'!Q12),\"-Some or all of this path is unpaved. This may not be ADA accessible and may not be eligible for federal funding.\",\"\")","v":""}]
[null,null,null,null,null,null,null,null,null,null,null,"-",{"$f":"IF((AREA!H33/AREA!H31)>0.25,\"-There are significant wetlands within the project (>25%). Note that permitting is not included in this estimate.\",\"\")","v":{"$error":"#DIV/0!"}}]
[null,null,null,null,null,null,null,null,null,null,null,"-",{"$f":"IF(SUMIF('USER INTERFACE'!G19:J19,'USER INTERFACE'!U27,'USER INTERFACE'!G17:J17)>0,\"-Some or all of this path is proposed on a railbed with existing ties. A contingency for contamination has been included.\",\"\")","v":""}]
[null,null,null,null,null,null,null,null,null,null,null,"-",{"$f":"IF(AND('USER INTERFACE'!I40>0,'USER INTERFACE'!I41='USER INTERFACE'!Q33),\"-An unpaved parking lot would not provide accessible parking spaces.\",\"\")","v":""}]
[null,null,null,null,null,null,null,null,null,null,null,"-",{"$f":"IF(Q53>0,\"-Some or all of this path is identified as a Rail Trail with wooded/hilly conditions. This is uncommon; please re-check inputs.\",\"\")","v":""}]
[]
[]
[null,null,null,null,null,null,null,null,null,null,null,null,"DO NOT MOVE CELLS"]
[null,null,null,null,null,null,null,null,null,null,null,null,"Wooded and Hilly Segments?",null,null,null,"#"]
[null,null,null,null,null,null,null,null,null,null,null,null,{"$f":"IF(AND('USER INTERFACE'!G18='USER INTERFACE'!$X$24),ISNUMBER(SEARCH(\"Rail Trail\",'USER INTERFACE'!G19)))","v":false},{"$f":"IF(AND('USER INTERFACE'!H18='USER INTERFACE'!$X$24),ISNUMBER(SEARCH(\"Rail Trail\",'USER INTERFACE'!H19)))","v":false},{"$f":"IF(AND('USER INTERFACE'!I18='USER INTERFACE'!$X$24),ISNUMBER(SEARCH(\"Rail Trail\",'USER INTERFACE'!I19)))","v":false},{"$f":"IF(AND('USER INTERFACE'!J18='USER INTERFACE'!$X$24),ISNUMBER(SEARCH(\"Rail Trail\",'USER INTERFACE'!J19)))","v":false},{"$f":"COUNTIF(M53:P53,\"TRUE\")","v":0}]

{"sheet":"AREA","index":3,"n_rows":41,"n_cols":16,"rows_kept":41,"cut":false,"hidden":true,"merged":[[1,8,1,9],[2,8,2,9],[5,4,6,7],[8,2,8,9]]}
[]
[]
[]
[]
[]
[null,null,null,null,"Shared Used Path Design Guide\nCost Estimator"]
[]
[]
[null,null,"AREA SUMMARY"]
[]
[]
[null,null,null,null,null,null,null,"AREA* (SF)","AREA (SY)"]
[null,null,null,null,null,null,null,null,null,null,null,null,null,"START STA",null,150]
[null,null,"Wheelchair Ramps",null,null,null,null,{"$f":"('USER INTERFACE'!$I$31*2)*135","v":0},{"$f":"H14/9","v":0},null,null,null,null,"END STA",null,4150]
[]
[null,null,"Asphalt",null,null,null,null,{"$f":"IF('USER INTERFACE'!$G$20='USER INTERFACE'!$Q10,'USER INTERFACE'!$G$17*'USER INTERFACE'!$G$22,0)+IF('USER INTERFACE'!$H$20='USER INTERFACE'!$Q10,'USER INTERFACE'!$H$17*'USER INTERFACE'!$H$22,0)+IF('USER INTERFACE'!$I$20='USER INTERFACE'!$Q10,'USER INTERFACE'!$I$17*'USER INTERFACE'!$I$22,0)+IF('USER INTERFACE'!$J$20='USER INTERFACE'!$Q10,'USER INTERFACE'!$J$17*'USER INTERFACE'!$J$22,0)","v":0},{"$f":"H16/9","v":0}]
[null,null,"Porous Asphalt",null,null,null,null,{"$f":"IF('USER INTERFACE'!$G$20='USER INTERFACE'!$Q11,'USER INTERFACE'!$G$17*'USER INTERFACE'!$G$22,0)+IF('USER INTERFACE'!$H$20='USER INTERFACE'!$Q11,'USER INTERFACE'!$H$17*'USER INTERFACE'!$H$22,0)+IF('USER INTERFACE'!$I$20='USER INTERFACE'!$Q11,'USER INTERFACE'!$I$17*'USER INTERFACE'!$I$22,0)+IF('USER INTERFACE'!$J$20='USER INTERFACE'!$Q11,'USER INTERFACE'!$J$17*'USER INTERFACE'!$J$22,0)","v":0},{"$f":"H17/9","v":0}]
[null,null,"Unpaved",null,null,null,null,{"$f":"IF('USER INTERFACE'!$G$20='USER INTERFACE'!$Q12,'USER INTERFACE'!$G$17*'USER INTERFACE'!$G$22,0)+IF('USER INTERFACE'!$H$20='USER INTERFACE'!$Q12,'USER INTERFACE'!$H$17*'USER INTERFACE'!$H$22,0)+IF('USER INTERFACE'!$I$20='USER INTERFACE'!$Q12,'USER INTERFACE'!$I$17*'USER INTERFACE'!$I$22,0)+IF('USER INTERFACE'!$J$20='USER INTERFACE'!$Q12,'USER INTERFACE'!$J$17*'USER INTERFACE'!$J$22,0)","v":0},0]
[null,null,"Concrete",null,null,null,null,{"$f":"IF('USER INTERFACE'!$G$20='USER INTERFACE'!$Q13,'USER INTERFACE'!$G$17*'USER INTERFACE'!$G$22,0)+IF('USER INTERFACE'!$H$20='USER INTERFACE'!$Q13,'USER INTERFACE'!$H$17*'USER INTERFACE'!$H$22,0)+IF('USER INTERFACE'!$I$20='USER INTERFACE'!$Q13,'USER INTERFACE'!$I$17*'USER INTERFACE'!$I$22,0)+IF('USER INTERFACE'!$J$20='USER INTERFACE'!$Q13,'USER INTERFACE'!$J$17*'USER INTERFACE'!$J$22,0)","v":0},0]
[null,null,"Stabilized Aggregate",null,null,null,null,{"$f":"IF('USER INTERFACE'!$G$20='USER INTERFACE'!$Q14,'USER INTERFACE'!$G$17*'USER INTERFACE'!$G$22,0)+IF('USER INTERFACE'!$H$20='USER INTERFACE'!$Q14,'USER INTERFACE'!$H$17*'USER INTERFACE'!$H$22,0)+IF('USER INTERFACE'!$I$20='USER INTERFACE'!$Q14,'USER INTERFACE'!$I$17*'USER INTERFACE'!$I$22,0)+IF('USER INTERFACE'!$J$20='USER INTERFACE'!$Q14,'USER INTERFACE'!$J$17*'USER INTERFACE'!$J$22,0)","v":0},{"$f":"H20/9","v":0}]
[]
[]
[]
[]
[]
[]
[]
[]
[null,null,null,null,null,null,null,"LENGTH (FT)","LENGTH (YD)"]
[]
[null,null,"Total Length of path",null,null,null,null,{"$f":"SUM('USER INTERFACE'!G17:J17)","v":0},{"$f":"H31/3","v":0}]
[]
[null,null,"Length of Boardwalk",null,null,null,null,{"$f":"BOARDWALK!$F$11","v":0},{"$f":"H33/3","v":0}]
[]
[null,null,"Length of Culvert",null,null,null,null,{"$f":"CULVERT!$O$11","v":0},{"$f":"H35/3","v":0}]
[]
[null,null,"Asphalt",null,null,null,null,{"$f":"SUMIF('USER INTERFACE'!$G$20:$J$20,'USER INTERFACE'!Q10,'USER INTERFACE'!$G$17:$J$17)","v":0},{"$f":"H37/3","v":0}]
[null,null,"Porous Asphalt",null,null,null,null,{"$f":"SUMIF('USER INTERFACE'!$G$20:$J$20,'USER INTERFACE'!Q11,'USER INTERFACE'!$G$17:$J$17)","v":0},{"$f":"H38/3","v":0}]
[null,null,"Unpaved",null,null,null,null,{"$f":"SUMIF('USER INTERFACE'!$G$20:$J$20,'USER INTERFACE'!Q12,'USER INTERFACE'!$G$17:$J$17)","v":0},0]
[null,null,"Concrete",null,null,null,null,{"$f":"SUMIF('USER INTERFACE'!$G$20:$J$20,'USER INTERFACE'!Q13,'USER INTERFACE'!$G$17:$J$17)","v":0},0]
[null,null,"Stabilized Aggregate",null,null,null,null,{"$f":"SUMIF('USER INTERFACE'!$G$20:$J$20,'USER INTERFACE'!Q14,'USER INTERFACE'!$G$17:$J$17)","v":0},{"$f":"H41/3","v":0}]

{"sheet":"PRICES","index":4,"n_rows":4065,"n_cols":14,"rows_kept":4065,"cut":false,"hidden":true,"merged":[]}
["Location","Item #","Description","Units","Quantity","# of Projects","Median Price","Mean Price","SUP Multiplier","SUP Price",null,null,"Updated","2021-06-02"]
["All Districts",100,"SCHEDULE OF OPERATIONS - FIXED PRICE $__________","LS",200,34,26500,28050.02]
["All Districts",100.001,"ELECTRICIAN","HR",24365,5,131,128.62]
["All Districts",100.002,"LABORER","HR",9106,11,92.5,91.43]
["All Districts",100.003,"SKILLED LABORER","HR",800,1,65,58.75]
["All Districts",100.005,"PLUMBER","HR",1120,1,145,139.75]
["All Districts",100.1,"BASE LABOR RATE","HR",357623,39,118,118.46]
["All Districts",100.4,"STORAGE FACILITY OR BUILDING","LS",6,1,581250,559457.17000000004]
["All Districts",100.5,"ELECTRICAL WORK","LS",10,3,77000,61048.6]
["All Districts",100.61,"HVAC WORK","LS",4,2,645750,732757.5]
["All Districts",100.7,"ROOFING AND FLASHING WORK","LS",6,1,55000,54910.83]
["All Districts",100.71,"MASONRY WORK","LS",2,1,17450,14015]
["All Districts",100.75,"PAINTING","LS",9,2,60740,70794.559999999998]
["All Districts",100.78,"MISCELLANEOUS AND ORNAMENTAL IRON WORK","LS",5,1,822000,910400]
["All Districts",101,"CLEARING AND GRUBBING","A",440.34,59,36000,35950.71]
["All Districts",101.1,"CLEARING","A",187.4,11,16650,16153.77]
["All Districts",102,"SELECTIVE CLEARING AND THINNING","A",35.93,21,23000,23345.57]
["All Districts",102.01,"SELECTIVE CLEARING AND GRUBBING","LS",6,1,45000,40833.33]
["All Districts",102.1,"TREE TRIMMING","FT",183502,47,15,14.48]
["All Districts",102.12,"TREE TRIMMING","EA",321,7,375,437.5]
["All Districts",102.2,"TREE TRIMMING","LS",17,3,12000,10834.12]
["All Districts",102.3,"HERBICIDE TREATMENT FOR INVASIVE PLANTS","HR",4649,22,435,468.64]
["All Districts",102.33,"INVASIVE PLANT MANAGEMENT STRATEGY","HR",1944,21,260,248.87]
["All Districts",102.511,"TREE PROTECTION â€“ ARMORING & PRUNING","EA",6043,58,350,359.09]
["All Districts",102.521,"TREE AND PLANT PROTECTION FENCE","FT",163669,60,9,8.9]
["All Districts",102.55,"ARBORIST","HR",3096,15,160,170.54]
["All Districts",103,"TREE REMOVED - DIAMETER UNDER 24 INCHES","EA",2241,48,1500,1351.08]
["All Districts",104,"TREE REMOVED - DIAMETER 24 INCHES AND OVER","EA",916,33,2500,2512.23]
["All Districts",105,"STUMP REMOVED","EA",456,15,500,460.69]
["All Districts",106.12,"BRIDGE CURB REMOVED AND RESET","FT",550,2,30,27]
["All Districts",106.15,"BLEEDER (BRIDGE DECK) PVC","EA",70,4,911.33,867.56]
["All Districts",106.87,"JACKING SUPERSTRUCTURE","LS",2,1,800400,875200]
["All Districts",106.88,"JACKING AND SHORING","EA",148,4,4750,6813.46]
["All Districts",106.9,"JOINT FILLER COMPOUND","FT",320,1,60,60]
["All Districts",107.02,"LOW ALLOY STEEL PLATES","LB",75250,3,2.5,2.94]
["All Districts",107.48,"PREFORMED JOINT FILLER","FT",3592,2,13,12.05]
["All Districts",107.85,"SEALING RANDOM CRACKS IN CEMENT CONCRETE PAVEMENT","FT",2400,1,25,24.17]
["All Districts",107.855,"PRESSURE INJECTION OF CRACKS","FT",7575,5,125,141.44999999999999]
["All Districts",107.96,"STRUCTURAL STEEL REPAIRS","LS",5,1,600000,614200]
["All Districts",107.97,"STRUCTURAL STEEL REPAIRS","LB",171635,8,30,32.32]
["All Districts",112.1,"DEMOLITION OF BUILDING NO. _____","LS",10,3,52500,46970.14]
["All Districts",112.2,"DEMOLITION OF BUILDING NO. _____","LS",3,1,30000,28333.33]
["All Districts",114.1,"DEMOLITION OF SUPERSTRUCTURE OF BRIDGE NO. _____","LS",41,14,330000,331661.53999999998]
["All Districts",114.2,"DEMOLITION OF SUPERSTRUCTURE OF BRIDGE NO. _____","LS",8,2,485000,481250]
["All Districts",114.3,"DEMOLITION OF SUPERSTRUCTURE OF BRIDGE NO. _____","LS",8,2,150000,126875]
["All Districts",115.1,"DEMOLITION OF BRIDGE NO. _____","LS",11,4,300000,250742.73]
["All Districts",115.2,"DEMOLITION OF BRIDGE NO. _____","LS",5,2,950000,970000]
["All Districts",115.3,"DEMOLITION OF BRIDGE NO. _____","LS",6,1,500000,495833.33]
["All Districts",116,"REMOVAL OF TEMPORARY STRUCTURE","LS",5,1,100000,105877.4]
["All Districts",118,"TEMPORARY CONSTRUCTION ACCESS ROAD","LS",5,2,77500,66000]
["All Districts",119,"RODENT CONTROL","LS",6,2,4500,4959]
["All Districts",120,"EARTH EXCAVATION","CY",1211754,60,35,35.200000000000003]
["All Districts",120.1,"UNCLASSIFIED EXCAVATION","CY",1931285,75,48,45.87]
["All Districts",121,"CLASS A ROCK EXCAVATION","CY",15871,44,120,131.41]
["All Districts",123,"MUCK EXCAVATION","CY",10783,9,50,50.63]
["All Districts",125,"TOPSOIL EXCAVATED AND STACKED","CY",74705,6,25,23.85]
["All Districts",127,"CONCRETE EXCAVATION","CY",31513,12,150,136.99]
["All Districts",127.1,"REINFORCED CONCRETE EXCAVATION","CY",58519,41,1825,1624.36]
["All Districts",127.3,"REINFORCED CONCRETE SURFACE EXCAVATION","SY",675,1,35,38.67]
["All Districts",127.4,"REINFORCED CONCRETE DECK EXCAVATION (FULL DEPTH)","SY",16650,20,761,719.6]
["All Districts",127.41,"REINFORCED CONCRETE DECK EXCAVATION (PARTIAL DEPTH)","CY",4749,20,3000,3079.91]
["All Districts",129.19999999999999,"OLD PAVEMENT EXCAVATION","SY",82945,6,19.5,19.86]
["All Districts",129.30000000000001,"OLD PAVEMENT EXCAVATION","CY",17080,1,26.5,26.13]
["All Districts",129.5,"TRACK EXCAVATION","FT",97000,3,29.5,32.25]
["All Districts",129.6,"BRIDGE PAVEMENT EXCAVATION","SY",115044,19,25,27.98]
["All Districts",140,"BRIDGE EXCAVATION","CY",665899,29,44,43.12]
["All Districts",140.1,"BRIDGE EXCAVATION WITHIN COFFERDAM","CY",5700,2,94,81.13]
["All Districts",141,"CLASS A TRENCH EXCAVATION","CY",130906,64,40,40]
["All Districts",141.1,"TEST PIT FOR EXPLORATION","CY",40103,93,100,99.57]
["All Districts",142,"CLASS B TRENCH EXCAVATION","CY",112543.5,69,35,34.33]
["All Districts",143,"CHANNEL EXCAVATION","CY",13234,6,65,60.94]
["All Districts",144,"CLASS B ROCK EXCAVATION","CY",41127,89,150,155.25]
["All Districts",145,"DRAINAGE STRUCTURE ABANDONED","EA",428,16,600,607.91]
["All Districts",146,"DRAINAGE STRUCTURE REMOVED","EA",5532,64,750,733.33]
["All Districts",148,"DREDGING AND DISPOSING OF MATERIAL","CY",3240,1,285,281.25]
["All Districts",148.4,"DREDGING, MOBILIZATION AND DEMOBILIZATION","LS",3,1,75000.320000000007,66494.679999999993]
["All Districts",149.19999999999999,"PUBLIC OUTREACH","LS",7,1,250000,280714.28999999998]
["All Districts",150,"ORDINARY BORROW","CY",170400,44,35,32.67]
["All Districts",150.1,"SPECIAL BORROW","CY",549930,19,40,39.36]
["All Districts",151,"GRAVEL BORROW","CY",1658173,116,45,45.07]
["All Districts",151.01,"GRAVEL BORROW - TYPE C","CY",47995,30,50,47.02]
["All Districts",151.1,"GRAVEL BORROW FOR BRIDGE FOUNDATION","CY",43614,12,58,57.26]
["All Districts",151.19999999999999,"GRAVEL BORROW FOR BACKFILLING STRUCTURES AND PIPES","CY",622692,37,50,49.69]
["All Districts",151.21,"GRAVEL BORROW FOR RIPRAP","CY",600,1,53.5,49.8]
["All Districts",151.30000000000001,"GRAVEL BORROW FOR SLOPE TREATMENT","CY",300,1,42.5,40]
["All Districts",152,"PROCESSED GRAVEL","CY",10340,5,46,41.31]
["All Districts",152.5,"PEASTONE FOR DRIVEWAYS","TON",300,1,55,52.6]
["All Districts",152.69999999999999,"PEASTONE","TON",156,2,75,64.33]
["All Districts",153,"CONTROLLED DENSITY FILL - EXCAVATABLE","CY",7491,35,165,167.06]
["All Districts",153.1,"CONTROLLED DENSITY FILL - NON-EXCAVATABLE","CY",2166,17,250,234.23]
["All Districts",154,"SAND BORROW","CY",2597,8,40,51.77]
["All Districts",156,"CRUSHED STONE","TON",131372.72,92,50,49.3]
["All Districts",156.1,"CRUSHED STONE FOR BRIDGE FOUNDATIONS","TON",37984,11,58,56.1]
["All Districts",156.19999999999999,"CRUSHED STONE FOR SLOPE TREATMENT","TON",2874,2,50,45.54]
["All Districts",156.5,"CRUSHED STONE FOR FILTER BLANKET","CY",1030,2,71,69.08]
["All Districts",156.80000000000001,"CRUSHED STONE FOR SUB-BASE","CY",1125,1,45,47]
["All Districts",157.1,"GABIONS","CY",870,2,400,465.62]
["All Districts",157.19999999999999,"RENO MATTRESS","CY",180,1,575,588.33000000000004]
["All Districts",170,"FINE GRADING AND COMPACTING - SUBGRADE AREA","SY",3840298,100,6.15,5.8]
["All Districts",180.01,"ENVIRONMENTAL HEALTH AND SAFETY PROGRAM","LS",179,45,7500,6938.76]
["All Districts",180.02,"PERSONAL PROTECTION LEVEL C UPGRADE","HR",19124,44,10,8.7899999999999991]
["All Districts",180.03,"LICENSED SITE PROFESSIONAL SERVICES","HR",41233,44,120,124.27]
["All Districts",181.11,"DISPOSAL OF UNREGULATED SOIL","TON",129094,41,46,45.45]
["All Districts",181.12,"DISPOSAL OF REGULATED SOIL - IN-STATE FACILITY","TON",162968,41,73,72.77]
["All Districts",181.13,"DISPOSAL OF REGULATED SOIL - OUT-OF-STATE FACILITY","TON",138998,40,130,134.16]
["All Districts",181.14,"DISPOSAL OF HAZARDOUS WASTE","TON",17280,38,412.69,436.02]
["All Districts",182.1,"INSPECTION AND TESTING FOR ASBESTOS","LS",108,28,2500,2345.35]
["All Districts",182.2,"REMOVAL OF ASBESTOS","FT",20230,27,95,91.96]
["All Districts",182.3,"ASBESTOS ABATEMENT FOR BUILDING DEMOLITION","LS",5,1,14375,13950]
["All Districts",183.1,"TREATMENT OF CONTAMINATED GROUNDWATER","GAL",404820,15,8,6.31]
["All Districts",183.2,"DISPOSAL OF GRANULAR ACTIVATED CARBON","LB",46150,17,8,7.48]
["All Districts",184.1,"DISPOSAL OF TREATED WOOD PRODUCTS","TON",6625.1,50,325,322]
["All Districts",188.2,"DISPOSAL OF PCB BALLASTS","LS",2,1,2250,2250]
["All Districts",188.3,"DISPOSAL OF MERCURY CONTAINING LAMPS","EA",595,3,25,30.43]
["All Districts",188.4,"DISPOSAL OF MERCURY CONTAINING DEVICES","EA",10,1,9500,9500]
["All Districts",191,"DRIVE SAMPLE BORING","FT",5726,7,80,83.41]
["All Districts",191.1,"HOLLOW STEM AUGER BORINGS","FT",1920.5,6,109.5,95.87]
["All Districts",191.11,"CORE BORING","FT",404,5,40,56.13]
["All Districts",192.1,"GROUND WATER OBSERVATION WELLPOINT TYPE II","FT",1,1,1060.78,1060.78]
["All Districts",193,"MOBILIZATION AND DISMANTLING OF BORING EQUIPMENT","LS",7,2,2800,2442.86]
["All Districts",201,"CATCH BASIN","EA",12729.87,68,4500,4430.75]
["All Districts",201.3,"SPECIAL CATCH BASIN","EA",1128,9,5750,5720]
["All Districts",201.5,"CATCH BASIN - MUNICIPAL STANDARD","EA",24,1,6975,6616.67]
["All Districts",202,"MANHOLE","EA",7190.78,67,5000,4817.26]
["All Districts",202.2,"MANHOLE (9 TO 14 FOOT DEPTH)","EA",250.32,9,6500,6252.46]
["All Districts",203,"SPECIAL MANHOLE","EA",181,9,6500,8479.9]
["All Districts",204,"GUTTER INLET","EA",670,29,2500,2351.5300000000002]
["All Districts",204.11,"GUTTER INLET - SPECIAL","EA",303,7,2500,2582.81]
["All Districts",205,"LEACHING BASIN","EA",149,12,6500,6448.94]
["All Districts",206,"DROP INLET, TYPE A","EA",30,2,4000,4007.98]
["All Districts",206.1,"DROP INLET, TYPE AF","EA",48,2,4232.33,4818.29]
["All Districts",207,"DROP INLET, TYPE B","EA",6,1,5000,4983.33]
["All Districts",207.1,"DROP INLET, TYPE BF","EA",44,3,5000,5299.46]
["All Districts",208,"DROP INLET, TYPE C","EA",5,1,3100,3240]
["All Districts",209,"DROP INLET, TYPE D","EA",15,1,3800,4060]
["All Districts",209.1,"DROP INLET, TYPE DF","EA",103,6,3050,3115.03]
["All Districts",209.2,"SPECIAL DROP INLET","EA",36,2,5000,4850]
["All Districts",209.3,"DROP INLET CHANGE IN TYPE","EA",245,3,1800,1766.36]
["All Districts",210,"SANITARY SEWER MANHOLE","EA",75,6,6525,6446.1]
["All Districts",210.02,"SANITARY SEWER MANHOLE REMOVED","EA",60,4,1500,1301.5]
["All Districts",210.2,"SANITARY SEWER MANHOLE (9 TO 14 FOOT DEPTH)","EA",28,1,10000,10442.86]
["All Districts",220,"DRAINAGE STRUCTURE ADJUSTED","EA",37428,94,433.53,432.01]
["All Districts",220.2,"DRAINAGE STRUCTURE REBUILT","FT",21998.5,74,475,461.33]
["All Districts",220.3,"DRAINAGE STRUCTURE CHANGE IN TYPE","EA",1016,46,1050,1090.94]
["All Districts",220.5,"DRAINAGE STRUCTURE REMODELED","EA",1723,47,850,794.87]
["All Districts",220.6,"SANITARY STRUCTURE REBUILT","FT",1452,23,450,460.07]
["All Districts",220.7,"SANITARY STRUCTURE ADJUSTED","EA",5910,68,446.68,438.51]
["All Districts",220.8,"SANITARY STRUCTURE REMODELED","EA",449,17,975,893.02]
["All Districts",220.9,"SANITARY STRUCTURE ABANDONED","EA",33,2,1100,1186]
["All Districts",221,"FRAME AND COVER","EA",6367,54,885,864.4]
["All Districts",221.1,"FRAME AND COVER - SECURED","EA",5013,46,800,766.62]
["All Districts",222,"FRAME AND GRATE - MASSDOT BAR TYPE","EA",10872,34,841.93,803.4]
["All Districts",222.1,"FRAME AND GRATE - MASSDOT CASCADE TYPE","EA",10864,68,975,966.68]
["All Districts",222.2,"FRAME AND GRATE - MASSDOT DROP INLET","EA",367,9,850,856.95]
["All Districts",222.3,"FRAME AND GRATE (OR COVER) MUNICIPAL STANDARD","EA",9670,25,925,934.07]
["All Districts",222.4,"LARGE HOOK LOCK BAR GRATE â€“ FURNISHED AND INSTALLED","EA",1960,11,1550,1727.39]
["All Districts",223.1,"FRAME AND GRATE (OR COVER) REMOVED AND STACKED","EA",1143,21,100,96.71]
["All Districts",223.2,"FRAME AND GRATE (OR COVER) REMOVED AND DISCARDED","EA",11823,68,80,71.75]
["All Districts",224.08,"8 INCH HOOD","EA",3,1,440,410]
["All Districts",224.1,"10 INCH HOOD","EA",228,4,450,452.49]
["All Districts",224.12,"12 INCH HOOD","EA",4259,19,455,460.18]
["All Districts",224.15,"15 INCH HOOD","EA",30,1,687.5,729.17]
["All Districts",224.18,"18 INCH HOOD","EA",19,2,700,787.38]
["All Districts",225.52,"TRAP AND HOOD MUNICIPAL STANDARD","EA",180,1,575,587.75]
["All Districts",227.1,"TIDE GATE","EA",8,1,5720.16,5560.08]
["All Districts",227.3,"REMOVAL OF DRAINAGE STRUCTURE SEDIMENT","CY",40900,99,250,249.17]
["All Districts",227.31,"REMOVAL OF DRAINAGE PIPE SEDIMENT","FT",989724,89,10,8.5]
["All Districts",227.4,"MASONRY PLUG","SF",2908,36,120,112.53]
["All Districts",230.11199999999999,"12 INCH CORRUGATED METAL PIPE 16 GAGE","FT",3735,2,80,75.23]
["All Districts",230.11500000000001,"15 INCH CORRUGATED METAL PIPE 16 GAGE","FT",335,2,131.19999999999999,127.65]
["All Districts",230.11799999999999,"18 INCH CORRUGATED METAL PIPE 16 GAGE","FT",210,1,142.5,136.21]
["All Districts",230.21199999999999,"12 INCH CORRUGATED METAL PIPE 14 GAGE","FT",60,1,130,130]
["All Districts",230.71199999999999,"12 INCH CORRUGATED METAL PIPE END SECTION","EA",45,2,1040,968.83]
["All Districts",230.715,"15 INCH CORRUGATED METAL PIPE END SECTION","EA",6,1,807.5,813.58]
["All Districts",230.71799999999999,"18 INCH CORRUGATED METAL PIPE END SECTION","EA",6,1,835,865.16]
["All Districts",232.4,"43 X 27 INCH ACCM PIPE-ARCH 12 GAGE","FT",350,1,425,359.29]
["All Districts",232.5,"50 X 31 INCH ACCM PIPE-ARCH 12 GAGE","FT",246,1,392.5,372.5]
["All Districts",234.12,"12 INCH DRAINAGE PIPE - OPTION","FT",105550,34,110,114.68]
["All Districts",234.15,"15 INCH DRAINAGE PIPE - OPTION","FT",18925,13,110,101.17]
["All Districts",234.18,"18 INCH DRAINAGE PIPE - OPTION","FT",29630,14,119.18,114.95]
["All Districts",234.24,"24 INCH DRAINAGE PIPE - OPTION","FT",2894,10,147.5,140.44999999999999]
["All Districts",234.3,"30 INCH DRAINAGE PIPE - OPTION","FT",460,1,156.5,153.25]
["All Districts",234.36,"36 INCH DRAINAGE PIPE - OPTION","FT",800,2,180,162.5]
["All Districts",235.12,"12 INCH DRAINAGE PIPE FLARED END - OPTION","EA",178,14,1000,983.61]
["All Districts",235.15,"15 INCH DRAINAGE PIPE FLARED END - OPTION","EA",46,4,1250,1217.51]
["All Districts",235.18,"18 INCH DRAINAGE PIPE FLARED END - OPTION","EA",51,8,1250,1170.1099999999999]
["All Districts",235.24,"24 INCH DRAINAGE PIPE FLARED END - OPTION","EA",32,5,1400,1300.23]
["All Districts",235.3,"30 INCH DRAINAGE PIPE FLARED END - OPTION","EA",12,1,1350,1166.67]
["All Districts",235.36,"36 INCH DRAINAGE PIPE FLARED END - OPTION","EA",9,1,1500,1333.33]
["All Districts",238.1,"10 INCH DUCTILE IRON PIPE","FT",29780,28,148.5,144.19999999999999]
["All Districts",238.12,"12 INCH DUCTILE IRON PIPE","FT",32243,21,165,162.59]
["All Districts",238.16,"16 INCH DUCTILE IRON PIPE","FT",947,3,250,248.12]
["All Districts",238.24,"24 INCH DUCTILE IRON PIPE","FT",1200,2,250,250.88]
["All Districts",241.12,"12 INCH REINFORCED CONCRETE PIPE","FT",271106,39,105,104.73]
["All Districts",241.15,"15 INCH REINFORCED CONCRETE PIPE","FT",86750,22,110,107.03]
["All Districts",241.18,"18 INCH REINFORCED CONCRETE PIPE","FT",79215,21,129,124.81]
["All Districts",241.24,"24 INCH REINFORCED CONCRETE PIPE","FT",38629,18,155,149.47999999999999]
["All Districts",241.3,"30 INCH REINFORCED CONCRETE PIPE","FT",8850,2,160,169.86]
["All Districts",241.36,"36 INCH REINFORCED CONCRETE PIPE","FT",555,2,220,207.9]
["All Districts",241.42,"42 INCH REINFORCED CONCRETE PIPE","FT",1006,2,225,262.2]
["All Districts",241.48,"48 INCH REINFORCED CONCRETE PIPE","FT",2326,5,250,249.15]
["All Districts",242.12,"12 INCH REINFORCED CONCRETE PIPE FLARED END","EA",458,14,1250,1208.1199999999999]
["All Districts",242.15,"15 INCH REINFORCED CONCRETE PIPE FLARED END","EA",126,5,1300,1240.29]
["All Districts",242.18,"18 INCH REINFORCED CONCRETE PIPE FLARED END","EA",127,8,1450,1373.57]
["All Districts",242.24,"24 INCH REINFORCED CONCRETE PIPE FLARED END","EA",54,6,1900,1850.59]
["All Districts",242.3,"30 INCH REINFORCED CONCRETE PIPE FLARED END","EA",21,3,2175,2131.5]
["All Districts",242.36,"36 INCH REINFORCED CONCRETE PIPE FLARED END","EA",6,1,2200,2050]
["All Districts",242.42,"42 INCH REINFORCED CONCRETE PIPE FLARED END","EA",6,1,2700,2666.67]
["All Districts",242.48,"48 INCH REINFORCED CONCRETE PIPE FLARED END","EA",18,2,2427.5,2545.5]
["All Districts",243.12,"12 INCH REINFORCED CONCRETE PIPE CLASS IV","FT",55100,8,107.5,113.22]
["All Districts",243.15,"15 INCH REINFORCED CONCRETE PIPE CLASS IV","FT",7430,3,100,100.7]
["All Districts",243.18,"18 INCH REINFORCED CONCRETE PIPE CLASS IV","FT",744,1,138,137]
["All Districts",243.24,"24 INCH REINFORCED CONCRETE PIPE CLASS IV","FT",1260,1,160,153.57]
["All Districts",244.12,"12 INCH REINFORCED CONCRETE PIPE CLASS V","FT",72072,11,100,101.72]
["All Districts",244.15,"15 INCH REINFORCED CONCRETE PIPE CLASS V","FT",5230,4,137,127.33]
["All Districts",244.18,"18 INCH REINFORCED CONCRETE PIPE CLASS V","FT",33675,7,130,130.72999999999999]
["All Districts",244.24,"24 INCH REINFORCED CONCRETE PIPE CLASS V","FT",20340,4,153,142.54]
["All Districts",244.3,"30 INCH REINFORCED CONCRETE PIPE CLASS V","FT",2920,2,200,205.15]
["All Districts",244.36,"36 INCH REINFORCED CONCRETE PIPE CLASS V","FT",5880,1,225,228.58]
["All Districts",250.06,"6 INCH POLYVINYL CHLORIDE SANITARY SEWER PIPE","FT",6730,8,110,111.32]
["All Districts",250.08,"8 INCH POLYVINYL CHLORIDE SANITARY SEWER PIPE","FT",8050,9,148,137.78]
["All Districts",250.1,"10 INCH POLYVINYLCHLORIDE SANITARY SEWER PIPE","FT",20,1,450,450]
["All Districts",252.11199999999999,"12 INCH CORRUGATED PLASTIC PIPE FLARED END","EA",22,2,900,847.55]
["All Districts",252.11500000000001,"15 INCH CORRUGATED PLASTIC PIPE FLARED END","EA",12,1,1200,1291.67]
["All Districts",252.12,"12 INCH CORRUGATED PLASTIC PIPE","FT",3389,7,92.5,92.68]
["All Districts",252.15,"15 INCH CORRUGATED PLASTIC PIPE","FT",225,1,100,101.67]
["All Districts",252.3,"30 INCH CORRUGATED PLASTIC PIPE","FT",225,1,180,185]
["All Districts",252.36,"36 INCH CORRUGATED PLASTIC PIPE","FT",180,1,292.5,280.83]
["All Districts",252.48,"48 INCH CORRUGATED PLASTIC PIPE","FT",168,1,435.5,464.43]
["All Districts",258,"STONE FOR PIPE ENDS","SY",16167,42,95,89.43]
["All Districts",259,"CRUSHED STONE FOR BLEEDERS","TON",300,1,175,176.46]
["All Districts",261.12,"12 INCH PERFORATED CORRUGATED METAL PIPE-16 GAGE (SUBDRAIN)","FT",1350,1,72,71.78]
["All Districts",265.06,"6 INCH PIPE SUBDRAIN - OPTION","FT",2460,2,66.63,58.58]
["All Districts",265.08,"8 INCH PIPE SUBDRAIN - OPTION","FT",660,1,50,51.17]
["All Districts",269.06,"6 INCH SLOT-PERFORATED CORRUGATED PLASTIC PIPE (SUBDRAIN)","FT",8775,6,62,59.53]
["All Districts",269.08,"8 INCH SLOT-PERFORATED CORRUGATED PLASTIC PIPE (SUBDRAIN)","FT",45100,3,50.5,51.67]
["All Districts",280,"HOT MIX ASPHALT WATERWAY","SY",11293,21,100,88.53]
["All Districts",280.10000000000002,"HOT MIX ASPHALT WATERWAY","TON",2896,8,275,258.89]
["All Districts",281,"CEMENT CONCRETE PAVING (WATERWAY)","SY",5770,5,146,135.66]
["All Districts",281.2,"JUTE MESH (WATERWAYS)","SY",4200,2,9.5,7.75]
["All Districts",302.04000000000002,"4 INCH DUCTILE IRON WATER PIPE (RUBBER GASKET)","FT",260,2,150,169.67]
["All Districts",302.06,"6 INCH DUCTILE IRON WATER PIPE (RUBBER GASKET)","FT",8645,8,140,134.22]
["All Districts",302.08,"8 INCH DUCTILE IRON WATER PIPE (RUBBER GASKET)","FT",91390,7,145,143.88]
["All Districts",302.10000000000002,"10 INCH DUCTILE IRON WATER PIPE (RUBBER GASKET)","FT",40,1,135,141.25]
["All Districts",302.12,"12 INCH DUCTILE IRON WATER PIPE (RUBBER GASKET)","FT",118399,9,170,168.07]
["All Districts",303.04000000000002,"4 INCH DUCTILE IRON WATER PIPE (MECHANICAL JOINT)","FT",700,2,180,187.33]
["All Districts",303.06,"6 INCH DUCTILE IRON WATER PIPE (MECHANICAL JOINT)","FT",14482,21,150,146.58000000000001]
["All Districts",303.08,"8 INCH DUCTILE IRON WATER PIPE (MECHANICAL JOINT)","FT",11002,10,165,166.2]
["All Districts",303.10000000000002,"10 INCH DUCTILE IRON WATER PIPE (MECHANICAL JOINT)","FT",2060,2,195,191.87]
["All Districts",303.12,"12 INCH DUCTILE IRON WATER PIPE (MECHANICAL JOINT)","FT",59496,9,200,190.68]
["All Districts",303.16000000000003,"16 INCH DUCTILE IRON WATER PIPE (MECHANICAL JOINT)","FT",280,2,412.5,373.5]
["All Districts",303.18,"18 INCH DUCTILE IRON WATER PIPE (MECHANICAL JOINT)","FT",1900,1,380,407.5]
["All Districts",303.24,"24 INCH DUCTILE IRON WATER PIPE (MECHANICAL JOINT)","FT",4240,1,370,350.25]
["All Districts",309,"DUCTILE IRON FITTINGS FOR WATER PIPE","LB",377261,37,7.7,7.41]
["All Districts",315.04000000000002,"4 INCH WATER MAIN REMOVED AND STACKED","FT",275,2,30,27.86]
["All Districts",315.06,"6 INCH WATER MAIN REMOVED AND STACKED","FT",2255,2,30,28.29]
["All Districts",315.08,"8 INCH WATER MAIN REMOVED AND STACKED","FT",2795,3,30,28.71]
["All Districts",315.12,"12 INCH WATER MAIN REMOVED AND STACKED","FT",3595,4,41,42.27]
["All Districts",315.16000000000003,"16 INCH WATER MAIN REMOVED AND STACKED","FT",120,1,94.25,86.17]
["All Districts",325.2,"20 INCH STEEL PIPE CASING FOR WATER PIPE","FT",96,1,400,366.67]
["All Districts",336.1,"1 INCH PLASTIC WATER PIPE","FT",5900,2,85,76.319999999999993]
["All Districts",347.07499999999999,"3/4 INCH COPPER TUBING TYPE K","FT",4405,6,75,77.400000000000006]
["All Districts",347.1,"1 INCH COPPER TUBING TYPE K","FT",39205,21,90,85.72]
["All Districts",347.125,"1-1/4 INCH COPPER TUBING TYPE K","FT",1750,2,91,93.62]
["All Districts",347.15,"1-1/2 INCH COPPER TUBING TYPE K","FT",1425,4,100,94.9]
["All Districts",347.2,"2 INCH COPPER TUBING TYPE K","FT",3424,10,125,113.85]
["All Districts",349.06,"6 INCH GATE VALVE","EA",47,3,2000,1860.53]
["All Districts",349.08,"8 INCH GATE VALVE","EA",8,1,2500,2362.5]
["All Districts",349.12,"12 INCH GATE VALVE","EA",7,1,3900,3785.71]
["All Districts",349.16,"16 INCH GATE VALVE","EA",10,1,8800,8997.67]
["All Districts",350.04,"4 INCH GATE AND GATE BOX","EA",7,1,1775,1635.71]
["All Districts",350.06,"6 INCH GATE AND GATE BOX","EA",695,20,2000,1996.1]
["All Districts",350.08,"8 INCH GATE AND GATE BOX","EA",463,11,2600,2659.81]
["All Districts",350.1,"10 INCH GATE AND GATE BOX","EA",26,2,3000,2952.94]
["All Districts",350.12,"12 INCH GATE AND GATE BOX","EA",537,10,4000,4116.78]
["All Districts",354.12,"12 INCH AND UNDER GATE BOX REMOVED AND RESET","EA",4,1,500,475]
["All Districts",355.06,"6 INCH GATE AND GATE BOX REMOVED AND STACKED","EA",91,2,625,541.91999999999996]
["All Districts",355.08,"8 INCH GATE AND GATE BOX REMOVED AND STACKED","EA",12,1,625,540.83000000000004]
["All Districts",356.24,"24 INCH BUTTERFLY VALVE AND BOX","EA",9,1,12250,13166.67]
["All Districts",357.06,"6 INCH GATE BOX","EA",410,22,500,467.38]
["All Districts",357.08,"8 INCH GATE BOX","EA",227,15,500,453.46]
["All Districts",357.1,"10 INCH GATE BOX","EA",73,6,500,449.68]
["All Districts",357.12,"12 INCH GATE BOX","EA",329,17,550,554.76]
["All Districts",357.16,"16 INCH GATE BOX","EA",49,7,600,589.83000000000004]
["All Districts",357.2,"20 INCH GATE BOX","EA",5,1,600,617.20000000000005]
["All Districts",357.24,"24 INCH GATE BOX","EA",12,3,500,461.67]
["All Districts",358,"GATE BOX ADJUSTED","EA",11586,75,250,260.79000000000002]
["All Districts",358.1,"GATE BOX REMOVED AND STACKED","EA",308,10,150,125.62]
["All Districts",363.07499999999999,"3/4 INCH CORPORATION COCK","EA",134,5,400,421.5]
["All Districts",363.1,"1 INCH CORPORATION COCK","EA",1140,15,500,525.57000000000005]
["All Districts",363.125,"1-1/4 INCH CORPORATION COCK","EA",80,2,550,633]
["All Districts",363.15,"1-1/2 INCH CORPORATION COCK","EA",236,5,700,767.05]
["All Districts",363.17500000000001,"1-3/4 INCH CORPORATION COCK","EA",80,2,650,731.5]
["All Districts",363.2,"2 INCH CORPORATION COCK","EA",110,7,1000,879.35]
["All Districts",367.06,"6 INCH CAST IRON PLUG","EA",46,3,784.5,683.2]
["All Districts",367.08,"8 INCH CAST IRON PLUG","EA",49,3,650,526.36]
["All Districts",367.1,"10 INCH CAST IRON PLUG","EA",42,1,645,713.33]
["All Districts",367.12,"12 INCH CAST IRON PLUG","EA",108,5,900,1035.7]
["All Districts",369.06,"6 X 6 INCH TAPPING SLEEVE, VALVE AND BOX","EA",6,1,7250,6866.67]
["All Districts",369.08,"8 X 8 INCH TAPPING SLEEVE, VALVE AND BOX","EA",30,2,8090,8052.22]
["All Districts",369.12,"12 X 12 INCH TAPPING SLEEVE, VALVE AND BOX","EA",29,2,12300,12590.63]
["All Districts",369.24,"24 X 24 INCH TAPPING SLEEVE, VALVE AND BOX","EA",4,1,57000,59750]
["All Districts",370.1,"8 X 6 INCH TAPPING SLEEVE, VALVE AND BOX","EA",39,5,7400,6975.07]
["All Districts",370.2,"10 X 6 INCH TAPPING SLEEVE, VALVE AND BOX","EA",20,3,7500,7300]
["All Districts",370.4,"12 X 6 INCH TAPPING SLEEVE, VALVE AND BOX","EA",114,7,10500,10687.96]
["All Districts",370.5,"12 X 8 INCH TAPPING SLEEVE, VALVE AND BOX","EA",61,2,9250,10224.219999999999]
["All Districts",371.04,"4 INCH COUPLING","EA",50,1,430,427]
["All Districts",371.06,"6 INCH COUPLING","EA",348,7,575,575.38]
["All Districts",371.08,"8 INCH COUPLING","EA",173,6,900,816.8]
["All Districts",371.1,"10 INCH COUPLING","EA",2,1,700,700]
["All Districts",371.12,"12 INCH COUPLING","EA",269,6,1000,1060.79]
["All Districts",371.16,"16 INCH COUPLING","EA",3,1,2500,2333.33]
["All Districts",371.18,"18 INCH COUPLING","EA",16,1,2400,2100]
["All Districts",371.24,"24 INCH COUPLING","EA",9,1,9500,9666.67]
["All Districts",373.04,"4 INCH WATER PIPE INSULATION","FT",8,1,83.5,81.75]
["All Districts",373.06,"6 INCH WATER PIPE INSULATION","FT",525,1,58,55]
["All Districts",373.08,"8 INCH WATER PIPE INSULATION","FT",2258,4,85.5,78.42]
["All Districts",373.12,"12 INCH WATER PIPE INSULATION","FT",2455,3,85,84.7]
["All Districts",373.24,"24 INCH WATER PIPE INSULATION","FT",1440,1,264.89999999999998,269.95]
["All Districts",375.06,"6 INCH INSERTION VALVE AND BOX","EA",54,2,10000,11767.86]
["All Districts",375.08,"8 INCH INSERTION VALVE AND BOX","EA",7,1,12500,12428.57]
["All Districts",375.12,"12 INCH INSERTION VALVE AND BOX","EA",16,1,19500,18589.5]
["All Districts",376,"HYDRANT","EA",482,10,5500,5458.7]
["All Districts",376.1,"HYDRANT - EXCLUDING COST OF HYDRANT","EA",114,9,3500,3622.24]
["All Districts",376.2,"HYDRANT - REMOVED AND RESET","EA",539,29,3000,3047.91]
["All Districts",376.3,"HYDRANT - REMOVED AND STACKED","EA",218,8,1100,1072.6600000000001]
["All Districts",376.5,"HYDRANT - ADJUSTED","EA",242,19,1800,1661.01]
["All Districts",379.1,"1 INCH AIR RELEASE VALVE","EA",4,1,1750,1612.5]
["All Districts",381,"SERVICE BOX","EA",1015,34,387.5,361.13]
["All Districts",381.01,"SERVICE BOX (MUNICIPAL STANDARD)","EA",43,2,350,358.82]
["All Districts",381.1,"SERVICE BOX REMOVED AND RESET","EA",309,5,265,260.95999999999998]
["All Districts",381.2,"SERVICE BOX REMOVED AND STACKED","EA",190,4,90,81]
["All Districts",381.3,"SERVICE BOX ADJUSTED","EA",4041,39,200,206.56]
["All Districts",384,"CURB STOP","EA",535,17,500,477.84]
["All Districts",384.2,"CURB STOP BOX ADJUSTED","EA",288,3,200,211]
["All Districts",387,"BLOW-OFF CHAMBER","EA",4,1,22000,20248.259999999998]
["All Districts",388,"AIR VALVE CHAMBER","EA",8,1,5803.81,5500.95]
["All Districts",402,"DENSE GRADED CRUSHED STONE FOR SUB-BASE","CY",375867,68,72,72.569999999999993]
["All Districts",402.1,"DENSE GRADED CRUSHED STONE FOR SUB-BASE","TON",6200,5,70,68.239999999999995]
["All Districts",402.11,"DENSE GRADED CRUSHED STONE FOR SHOULDERS","TON",982,5,100,94.17]
["All Districts",402.12,"DENSE GRADED CRUSHED STONE FOR SHOULDERS","CY",3800,3,70,72.38]
["All Districts",402.13,"PAVEMENT MILLING MULCH FOR SHOULDERS","FT",725280,24,6.2,6.6]
["All Districts",403,"RECLAIMED PAVEMENT FOR BASE COURSE AND/OR SUB-BASE","SY",263300,4,5.75,5.47]
["All Districts",403.1,"CRUSHED STONE FOR BLENDING","TON",13135,7,30,30.04]
["All Districts",404.5,"RECLAIMED PAVEMENT BORROW MATERIAL","CY",1200,1,35,38.75]
["All Districts",415.1,"PAVEMENT STANDARD MILLING","SY",3174060,19,5.3,4.97]
["All Districts",415.2,"PAVEMENT FINE MILLING","SY",10963831,45,6,5.88]
["All Districts",415.3,"PAVEMENT MICRO MILLING","SY",4607280,33,7,6.74]
["All Districts",415.4,"BRIDGE PAVEMENT MILLING","SY",242680,18,19.13,17.62]
["All Districts",430,"CEMENT CONCRETE BASE COURSE","SY",19335,13,65,63.33]
["All Districts",431,"HIGH EARLY STRENGTH CEMENT CONCRETE BASE COURSE","SY",75309,32,55.5,57.72]
["All Districts",440,"CALCIUM CHLORIDE FOR ROADWAY DUST CONTROL","LB",7774140,69,0.4,0.42]
["All Districts",443,"WATER FOR ROADWAY DUST CONTROL","MGL",15038.02,65,75,74.819999999999993]
["All Districts",450.1,"OPEN GRADED FRICTION COURSE - 9.5 - POLYMER MODIFIED (OGFC â€“ P)","TON",1800,1,180,180]
["All Districts",450.22,"SUPERPAVE SURFACE COURSE â€“ 9.5 (SSC â€“ 9.5)","TON",186748,20,120,126.94]
["All Districts",450.221,"SUPERPAVE SURFACE COURSE â€“ 9.5 POLYMER (SSC â€“ 9.5 - P)","TON",142270,9,120,118.31]
["All Districts",450.23,"SUPERPAVE SURFACE COURSE - 12.5 (SSC - 12.5)","TON",392033,31,111,118.58]
["All Districts",450.23099999999999,"SUPERPAVE SURFACE COURSE - 12.5 POLYMER (SSC - 12.5 - P)","TON",1569074,47,115,117.45]
["All Districts",450.24,"SUPERPAVE SURFACE COURSE â€“ 19.0 (SSC â€“ 19.0)","TON",12870,2,125,118.23]
["All Districts",450.31,"SUPERPAVE INTERMEDIATE COURSE - 12.5 (SIC -12.5)","TON",108185,20,140,138.46]
["All Districts",450.31099999999998,"SUPERPAVE INTERMEDIATE COURSE - 12.5 POLYMER (SIC -12.5 - P)","TON",47960,5,120,118.13]
["All Districts",450.32,"SUPERPAVE INTERMEDIATE COURSE - 19.0 (SIC - 19.0)","TON",640553,48,108.5,112.13]
["All Districts",450.32100000000003,"SUPERPAVE INTERMEDIATE COURSE - 19.0 POLYMER (SIC - 19.0 - P)","TON",256580,7,115,116.06]
["All Districts",450.41,"SUPERPAVE BASE COURSE - 25.0 (SBC - 25.0)","TON",2780,2,110,121.84]
["All Districts",450.42,"SUPERPAVE BASE COURSE - 37.5 (SBC - 37.5)","TON",1006874,55,110,110.48]
["All Districts",450.52,"SUPERPAVE LEVELING COURSE - 9.5 (SLC - 9.5)","TON",41370,3,120,127.18]
["All Districts",450.53,"SUPERPAVE LEVELING COURSE - 12.5 (SLC - 12.5)","TON",2255,4,180,175.62]
["All Districts",450.6,"SUPERPAVE BRIDGE SURFACE COURSE - 9.5 (SSC-B - 9.5)","TON",11100,16,233,231.36]
["All Districts",450.601,"SUPERPAVE BRIDGE SURFACE COURSE - 9.5 POLYMER (SSC-B - 9.5 - P)","TON",18950,10,235,228.57]
["All Districts",450.61,"SUPERPAVE BRIDGE SURFACE COURSE - 12.5 (SSC-B - 12.5)","TON",2455,6,200,202.22]
["All Districts",450.61099999999999,"SUPERPAVE BRIDGE SURFACE COURSE - 12.5 POLYMER (SSC-B - 12.5 - P)","TON",1006,4,180,163.13]
["All Districts",450.7,"SUPERPAVE BRIDGE PROTECTIVE COURSE - 9.5 (SPC-B - 9.5)","TON",6356,11,200,199.27]
["All Districts",450.70100000000002,"SUPERPAVE BRIDGE PROTECTIVE COURSE - 9.5 POLYMER (SPC-B - 9.5 - P)","TON",5610,4,275,263.73]
["All Districts",450.71,"SUPERPAVE BRIDGE PROTECTIVE COURSE â€“ 12.5 (SPC-B - 12.5)","TON",4327,13,238.44,244.18]
["All Districts",450.71100000000001,"SUPERPAVE BRIDGE PROTECTIVE COURSE â€“ 12.5POLYMER (SPC-B - 12.5 - P)","TON",5744,5,185,195.65]
["All Districts",450.8,"ASPHALT RUBBER GAP GRADED - 12.5 (ARGG - 12.5)","TON",127120,3,135.5,134.86000000000001]
["All Districts",451,"HMA FOR PATCHING","TON",161011,133,225,217.61]
["All Districts",452,"ASPHALT EMULSION FOR TACK COAT","GAL",2059478,120,8,7.76]
["All Districts",453,"HMA JOINT SEALANT","FT",5676158,96,1,0.92]
["All Districts",457.1,"SUPERPAVE WATERPROOFING SURFACE COURSE - 9.5 (SSC-W-9.5)","TON",20150,10,375,369.65]
["All Districts",457.2,"SUPERPAVE WATERPROOFING SURFACE COURSE - 12.5 (SSC-W-12.5)","TON",33906,6,375,364.81]
["All Districts",458.2,"SUPERPAVE HIGH PERFORMANCE (HP-12.5)","TON",60000,1,122,119.75]
["All Districts",458.7,"LIGHTWEIGHT AGGREGATE","CY",9040,1,120,122.75]
["All Districts",466,"STRESS ABSORBING MEMBRANE INTERLAYER","SY",150,1,360,402]
["All Districts",470,"HOT MIX ASPHALT BERM","TON",19653,29,250,231.73]
["All Districts",472,"TEMPORARY ASPHALT PATCHING","TON",269443,118,200,205.27]
["All Districts",476,"CEMENT CONCRETE PAVEMENT","SY",720,1,85,80]
["All Districts",476.32,"POLYMER MODIFIED CONCRETE OVERLAYMENT","SY",9900,1,218,194.33]
["All Districts",477,"MILLED RUMBLE STRIP (TYPE A)","FT",4455107,26,1.65,1.94]
["All Districts",477.1,"MILLED RUMBLE STRIP (TYPE B)","FT",135800,3,6,7.5]
["All Districts",477.2,"MILLED RUMBLE STRIP (TYPE C)","FT",23550,1,1.66,1.45]
["All Districts",482,"HOT APPLIED ASPHALTIC CRACK FILLER","GAL",19500,2,15.17,15.34]
["All Districts",482.01,"HOT APPLIED ASPHALTIC CRACK FILLER","FT",5000,2,2.75,2.5]
["All Districts",482.15,"HOT APPLIED ASPHALTIC CRACK FILLER (POLYESTER FIBERS)","GAL",150,1,204.7,208.13]
["All Districts",482.17,"HOT APPLIED RUBBERIZED ASPHALTIC CRACK FILLER","GAL",18865,3,142.5,103.37]
["All Districts",482.3,"SAWCUTTING ASPHALT PAVEMENT","FT",204348,13,3,3.32]
["All Districts",482.31,"SAWING & SEALING JOINTS IN ASPHALT PAVEMENT AT BRIDGES","FT",39741,34,35,33.479999999999997]
["All Districts",482.32,"SAWING AND SEALING JOINTS IN ASPHALT PAVEMENT","FT",2000,1,10,10]
["All Districts",482.4,"SAWCUTTING PORTLAND CEMENT CONCRETE","FT",5320,16,6.5,6.94]
["All Districts",482.5,"SAWCUTTING ASPHALT PAVEMENT FOR BOX WIDENING","FT",715595,36,3,2.71]
["All Districts",485,"GRANITE RUBBLE BLOCK PAVEMENT","SY",564,2,340,279.17]
["All Districts",485.1,"GRANITE RUBBLE BLOCK PAVEMENT REMOVED AND RESET","SY",254,1,170,155]
["All Districts",485.2,"GRANITE RUBBLE BLOCK PAVEMENT EXCL. COST OF CONCRETE BASE","SY",360,1,259,258.25]
["All Districts",486.1,"SCORED CEMENT CONCRETE PAVEMENT","SY",80,1,150,150]
["All Districts",501,"GRANITE CURB TYPE VA1 - STRAIGHT","FT",800,1,70,69.38]
["All Districts",502,"GRANITE CURB TYPE VA2 - STRAIGHT","FT",3600,1,60,58.44]
["All Districts",502.1,"GRANITE CURB TYPE VA2 - CURVED","FT",360,1,70,67.83]
["All Districts",503,"GRANITE CURB TYPE VA3 - STRAIGHT","FT",7760,7,51.5,53.87]
["All Districts",503.1,"GRANITE CURB TYPE VA3 - CURVED","FT",655,3,59.75,61.69]
["All Districts",504,"GRANITE CURB TYPE VA4 - STRAIGHT","FT",338844,41,50,52.76]
["All Districts",504.1,"GRANITE CURB TYPE VA4 - CURVED","FT",52097,29,58.75,59.15]
["All Districts",504.2,"GRANITE CURB TYPE VA4 - SPLAYED END","EA",853,17,422.29,426.17]
["All Districts",505,"GRANITE CURB TYPE VA5 - STRAIGHT","FT",17860,16,57,57.29]
["All Districts",505.1,"GRANITE CURB TYPE VA5 - CURVED","FT",306,2,80,85.4]
["All Districts",506,"GRANITE CURB TYPE VB - STRAIGHT","FT",960231,44,43,44.03]
["All Districts",506.1,"GRANITE CURB TYPE VB - CURVED","FT",101590,39,52,54.38]
["All Districts",509,"GRANITE TRANSITION CURB FOR PEDESTRIAN CURB RAMPS - STRAIGHT","FT",202106,76,53,54.15]
["All Districts",509.1,"GRANITE TRANSITION CURB FOR PEDESTRIAN CURB RAMPS - CURVED","FT",87479,71,60,61.09]
["All Districts",510,"GRANITE EDGING TYPE SA","FT",11172,8,40,42.86]
["All Districts",510.1,"GRANITE EDGING TYPE SA (RADIUS 10 FEET OR LESS)","FT",604,4,55,56.33]
["All Districts",511.1,"GRANITE EDGING TYPE SB - STRAIGHT","FT",98254,29,40,37.94]
["All Districts",512.1,"GRANITE EDGING TYPE SB (RADIUS 10 FEET OR LESS)","FT",4525,16,48,47.21]
["All Districts",513,"GRANITE EDGING TYPE SC","FT",15205,2,30,30.19]
["All Districts",513.1,"GRANITE EDGING TYPE SC (RADIUS 10 FEET OR LESS)","FT",50,1,44.5,44.6]
["All Districts",514,"GRANITE CURB INLET - STRAIGHT","EA",8029,72,450,449.93]
["All Districts",515,"GRANITE CURB INLET - CURVED","EA",919,33,500,509.89]
["All Districts",516,"GRANITE CURB CORNER TYPE A","EA",1918,22,300,301.83]
["All Districts",517,"GRANITE CURB CORNER TYPE B","EA",158,8,450,451.08]
["All Districts",517.01,"GRANITE CURB CORNER - TYPE C","EA",16,1,350,315]
["All Districts",520,"CONCRETE CURB TYPE VA","FT",2294,5,50,49.02]
["All Districts",570,"HOT MIX ASPHALT CURB - OPTION","FT",13600,4,20,19.57]
["All Districts",570.20000000000005,"HOT MIX ASPHALT CURB TYPE 2","FT",55150,18,15,13.23]
["All Districts",570.29999999999995,"HOT MIX ASPHALT CURB TYPE 3","FT",21443,11,12,12.43]
["All Districts",572.1,"HOT MIX ASPHALT CURB TYPE 1","TON",360,1,200,194.1]
["All Districts",572.20000000000005,"HOT MIX ASPHALT CURB TYPE 2","TON",300,1,155,156.66999999999999]
["All Districts",580,"CURB REMOVED AND RESET","FT",359760,72,30,28.56]
["All Districts",580.1,"CURB REMOVED, RELOCATED AND RESET","FT",12000,1,28.5,28.63]
["All Districts",581,"CURB INLET REMOVED AND RESET","EA",1156,30,207.5,209.32]
["All Districts",582,"CURB CORNER REMOVED AND RESET","EA",387,7,135,140.22]
["All Districts",583,"EDGING REMOVED AND RESET","FT",271681,34,30,28.2]
["All Districts",590,"CURB REMOVED AND STACKED","FT",59610,10,7.5,6.96]
["All Districts",591,"CURB INLET REMOVED AND STACKED","EA",162,4,67.5,65.569999999999993]
["All Districts",592,"CURB CORNER REMOVED AND STACKED","EA",492,5,50,42.43]
["All Districts",593,"EDGING REMOVED AND STACKED","FT",500,1,5.25,4.41]
["All Districts",594,"CURB REMOVED AND DISCARDED","FT",252850,53,6,5.76]
["All Districts",595,"CURB INLET REMOVED AND DISCARDED","EA",547,30,60,70.48]
["All Districts",596,"CURB CORNER REMOVED AND DISCARDED","EA",221,9,50,39.770000000000003]
["All Districts",597,"EDGING REMOVED AND DISCARDED","FT",127829,35,6,6.37]
["All Districts",620.12,"GUARDRAIL, TL-2 (SINGLE FACED)","FT",188655.5,40,30,30.45]
["All Districts",620.13,"GUARDRAIL, TL-3 (SINGLE FACED)","FT",2113710,49,30.84,31.2]
["All Districts",620.13099999999997,"GUARDRAIL, DEEP POST (SINGLE FACED)","FT",1930,3,45,43.09]
["All Districts",620.32000000000005,"GUARDRAIL - CURVED, TL-2 (SINGLE FACED)","FT",10676,18,35,37.159999999999997]
["All Districts",620.33000000000004,"GUARDRAIL - CURVED, TL-3 (SINGLE FACED)","FT",22767,12,34,33.04]
["All Districts",621.12,"GUARDRAIL, TL-2 (DOUBLE FACED)","FT",1055,3,40,37.619999999999997]
["All Districts",621.13,"GUARDRAIL, TL-3 (DOUBLE FACED)","FT",225700,8,45,46.56]
["All Districts",627.1,"TRAILING ANCHORAGE","EA",2672,66,1900,1925.85]
["All Districts",627.72,"GUARDRAIL END TREATMENT, TL-2 (DOUBLE FACED)","EA",27,4,18750,17234.349999999999]
["All Districts",627.73,"GUARDRAIL END TREATMENT, TL-3 (DOUBLE FACED)","EA",69,6,13125,12556.25]
["All Districts",627.82000000000005,"GUARDRAIL TANGENT END TREATMENT, TL-2","EA",718,36,4250,4359.82]
["All Districts",627.83000000000004,"GUARDRAIL TANGENT END TREATMENT, TL-3","EA",2698,49,4300,4356.8500000000004]
["All Districts",627.91999999999996,"GUARDRAIL FLARED END TREATMENT, TL-2","EA",70,6,4262.5,4200.1099999999997]
["All Districts",627.92999999999995,"GUARDRAIL FLARED END TREATMENT, TL-3","EA",294,16,4270,4406.74]
["All Districts",628.21,"TRANSITION TO NCHRP 350 GUARDRAIL","EA",1563,46,1800,1830.39]
["All Districts",628.22,"TRANSITION TO RIGID BARRIER (SINGLE FACED)","EA",496,17,5000,5180.5600000000004]
["All Districts",628.23,"TRANSITION TO RIGID BARRIER (DOUBLE FACED)","EA",65,6,6850,7194.32]
["All Districts",628.24,"TRANSITION TO BRIDGE RAIL","EA",1639,41,4500,4599.3900000000003]
["All Districts",628.25,"TRANSITION TO THRIE BEAM","EA",247,9,537.5,538.29999999999995]
["All Districts",628.30999999999995,"IMPACT ATTENUATOR FOR SHOULDER, INCAPABLE OF REDIRECTION","EA",9,4,10000,11714.29]
["All Districts",628.32000000000005,"IMPACT ATTENUATOR FOR SHOULDER, CAPABLE OF REDIRECTION","EA",30,3,34000,33380.15]
["All Districts",628.33000000000004,"IMPACT ATTENUATOR FOR MEDIAN, INCAPABLE OF REDIRECTION","EA",6,2,46000,44668.53]
["All Districts",628.34,"IMPACT ATTENUATOR FOR MEDIAN, CAPABLE OF REDIRECTION","EA",105,7,42000,40787.910000000003]
["All Districts",629.1,"PRECAST CONCRETE BARRIER - SINGLE FACED","FT",27090,5,140,150.55000000000001]
["All Districts",629.20000000000005,"PRECAST CONCRETE MEDIAN BARRIER - DOUBLE FACED","FT",126523,8,150,158.13999999999999]
["All Districts",629.29999999999995,"CAST-IN-PLACE CONCRETE BARRIER - SINGLE FACED","FT",400,1,935,935]
["All Districts",629.4,"CAST-IN-PLACE CONCRETE MEDIAN BARRIER - DOUBLE FACED","FT",14370,5,737.5,684.16]
["All Districts",629.5,"CAST-IN-PLACE MEDIAN BARRIER CAP","CY",181,3,840,844.23]
["All Districts",630,"HIGHWAY GUARD REMOVED AND RESET","FT",65137.5,27,25,24.34]
["All Districts",630.1,"HIGHWAY GUARD REMOVED AND STACKED","FT",5516,4,7.25,8.5299999999999994]
["All Districts",630.20000000000005,"HIGHWAY GUARD REMOVED AND DISCARDED","FT",2159797,77,6,5.68]
["All Districts",631,"SPECIAL BASE ANCHOR FOR GUARDRAIL POST","EA",48,1,600,600]
["All Districts",632,"GUARDRAIL POST - STEEL","EA",2944,13,125,125.28]
["All Districts",632.1,"GUARDRAIL POST - WOOD","EA",120,1,93.5,93.5]
["All Districts",632.20000000000005,"INDIVIDUAL POST REMOVED AND RESET","EA",238,5,105,112.16]
["All Districts",632.4,"INDIVIDUAL POST REMOVED AND DISCARDED","EA",2135,7,35,31.39]
["All Districts",633,"GUARDRAIL OFFSET BLOCK - W BEAM","EA",1144,10,18.5,22.18]
["All Districts",633.1,"GUARDRAIL OFFSET BLOCK - THRIE BEAM","EA",1222,6,30.5,33.18]
["All Districts",634,"W BEAM GUARD PANEL","EA",1998,11,235,237.26]
["All Districts",634.1,"THRIE BEAM GUARD PANEL","EA",1751,7,350,335.58]
["All Districts",638.1,"PROTECTIVE SCREEN (CHAIN LINK)","FT",2460,1,130,135.33000000000001]
["All Districts",644.048,"48 INCH CHAIN LINK FENCE (SPRING TENSION WIRE) (LINE POST OPTION)","FT",2000,1,43.13,46.56]
["All Districts",644.05999999999995,"60 INCH CHAIN LINK FENCE (SPRING TENSION WIRE) (LINE POST OPTION)","FT",2000,3,60.5,59.75]
["All Districts",644.072,"72 INCH CHAIN LINK FENCE (SPRING TENSION WIRE) (LINE POST OPTION)","FT",44150,3,39.479999999999997,43.25]
["All Districts",644.14800000000002,"48 INCH CHAIN LINK FENCE (SPRING TENSION WIRE) VINYL COATED (LINE POST OPTION)","FT",6070,5,55,53.85]
["All Districts",644.16,"60 INCH CHAIN LINK FENCE (SPRING TENSION WIRE) VINYL COATED (LINE POST OPTION)","FT",1150,1,47.25,52.45]
["All Districts",644.17200000000003,"72 INCH CHAIN LINK FENCE (SPRING TENSION WIRE) VINYL COATED (LINE POST OPTION)","FT",8320,3,55.75,56.96]
["All Districts",644.19600000000003,"96 INCH CHAIN LINK FENCE (SPRING TENSION WIRE) VINYL COATED (LINE POST OPTION)","FT",1500,1,85.63,85.63]
["All Districts",645.048,"48 INCH CHAIN LINK FENCE (PIPE TOP RAIL) (LINE POST OPTION)","FT",1640,2,81,77.06]
["All Districts",645.072,"72 INCH CHAIN LINK FENCE (PIPE TOP RAIL) (LINE POST OPTION)","FT",2765,2,55,52.63]
["All Districts",645.096,"96 INCH CHAIN LINK FENCE (PIPE TOP RAIL) (LINE POST OPTION)","FT",1890,2,95,92.75]
["All Districts",645.14800000000002,"48 INCH CHAIN LINK FENCE (PIPE TOP RAIL) VINYL COATED (LINE POST OPTION)","FT",2315,4,50,49.9]
["All Districts",645.17200000000003,"72 INCH CHAIN LINK FENCE (PIPE TOP RAIL) VINYL COATED (LINE POST OPTION)","FT",17457,5,60,60.02]
["All Districts",647.072,"72 INCH CHAIN LINK FENCE (PIPE TOP RAIL) W/BARB (LINE POST OPTION)","FT",165,1,99.5,101.8]
["All Districts",650.048,"48 INCH CHAIN LINK GATE WITH GATE POSTS","FT",312,3,160,147.77000000000001]
["All Districts",650.072,"72 INCH CHAIN LINK GATE WITH GATE POSTS","FT",806,6,250,242.57]
["All Districts",650.096,"96 INCH CHAIN LINK GATE WITH GATE POSTS","FT",150,1,300,283.44]
["All Districts",652.048,"48 INCH CHAIN LINK FENCE END POST","EA",110,5,314,267.07]
["All Districts",652.072,"72 INCH CHAIN LINK FENCE END POST","EA",647,11,380,335.12]
["All Districts",653.048,"48 INCH CHAIN LINK FENCE CORNER OR INTERMEDIATE BRACE POST","EA",76,2,397.5,384.4]
["All Districts",653.072,"72 INCH CHAIN LINK FENCE CORNER OR INTERMEDIATE BRACE POST","EA",733,7,355,322.07]
["All Districts",653.096,"96 INCH CHAIN LINK FENCE CORNER OR INTERMEDIATE BRACE POST","EA",28,2,487.87,453.98]
["All Districts",654.072,"72 INCH CHAIN LINK FENCE FABRIC","FT",1000,1,28.38,28.38]
["All Districts",654.14400000000001,"144 INCH CHAIN LINK FENCE FABRIC","FT",100,1,200,186.25]
["All Districts",655,"CEDAR RAIL FENCE","FT",17160,2,70,65.64]
["All Districts",657,"TEMPORARY FENCE","FT",151785,30,19.5,19.690000000000001]
["All Districts",657.5,"TEMPORARY FENCE REMOVED AND RESET","FT",67594,15,12.5,13.75]
["All Districts",660,"METAL PIPE RAIL","FT",1190,5,375,371.39]
["All Districts",665,"CHAIN LINK FENCE REMOVED AND STACKED","FT",10770,6,6.75,6.6]
["All Districts",666,"CHAIN LINK FENCE REMOVED AND RESET","FT",20900,22,50,51.29]
["All Districts",668,"CHAIN LINK FENCE GATE W/GATE POSTS REMOVED & RESET","EA",13,2,2000,1866.67]
["All Districts",669,"FENCE REMOVED AND STACKED","FT",15243,13,11.25,10.82]
["All Districts",670,"FENCE REMOVED AND RESET","FT",15328,16,50,49.67]
["All Districts",672,"FENCE GATE AND GATE POSTS REMOVED AND RESET","EA",20,3,2000,2148.33]
["All Districts",681.36,"36 INCH ANTI-GLARE SCREEN (MODULAR UNITS) - PADDLE TYPE","FT",15000,1,30,32.270000000000003]
["All Districts",685,"STONE MASONRY WALL IN CEMENT MORTAR","CY",11533.8,12,800,797.36]
["All Districts",690,"STONE MASONRY WALL REMOVED AND REBUILT IN CEMENT MORTAR","CY",1318,7,850,899.31]
["All Districts",690.1,"STONE MASONRY WALL REMOVED AND REBUILT DRY","CY",243,3,700,714.9]
["All Districts",691,"BALANCE STONE WALL REMOVED AND REBUILT","FT",13737,5,200,211.2]
["All Districts",697,"SEDIMENTATION FENCE","FT",3961,6,8,10.51]
["All Districts",697.1,"SILT SACK","EA",26518,87,190,184.77]
["All Districts",697.2,"FLOATING SILT FENCE","FT",4380,3,40,38.450000000000003]
["All Districts",698.1,"GEOTEXTILE FABRIC FOR STABILIZATION","SY",15095,10,6,6.17]
["All Districts",698.2,"GEOTEXTILE FABRIC FOR SUBSURFACE DRAINAGE","SY",11798,7,6.26,6.88]
["All Districts",698.3,"GEOTEXTILE FABRIC FOR SEPARATION","SY",157742,33,6,6.14]
["All Districts",698.4,"GEOTEXTILE FABRIC FOR PERMANENT EROSION CONTROL","SY",66927,25,7,6.93]
["All Districts",701,"CEMENT CONCRETE SIDEWALK","SY",694889,71,65,64.790000000000006]
["All Districts",701.1,"CEMENT CONCRETE SIDEWALK AT DRIVEWAYS","SY",203327,55,72,73.78]
["All Districts",701.2,"CEMENT CONCRETE PEDESTRIAN CURB RAMP","SY",120207,79,100,100.92]
["All Districts",702,"HOT MIX ASPHALT SIDEWALK OR DRIVEWAY","TON",170624,84,205,211.81]
["All Districts",703.1,"CONCRETE WHEEL STOP","EA",346,3,230,253.33]
["All Districts",704.1,"STONE DUST FOR DRIVEWAYS","TON",90,1,65,58.33]
["All Districts",705,"FLAGSTONE WALK","SY",56,1,470,463.13]
["All Districts",705.1,"FLAGSTONE WALK REMOVED AND RESET","SY",544,10,300,298.55]
["All Districts",706,"BRICK WALK","SY",688,5,300,324.39999999999998]
["All Districts",706.1,"BRICK WALK REMOVED AND RELAID","SY",571,10,282.5,273.56]
["All Districts",706.6,"GRANITE SLAB WALK REMOVED AND RESET","SY",140,1,250,240]
["All Districts",707.1,"PARK BENCH","EA",379,10,2500,2498.41]
["All Districts",707.15,"PARK BENCH REMOVED AND RESET","EA",53,6,1000,1160.56]
["All Districts",707.2,"TRASH RECEPTACLE","EA",42,5,2150,2134.92]
["All Districts",707.8,"STEEL BOLLARD","EA",355,8,1267.5,1362.54]
["All Districts",707.9,"BICYCLE RACK","EA",302,9,1000,890.13]
["All Districts",710.3,"BOUND - LETTERED GRANITE","EA",412,9,600,577.07000000000005]
["All Districts",710.4,"BOUND - PLAIN GRANITE","EA",2288,15,600,598.36]
["All Districts",711,"BOUND REMOVED AND RESET","EA",702,21,527.5,520.79999999999995]
["All Districts",712,"BOUND REMOVED AND STACKED","EA",52,3,237.5,240.17]
["All Districts",714,"MONUMENT REMOVED AND RESET","EA",9,2,4950,4444.4399999999996]
["All Districts",715,"RURAL MAIL BOX REMOVED AND RESET","EA",2232,30,200,214.14]
["All Districts",715.1,"MAIL BOX REMOVED AND RESET","EA",209,5,207.5,185.91]
["All Districts",718,"FLAGPOLE","EA",29,2,5000,3736.54]
["All Districts",718.1,"FLAGPOLE REMOVED AND RESET","LS",6,2,2250,2131.2399999999998]
["All Districts",734,"SIGN REMOVED AND RESET","EA",119,6,360,404]
["All Districts",740,"ENGINEERS FIELD OFFICE AND EQUIPMENT (TYPE A)","MO",16004,130,3000,2912.99]
[1,450.42,"SUPERPAVE BASE COURSE - 37.5 (SBC - 37.5)","TON",47090,9,109,106.73]
[1,450.6,"SUPERPAVE BRIDGE SURFACE COURSE - 9.5 (SSC-B - 9.5)","TON",245,3,325,324.67]
[1,450.601,"SUPERPAVE BRIDGE SURFACE COURSE - 9.5 POLYMER (SSC-B - 9.5 - P)","TON",400,1,225,226.25]
[1,450.61,"SUPERPAVE BRIDGE SURFACE COURSE - 12.5 (SSC-B - 12.5)","TON",1005,4,220.94,243.38]
[1,450.61099999999999,"SUPERPAVE BRIDGE SURFACE COURSE - 12.5 POLYMER (SSC-B - 12.5 - P)","TON",200,1,193.13,197.81]
[1,450.7,"SUPERPAVE BRIDGE PROTECTIVE COURSE - 9.5 (SPC-B - 9.5)","TON",86,2,362.5,344.33]
[1,450.71,"SUPERPAVE BRIDGE PROTECTIVE COURSE â€“ 12.5 (SPC-B - 12.5)","TON",1195,5,241.88,249.09]
[1,450.71100000000001,"SUPERPAVE BRIDGE PROTECTIVE COURSE â€“ 12.5POLYMER (SPC-B - 12.5 - P)","TON",200,1,193.13,197.81]
[1,451,"HMA FOR PATCHING","TON",5958,20,225,230.09]
[1,452,"ASPHALT EMULSION FOR TACK COAT","GAL",209905,14,10,9.14]
[1,453,"HMA JOINT SEALANT","FT",680560,9,1.2,1.04]
[1,470,"HOT MIX ASPHALT BERM","TON",20,1,450,450]
[1,472,"TEMPORARY ASPHALT PATCHING","TON",13717,19,212.5,209.18]
[1,477,"MILLED RUMBLE STRIP (TYPE A)","FT",694400,2,0.28999999999999998,0.26]
[1,482.3,"SAWCUTTING ASPHALT PAVEMENT","FT",426,1,10,7]
[1,482.31,"SAWING & SEALING JOINTS IN ASPHALT PAVEMENT AT BRIDGES","FT",300,1,72.5,72.17]
[1,482.4,"SAWCUTTING PORTLAND CEMENT CONCRETE","FT",590,3,6,6.45]
[1,482.5,"SAWCUTTING ASPHALT PAVEMENT FOR BOX WIDENING","FT",14360,5,4,3.99]
[1,485,"GRANITE RUBBLE BLOCK PAVEMENT","SY",264,1,245,197.5]
[1,485.1,"GRANITE RUBBLE BLOCK PAVEMENT REMOVED AND RESET","SY",254,1,170,155]
[1,486.1,"SCORED CEMENT CONCRETE PAVEMENT","SY",80,1,150,150]
[1,504,"GRANITE CURB TYPE VA4 - STRAIGHT","FT",35255,8,59.5,60.01]
[1,504.1,"GRANITE CURB TYPE VA4 - CURVED","FT",8100,2,57.25,57.92]
[1,505,"GRANITE CURB TYPE VA5 - STRAIGHT","FT",5600,2,54,54.6]
[1,506,"GRANITE CURB TYPE VB - STRAIGHT","FT",28580,4,45.17,46.99]
[1,506.1,"GRANITE CURB TYPE VB - CURVED","FT",5360,4,58.5,58.4]
[1,509,"GRANITE TRANSITION CURB FOR PEDESTRIAN CURB RAMPS - STRAIGHT","FT",10972,10,58,59.79]
[1,509.1,"GRANITE TRANSITION CURB FOR PEDESTRIAN CURB RAMPS - CURVED","FT",5175,7,62,63.86]
[1,510,"GRANITE EDGING TYPE SA","FT",405,1,37.5,36.67]
[1,511.1,"GRANITE EDGING TYPE SB - STRAIGHT","FT",1775,1,50,52]
[1,512.1,"GRANITE EDGING TYPE SB (RADIUS 10 FEET OR LESS)","FT",300,1,60,65]
[1,514,"GRANITE CURB INLET - STRAIGHT","EA",377,12,500,479.27]
[1,515,"GRANITE CURB INLET - CURVED","EA",69,6,537.5,541.01]
[1,516,"GRANITE CURB CORNER TYPE A","EA",36,1,286,277.75]
[1,570.20000000000005,"HOT MIX ASPHALT CURB TYPE 2","FT",5440,4,12,11.64]
[1,580,"CURB REMOVED AND RESET","FT",14681,11,34.200000000000003,32.72]
[1,581,"CURB INLET REMOVED AND RESET","EA",55,6,238,226.26]
[1,583,"EDGING REMOVED AND RESET","FT",557,2,45,36.6]
[1,590,"CURB REMOVED AND STACKED","FT",7430,3,9.25,8.7100000000000009]
[1,591,"CURB INLET REMOVED AND STACKED","EA",8,1,100,100]
[1,594,"CURB REMOVED AND DISCARDED","FT",39360,6,6,6.79]
[1,595,"CURB INLET REMOVED AND DISCARDED","EA",71,7,94,80.42]
[1,597,"EDGING REMOVED AND DISCARDED","FT",4100,3,8.5,7.64]
[1,620.12,"GUARDRAIL, TL-2 (SINGLE FACED)","FT",7452.5,9,30,29.47]
[1,620.13,"GUARDRAIL, TL-3 (SINGLE FACED)","FT",491820,8,30.75,31.74]
[1,620.32000000000005,"GUARDRAIL - CURVED, TL-2 (SINGLE FACED)","FT",455,2,31.75,37.43]
[1,620.33000000000004,"GUARDRAIL - CURVED, TL-3 (SINGLE FACED)","FT",175,2,57.75,50.39]
[1,621.13,"GUARDRAIL, TL-3 (DOUBLE FACED)","FT",93300,2,38.380000000000003,38.14]
[1,627.1,"TRAILING ANCHORAGE","EA",384,12,1900,1851.84]
[1,627.73,"GUARDRAIL END TREATMENT, TL-3 (DOUBLE FACED)","EA",39,2,8450,8000.83]
[1,627.82000000000005,"GUARDRAIL TANGENT END TREATMENT, TL-2","EA",63,9,4322.5,4530.74]
[1,627.83000000000004,"GUARDRAIL TANGENT END TREATMENT, TL-3","EA",317,7,4500,4452.79]
[1,627.91999999999996,"GUARDRAIL FLARED END TREATMENT, TL-2","EA",11,2,4300,4320]
[1,628.21,"TRANSITION TO NCHRP 350 GUARDRAIL","EA",161,8,1955,1886.71]
[1,628.22,"TRANSITION TO RIGID BARRIER (SINGLE FACED)","EA",148,3,5395,5439]
[1,628.24,"TRANSITION TO BRIDGE RAIL","EA",347,9,4542.5,4684.43]
[1,630,"HIGHWAY GUARD REMOVED AND RESET","FT",1544,3,30,27.52]
[1,630.1,"HIGHWAY GUARD REMOVED AND STACKED","FT",1750,1,3.5,3.68]
[1,630.20000000000005,"HIGHWAY GUARD REMOVED AND DISCARDED","FT",649908,15,6.25,5.95]
[1,632,"GUARDRAIL POST - STEEL","EA",10,1,100.3,100.3]
[1,632.20000000000005,"INDIVIDUAL POST REMOVED AND RESET","EA",22,2,662.5,726.71]
[1,632.4,"INDIVIDUAL POST REMOVED AND DISCARDED","EA",5,2,52.5,40.19]
[1,633,"GUARDRAIL OFFSET BLOCK - W BEAM","EA",110,2,35,30.73]
[1,634,"W BEAM GUARD PANEL","EA",68,2,226.1,225.22]
[1,644.05999999999995,"60 INCH CHAIN LINK FENCE (SPRING TENSION WIRE) (LINE POST OPTION)","FT",240,1,61.75,60.88]
[1,645.14800000000002,"48 INCH CHAIN LINK FENCE (PIPE TOP RAIL) VINYL COATED (LINE POST OPTION)","FT",600,1,55,56.3]
[1,645.17200000000003,"72 INCH CHAIN LINK FENCE (PIPE TOP RAIL) VINYL COATED (LINE POST OPTION)","FT",4100,1,39,39.99]
[1,650.048,"48 INCH CHAIN LINK GATE WITH GATE POSTS","FT",100,1,160,159.6]
[1,652.048,"48 INCH CHAIN LINK FENCE END POST","EA",20,1,500,505.6]
[1,652.072,"72 INCH CHAIN LINK FENCE END POST","EA",9,1,350,350.67]
[1,653.072,"72 INCH CHAIN LINK FENCE CORNER OR INTERMEDIATE BRACE POST","EA",246,1,380,381.67]
[1,655,"CEDAR RAIL FENCE","FT",15900,1,54,56.23]
[1,657,"TEMPORARY FENCE","FT",19376,8,18.5,19.28]
[1,657.5,"TEMPORARY FENCE REMOVED AND RESET","FT",10880,3,12.33,14.4]
[1,660,"METAL PIPE RAIL","FT",580,2,294.38,283.23]
[1,665,"CHAIN LINK FENCE REMOVED AND STACKED","FT",2000,1,13,12.18]
[1,666,"CHAIN LINK FENCE REMOVED AND RESET","FT",175,1,60,60.2]
[1,668,"CHAIN LINK FENCE GATE W/GATE POSTS REMOVED & RESET","EA",8,1,2200,2225]
[1,669,"FENCE REMOVED AND STACKED","FT",3256,5,9.5,8.75]
[1,685,"STONE MASONRY WALL IN CEMENT MORTAR","CY",1350,1,1177,1115.4000000000001]
[1,690,"STONE MASONRY WALL REMOVED AND REBUILT IN CEMENT MORTAR","CY",24,1,1400,1306.5]
[1,697.1,"SILT SACK","EA",1038,9,200,191.71]
[1,697.2,"FLOATING SILT FENCE","FT",720,1,37.5,38.75]
[1,698.1,"GEOTEXTILE FABRIC FOR STABILIZATION","SY",4094,2,7.5,7.46]
[1,698.3,"GEOTEXTILE FABRIC FOR SEPARATION","SY",25192,5,5,4.8099999999999996]
[1,698.4,"GEOTEXTILE FABRIC FOR PERMANENT EROSION CONTROL","SY",5899,6,7,7.31]
[1,701,"CEMENT CONCRETE SIDEWALK","SY",50656,11,66,69.430000000000007]
[1,701.1,"CEMENT CONCRETE SIDEWALK AT DRIVEWAYS","SY",11287,10,81.5,81.83]
[1,701.2,"CEMENT CONCRETE PEDESTRIAN CURB RAMP","SY",8404,11,110,109.78]
[1,702,"HOT MIX ASPHALT SIDEWALK OR DRIVEWAY","TON",4155,14,220,226.38]
[1,705.1,"FLAGSTONE WALK REMOVED AND RESET","SY",359,3,260,309.39]
[1,706,"BRICK WALK","SY",12,1,517.5,541.25]
[1,706.1,"BRICK WALK REMOVED AND RELAID","SY",32,1,300,298.75]
[1,707.1,"PARK BENCH","EA",50,1,2500,2493.87]
[1,707.15,"PARK BENCH REMOVED AND RESET","EA",4,2,1500,1275]
[1,707.2,"TRASH RECEPTACLE","EA",7,1,2097.17,2042.45]
[1,707.8,"STEEL BOLLARD","EA",10,1,2000,2000]
[1,707.9,"BICYCLE RACK","EA",96,2,785,812.59]
[1,710.3,"BOUND - LETTERED GRANITE","EA",73,3,615,582.37]
[1,710.4,"BOUND - PLAIN GRANITE","EA",42,1,550,598.42999999999995]
[1,711,"BOUND REMOVED AND RESET","EA",39,2,537.5,524.46]
[1,714,"MONUMENT REMOVED AND RESET","EA",5,1,6000,5600]
[1,715,"RURAL MAIL BOX REMOVED AND RESET","EA",143,3,200,193.67]
[1,718,"FLAGPOLE","EA",5,1,3000,2200]
[1,734,"SIGN REMOVED AND RESET","EA",43,3,250,232.73]
[1,740,"ENGINEERS FIELD OFFICE AND EQUIPMENT (TYPE A)","MO",2306,21,2700,2660.16]
[1,748,"MOBILIZATION","LS",37,11,60500,57591.35]
[1,748.1,"EMERGENCY RESPONSE","EA",16,5,750,599.14]
[1,751,"LOAM BORROW","CY",43576,20,65,66.11]
[1,752,"TOPSOIL REHANDLED AND SPREAD","CY",510,1,37.5,36]
[1,755.35,"INLAND WETLAND REPLICATION AREA","LS",3,1,4150,4100]
[1,755.45,"WETLAND RESTORATION","SY",700,2,85,75]
[1,755.75,"WETLAND SPECIALIST","HR",804,4,173.75,179.14]
[1,755.76,"WETLANDS MONITORING REPORTS","LS",14,3,5650,6207.55]
[1,756,"NPDES STORMWATER POLLUTION PREVENTION PLAN","LS",18,5,5600,5364.83]
[1,765,"SEEDING","SY",141300,15,2,1.83]
[1,765.2,"SEED FOR EROSION CONTROL","LB",24,1,57.5,62.25]
[1,767.12099999999998,"SEDIMENT CONTROL BARRIER","FT",239390,20,7.24,7.01]
[1,767.31,"STRAW MULCH","SY",17450,4,1.25,1.4]
[1,767.4,"WOOD CHIP MULCH","CY",6,1,200,150]
[1,767.6,"AGED PINE BARK MULCH","CY",75,1,60,56]
[1,767.9,"JUTE MESH","SY",9500,2,5.0999999999999996,5.34]
[1,769,"PAVEMENT MILLING MULCH UNDER GUARD RAIL","FT",622420,17,10,9.66]
[1,772.33299999999997,"CEDAR-RED 2-3 FEET","EA",108,1,83,80.319999999999993]
[1,773.43600000000004,"PINE - WHITE 5-6 FEET","EA",444,1,275,280.48]
[1,774.63800000000003,"SPRUCE - WHITE 5-6 FEET","EA",35,1,294,333.3]
[1,775.43700000000001,"LOCUST - HONEY - 'SKYLINE' 2-2.5 INCH CALIPER","EA",7,1,800,827.71]
[1,776.52300000000002,"MAPLE - RED - 'ARMSTRONG' 2-2.5 INCH CALIPER","EA",12,1,730,728]
[1,776.54300000000001,"MAPLE - RED - 'OCTOBER GLORY' 2-2.5 INCH CALIPER","EA",28,1,767.5,771.25]
[1,776.55700000000002,"MAPLE - RED - 'RED SUNSET' 2-2.5 INCH CALIPER","EA",49,1,690,693.74]
[1,776.851,"MAPLE - SUGAR - 'LEGACY' 2-2.5 INCH CALIPER","EA",52,1,777.5,770]
[1,776.93499999999995,"MAPLE - SYCAMORE 2-2.5 INCH CALIPER","EA",21,1,660,675.46]
[1,777.03599999999994,"OAK - NORTHERN RED 2-2.5 INCH CALIPER","EA",30,1,615,643.29999999999995]
[1,777.26099999999997,"OAK - SWAMP WHITE 1.5-2 INCH CALIPER","EA",36,1,500,476]
[1,777.44200000000001,"PLANETREE - AMERICAN 2-2.5 INCH CALIPER","EA",25,1,635,657.3]
[1,777.673,"SWEETGUM 2-2.5 INCH CALIPER","EA",30,1,665,645.73]
[1,778.16099999999994,"BIRCH - RIVER 'HERITAGE' 8-10 FOOT CLUMP","EA",15,1,443,464.2]
[1,778.45299999999997,"CRABAPPLE - 'RED JADE' - WEEPING 1.5-2 INCH CALIPER","EA",6,1,570,579]
[1,781.57500000000005,"LILAC TREE - JAPANESE CLUMP 10-12 FOOT CLUMP","EA",6,1,575,580.83000000000004]
[1,782.53599999999994,"REDBUD - EASTERN 5-6 FEET","EA",6,1,302,305.27999999999997]
[1,782.53700000000003,"REDBUD - EASTERN 1.5-2 INCH CALIPER","EA",5,1,460,446]
[1,783.46699999999998,"TUPELO 2-2.5 INCH CALIPER","EA",18,1,681,655.9]
[1,793.31700000000001,"PRIVET - AMUR 24-30 INCH","EA",50,1,78,71.900000000000006]
[1,795.07899999999995,"VIBURNUM - WITHEROD 18-24 INCH","EA",36,1,65,59.92]
[1,795.15300000000002,"WINTERBERRY - MALE 24-30 INCH","EA",6,1,85,78.59]
[1,795.15700000000004,"WINTERBERRY - FEMALE 24-30 INCH","EA",30,1,75,71.75]
[1,804.2,"2 INCH ELECTRICAL CONDUIT TYPE NM - PLASTIC (UL)","FT",2940,1,28,28.43]
[1,804.3,"3 INCH ELECTRICAL CONDUIT TYPE NM - PLASTIC -(UL)","FT",1100,2,43,40.76]
[1,804.4,"4 INCH ELECTRICAL CONDUIT TYPE NM - PLASTIC -(UL)","FT",15225,2,35,35.93]
[1,804.6,"6 INCH ELECTRICAL CONDUIT TYPE NM - PLASTIC -(UL)","FT",1050,1,35,36.93]
[1,811.23,"ELECTRIC HANDHOLE - SD2.023","EA",24,1,1845,1849.17]
[1,811.35,"PULL BOX ADJUSTED","EA",75,1,500,430]
[1,811.36,"ELECTRIC MANHOLE ADJUSTED","EA",3,1,800,566.66999999999996]
[1,811.37,"ELECTRIC HANDHOLE ADJUSTED","EA",20,1,500,450]
[1,813.32,"WIRE TYPE 7 NO. 6 GENERAL PURPOSE","FT",1740,1,3,2.72]
[1,816.01,"TRAFFIC SIGNAL RECONSTRUCTION LOCATION NO. 1","LS",4,1,25000,22190]
[1,816.02,"TRAFFIC SIGNAL RECONSTRUCTION LOCATION NO. 2","LS",5,1,15000,15944]
[1,816.03,"TRAFFIC SIGNAL RECONSTRUCTION LOCATION NO. 3","LS",4,1,20000,19175]
[1,816.8,"TRAFFIC CONTROL SIGNAL REMOVED AND STACKED","LS",1,1,9000,9000]
[1,816.81,"TEMPORARY TRAFFIC CONTROL SIGNAL","LS",4,1,91771,84635.5]
[1,819.83100000000002,"WIRE LOOP INSTALLED IN ROADWAY","FT",3325,3,20.5,17.170000000000002]
[1,823.7,"HIGHWAY LIGHTING POLE AND LUMINAIRE REMOVED AND RESET","EA",7,1,4000,3845.63]
[1,827.21,"24 INCH WARNING CLUSTER (H1-2) - ALUMINUM PANEL (TYPE A)","EA",10,1,155,155]
[1,828.1,"OVERHEAD GUIDE SIGN - ALUMINUM PANEL (TYPE B)","SF",2674,2,28,27.77]
[1,829,"ROADSIDE GUIDE SIGN (G) - ALUMINUM PANEL (TYPE B)","SF",320,2,25,25.63]
[1,831,"ROADSIDE GUIDE SIGN (D6/D8) - ALUMINUM PANEL (TYPE A)","SF",1090,2,30,29.82]
[1,832,"WARNING-REGULATORY AND ROUTE MARKER - ALUMINUM PANEL (TYPE A)","SF",11667,13,15,14.64]
[1,833.5,"DEMOUNTABLE REFLECTORIZED DELINEATOR - GUARD RAIL","EA",366,3,7.75,7.85]
[1,833.7,"DELINEATION FOR GUARD RAIL TERMINI","EA",2006,14,68.25,68.430000000000007]
[1,840.101,"SUPPORTS FOR OVERHEAD GUIDE SIGN (OD-1) STEEL","LS",9,1,157080,166417.78]
[1,840.10199999999998,"SUPPORTS FOR OVERHEAD GUIDE SIGN (OD-2) STEEL","LS",8,1,74280,77728.75]
[1,841.1,"SUPPORTS FOR GUIDE SIGN (D6 W/ D8-5 INCH TUBULAR POST) STEEL","EA",2,1,1925,1925]
[1,841.2,"SUPPORTS FOR GUIDE SIGN (D6-5 INCH TUBULAR POST) STEEL","EA",56,2,1850,1949.75]
[1,841.6,"SUPPORTS FOR GUIDE SIGN (I-2A-5 INCH TUBULAR POST) STEEL","EA",2,1,1500,1500]
[1,841.8,"SUPPORTS FOR GUIDE SIGN (D6 - SPECIAL DESIGN) STEEL","EA",42,1,3000,3148]
[1,847.1,"SIGN SUP (N/GUIDE)+RTE MKR W/1 BRKWAY POST ASSEMBLY - STEEL","EA",1661,12,157,158.37]
[1,848.1,"SIGN SUP (N/GUIDE)+RTE MKR W/2 BRKWAY POST ASSEMBLIES-STEEL","EA",24,2,255,265.36]
[1,850.41,"ROADWAY FLAGGER","HR",25767,17,65,64.59]
[1,851.1,"TRAFFIC CONES FOR TRAFFIC MANAGEMENT","DAY",3057,17,400,390.23]
[1,852,"SAFETY SIGNING FOR TRAFFIC MANAGEMENT","SF",53050,26,25,23.82]
[1,853.1,"PORTABLE BREAKAWAY BARRICADE TYPE III","EA",393,11,150,157.88999999999999]
[1,853.2,"TEMPORARY BARRIER (TL-2)","FT",5432.44,5,52.5,54.26]
[1,853.21,"TEMPORARY BARRIER REMOVED AND RESET","FT",31880,7,13.5,13.06]
[1,853.23,"TEMPORARY BARRIER (TL-3)","FT",7145,5,65,64.86]
[1,853.3,"TEMPORARY RESTRAINED BARRIER","FT",1980,1,75,68.33]
[1,853.31,"TEMPORARY RESTRAINED BARRIER REMOVED AND RESET","FT",2640,1,15,15]
[1,853.33,"TEMPORARY BARRIER - LIMITED DEFLECTION (TL-3)","FT",6710,3,86,85]
[1,853.40300000000002,"TRUCK MOUNTED ATTENUATOR","DAY",2482,12,205,203.73]
[1,853.41,"TEMPORARY IMPACT ATTENUATOR FOR SHLDR, INCAPABLE OF REDIRECTION","EA",16,2,6642.5,7473.13]
[1,853.41099999999994,"TEMPORARY IMPACT ATTENUATOR FOR SHOULDER, INCAPABLE OF REDIRECTION, REMOVED AND RESET","EA",6,1,1150,1050]
[1,853.50099999999998,"TEMPORARY IMPACT ATTENUATOR REMOVED AND RESET","EA",131,7,1500,1500.8]
[1,853.52,"TEMPORARY IMPACT ATTENUATOR UNIDIRECTIONAL, NON-REDIRECTIVE (TL-2)","EA",8,1,7000,7000]
[1,853.53,"TEMPORARY IMPACT ATTENUATOR UNIDIRECTIONAL, NON-REDIRECTIVE (TL-3)","EA",48,4,6412.5,6056.76]
[1,853.63,"TEMPORARY IMPACT ATTENUATOR UNIDIRECTIONAL, REDIRECTIVE (TL-3)","EA",12,1,6300,6591.67]
[1,853.73,"TEMPORARY IMPACT ATTENUATOR BI-DIRECTIONAL, NON-REDIRECTIVE (TL-3)","EA",8,1,5662.5,5356.25]
[1,853.8,"TEMPORARY ILLUMINATION FOR WORK ZONE","DAY",1018,7,250,272.06]
[1,853.83,"TEMPORARY IMPACT ATTENUATOR BI-DIRECTIONAL, REDIRECTIVE (TL-3)","EA",20,1,7000,6800]
[1,854.01599999999996,"TEMPORARY PAVING MARKINGS - 6 INCH (PAINTED)","FT",1200120,14,0.95,0.8]
[1,854.03599999999994,"TEMPORARY PAVING MARKINGS - 6 INCH (TAPE)","FT",204490,12,1.91,1.87]
[1,854.1,"PAVEMENT MARKING REMOVAL","SF",102960,12,2.25,2.09]
[1,854.6,"TEMPORARY PORTABLE RUMBLE STRIP","DAY",1142,4,100,91.88]
[1,856,"ARROW BOARD","DAY",24825,17,15,12.01]
[1,856.12,"PORTABLE CHANGEABLE MESSAGE SIGN","DAY",30376,17,29,27.19]
[1,859,"REFLECTORIZED DRUM","DAY",1172880,20,0.3,0.27]
[1,859.1,"REFLECTORIZED DRUMS WITH SEQUENTIAL FLASHING WARNING LIGHTS","DAY",27385,13,7,6.8]
[1,860.10599999999999,"6 INCH REFLECTORIZED WHITE LINE (PAINTED)","FT",30070,4,1,0.69]
[1,860.11199999999997,"12 INCH REFLECTORIZED WHITE LINE (PAINTED)","FT",35400,2,2.13,2.38]
[1,861.10599999999999,"6 INCH REFLECTORIZED YELLOW LINE (PAINTED)","FT",34975,5,1,0.8]
[1,861.11199999999997,"12 INCH REFLECTORIZED YELLOW LINE (PAINTED)","FT",100,1,4,3.5]
[1,864,"PAVEMENT ARROW REFLECTORIZED WHITE (PAINTED)","SF",3010,2,4.25,4.8600000000000003]
[1,864.01,"PAVEMENT ARROW AND LEGENDS REFLECTORIZED WHITE - INLAY TAPE","SF",1770,1,57.21,56.32]
[1,864.04,"PAVEMENT ARROWS AND LEGENDS REFLECTORIZED WHITE (THERMOPLASTIC)","SF",4316,5,9,8.5]
[1,864.31,"SLOTTED PAVEMENT MARKER ONE-WAY WHITE","EA",5430,2,24.63,25.21]
[1,864.32,"SLOTTED PAVEMENT MARKER ONE-WAY YELLOW","EA",920,2,30.63,30.09]
[1,864.33,"SLOTTED PAVEMENT MARKER TWO-WAY WHITE/RED","EA",210,1,25,24.98]
[1,864.34,"SLOTTED PAVEMENT MARKER TWO-WAY YELLOW/RED","EA",50,1,60,58.66]
[1,864.35,"SLOTTED PAVEMENT MARKER TWO-WAY YELLOW/YELLOW","EA",4458,5,41.74,41.29]
[1,866.10599999999999,"6 INCH REFLECTORIZED WHITE LINE (THERMOPLASTIC)","FT",7000,1,1.06,1.06]
[1,866.11199999999997,"12 INCH REFLECTORIZED WHITE LINE (THERMOPLASTIC)","FT",2000,1,5.25,5.32]
[1,866.20600000000002,"6 INCH REFLECTORIZED WHITE LINE (POLYUREA) (RECESSED)","FT",107000,5,2.2400000000000002,2.2799999999999998]
[1,866.21199999999999,"12 INCH REFLECTORIZED WHITE LINE (POLYUREA) (RECESSED)","FT",17300,3,10,9.57]
[1,867.10599999999999,"6 INCH REFLECTORIZED YELLOW LINE (THERMOPLASTIC)","FT",14000,1,1.1000000000000001,1.06]
[1,867.20600000000002,"6 INCH REFLECTORIZED YELLOW LINE (POLYUREA) (RECESSED)","FT",83950,5,2.2400000000000002,2.2799999999999998]
[1,867.21199999999999,"12 INCH REFLECTORIZED YELLOW LINE (POLYUREA) (RECESSED)","FT",705,2,12,12.38]
[1,874,"STREET NAME SIGN","EA",159,6,138,118.63]
[1,874.2,"TRAFFIC SIGN REMOVED AND RESET","EA",124,7,150,143.13999999999999]
[1,874.4,"TRAFFIC SIGN REMOVED AND STACKED","EA",1158,9,40,37.619999999999997]
[1,874.6,"TEMPORARY MASKING OF SIGNS","SF",90,1,20,18.329999999999998]
[1,877.1,"SIGN POST REMOVED AND DISCARDED","EA",150,1,25,25]
[1,901,"4000 PSI, 1.5 INCH, 565 CEMENT CONCRETE","CY",478,3,1925,2119.38]
[1,902,"3500 PSI, 1.5 INCH, 520 CEMENT CONCRETE","CY",6,1,975,975]
[1,903,"3000 PSI, 1.5 INCH, 470 CEMENT CONCRETE","CY",34,2,1000,1058.33]
[1,904,"4000 PSI, 3/4 INCH, 610 CEMENT CONCRETE","CY",36,2,550,581.25]
[1,905,"4000 PSI, 3/8 INCH, 660 CEMENT CONCRETE","CY",485,7,3500,3729.22]
[1,905.2,"5000 PSI, 3/8 INCH, 710 HP CEMENT CONCRETE","CY",40,1,1500,1262.5]
[1,908,"CEMENT FOR POINTING","BAG",30,1,300,275]
[1,908.1,"CONCRETE PENETRANT","SF",120450,2,4.13,3.93]
[1,909.2,"CEMENTITIOUS MORTAR FOR PATCHING","SF",1955,3,87.5,89]
[1,910,"STEEL REINFORCEMENT FOR STRUCTURES","LB",1400,2,8,7.92]
[1,910.1,"STEEL REINFORCEMENT FOR STRUCTURES - EPOXY COATED","LB",43045,6,3.25,3.26]
[1,912.4,"DRILLED AND GROUTED #4 DOWELS","EA",1690,2,65,64.290000000000006]
[1,912.5,"DRILLED AND GROUTED #5 DOWELS","EA",3056,3,53.5,52.21]
[1,912.6,"DRILLED AND GROUTED #6 DOWELS","EA",1360,1,62.5,62]
[1,942.12400000000002,"STEEL PILE HP 12 X 84","FT",4518,2,222.94,231.55]
[1,942.14200000000005,"STEEL PILE HP 14 X 89","FT",14100,1,157.5,156.59]
[1,944.14200000000005,"STEEL PILE SPLICE HP 14 X 89","EA",75,1,1150,1016.67]
[1,946.12,"PRECAST-PRESTRESSED CONCRETE PILE - 12 INCH","FT",17200,1,86.2,94.31]
[1,947,"TEST PILE","FT",216,1,420,378.23]
[1,948.1,"SHORT DURATION LOAD TEST","EA",7,2,65000,65106.97]
[1,948.41,"DYNAMIC LOAD TEST BY CONTRACTOR","EA",72,3,8408.81,8264.92]
[1,948.5,"PILE SHOES","EA",278,2,150,124.29]
[1,950.1,"TEMPORARY SHORING","LS",3,1,317500,330000]
[1,961.20100000000002,"CLEAN (FULL REMOVAL) AND PAINT STEEL BRIDGE NO. ________","LS",4,1,1906250,1763125]
[1,964.7,"EPOXY MORTAR FOR PATCHING","SF",400,1,50,45]
[1,968.1,"SCUPPER AND DOWNSPOUT","EA",32,1,8150,7700]
[1,983,"DUMPED RIPRAP","TON",1500,2,69,70.7]
[1,983.01,"DUMPED RIPRAP","CY",150,1,117.37,106.27]
[1,983.1,"RIPRAP","TON",12890,4,85,91.21]
[1,986,"MODIFIED ROCKFILL","TON",8150,6,77,76.8]
[1,986.2,"MODIFIED ROCKFILL","CY",40,1,96.5,98.25]
[1,987.02,"SPECIAL SLOPE PAVING UNDER BRIDGE REMOVED AND RESET","SY",60,1,200,201.67]
[1,991.1,"CONTROL OF WATER - STRUCTURE NO. ______","LS",13,6,100000,80271.33]
[1,991.2,"CONTROL OF WATER - STRUCTURE NO. ______","LS",3,1,23500,18221]
[1,992.1,"ALTERATION TO BRIDGE STRUCTURE NO. ______","LS",8,2,450000,407468.28]
[1,992.2,"ALTERATION TO BRIDGE STRUCTURE NO. ______","LS",5,1,325000,308809.40000000002]
[1,993.1,"TEMPORARY BRIDGE NO. ______","LS",6,1,458308.4,462769.47]
[1,994.01,"TEMPORARY PROTECTIVE SHIELDING BRIDGE NO. _______________","LS",8,3,40000,30625]
[1,994.1,"TEMPORARY PROTECTIVE SHIELDING","SF",4540,2,30,25.6]
[1,995,"BRIDGE SUPERSTRUCTURE, BRIDGE NO._______","LS",4,1,561925,580222.14]
[1,995.01,"BRIDGE STRUCTURE, BRIDGE NO. ______","LS",17,4,1039046,924960.67]
[2,100,"SCHEDULE OF OPERATIONS - FIXED PRICE $__________","LS",44,7,26500,25113.64]
[2,100.001,"ELECTRICIAN","HR",5000,1,133,137.4]
[2,100.003,"SKILLED LABORER","HR",800,1,65,58.75]
[2,100.1,"BASE LABOR RATE","HR",74785,15,118,117.58]
[2,100.4,"STORAGE FACILITY OR BUILDING","LS",6,1,581250,559457.17000000004]
[2,100.5,"ELECTRICAL WORK","LS",5,1,66299,72969.2]
[2,100.7,"ROOFING AND FLASHING WORK","LS",6,1,55000,54910.83]
[2,100.75,"PAINTING","LS",6,1,25000,23680]
[2,101,"CLEARING AND GRUBBING","A",47.29,16,34000,34110.33]
[2,101.1,"CLEARING","A",34,2,18000,17828.57]
[2,102,"SELECTIVE CLEARING AND THINNING","A",6.44,4,22000,25081.82]
[2,102.1,"TREE TRIMMING","FT",58475,14,15,13.48]
[2,102.12,"TREE TRIMMING","EA",114,1,240,200]
[2,102.3,"HERBICIDE TREATMENT FOR INVASIVE PLANTS","HR",552,6,375,414.39]
[2,102.33,"INVASIVE PLANT MANAGEMENT STRATEGY","HR",280,6,250,260.86]
[2,102.511,"TREE PROTECTION â€“ ARMORING & PRUNING","EA",1534,16,400,375.09]
[2,102.521,"TREE AND PLANT PROTECTION FENCE","FT",56290,15,8,7.84]
[2,102.55,"ARBORIST","HR",948,5,160,158.19]
[2,103,"TREE REMOVED - DIAMETER UNDER 24 INCHES","EA",602,13,1200,1177.5]
[2,104,"TREE REMOVED - DIAMETER 24 INCHES AND OVER","EA",344,11,2500,2507.3000000000002]
[2,105,"STUMP REMOVED","EA",232,6,500,452.98]
[2,106.12,"BRIDGE CURB REMOVED AND RESET","FT",550,2,30,27]
[2,106.15,"BLEEDER (BRIDGE DECK) PVC","EA",36,2,675,766.67]
[2,107.02,"LOW ALLOY STEEL PLATES","LB",2250,1,6,5.5]
[2,107.855,"PRESSURE INJECTION OF CRACKS","FT",690,1,125,124.33]
[2,112.1,"DEMOLITION OF BUILDING NO. _____","LS",9,2,40000,39822.22]
[2,112.2,"DEMOLITION OF BUILDING NO. _____","LS",3,1,30000,28333.33]
[2,114.1,"DEMOLITION OF SUPERSTRUCTURE OF BRIDGE NO. _____","LS",14,2,467000,511571.43]
[2,114.2,"DEMOLITION OF SUPERSTRUCTURE OF BRIDGE NO. _____","LS",7,1,550000,542857.14]
[2,114.3,"DEMOLITION OF SUPERSTRUCTURE OF BRIDGE NO. _____","LS",7,1,140000,123571.43]
[2,115.1,"DEMOLITION OF BRIDGE NO. _____","LS",6,1,285000,220333.33]
[2,119,"RODENT CONTROL","LS",4,1,1000,1125]
[2,120,"EARTH EXCAVATION","CY",553980,13,30,31.35]
[2,120.1,"UNCLASSIFIED EXCAVATION","CY",262545,17,40,37.29]
[2,121,"CLASS A ROCK EXCAVATION","CY",2115,8,100,74.540000000000006]
[2,123,"MUCK EXCAVATION","CY",560,2,48.5,49.09]
[2,125,"TOPSOIL EXCAVATED AND STACKED","CY",25375,2,25,24.1]
[2,127,"CONCRETE EXCAVATION","CY",200,1,390,296]
[2,127.1,"REINFORCED CONCRETE EXCAVATION","CY",20273,14,3500,3398.04]
[2,127.3,"REINFORCED CONCRETE SURFACE EXCAVATION","SY",675,1,35,38.67]
[2,127.4,"REINFORCED CONCRETE DECK EXCAVATION (FULL DEPTH)","SY",2150,6,900,886.27]
[2,127.41,"REINFORCED CONCRETE DECK EXCAVATION (PARTIAL DEPTH)","CY",1330,6,3415,3229.67]
[2,129.19999999999999,"OLD PAVEMENT EXCAVATION","SY",79440,3,19,22.45]
[2,129.30000000000001,"OLD PAVEMENT EXCAVATION","CY",17080,1,26.5,26.13]
[2,129.6,"BRIDGE PAVEMENT EXCAVATION","SY",27500,4,35,34.29]
[2,140,"BRIDGE EXCAVATION","CY",82267,7,42,41.18]
[2,141,"CLASS A TRENCH EXCAVATION","CY",26730,12,30,31.05]
[2,141.1,"TEST PIT FOR EXPLORATION","CY",7413,20,90,81.63]
[2,142,"CLASS B TRENCH EXCAVATION","CY",30764,15,27,26.23]
[2,143,"CHANNEL EXCAVATION","CY",2040,1,70,67.5]
[2,144,"CLASS B ROCK EXCAVATION","CY",3238,17,137.5,137.51]
[2,145,"DRAINAGE STRUCTURE ABANDONED","EA",216,7,500,439.14]
[2,146,"DRAINAGE STRUCTURE REMOVED","EA",1072,15,550,533.86]
[2,150,"ORDINARY BORROW","CY",89368,11,30,30.28]
[2,150.1,"SPECIAL BORROW","CY",19220,6,35,35.71]
[2,151,"GRAVEL BORROW","CY",346335,31,40,39.1]
[2,151.01,"GRAVEL BORROW - TYPE C","CY",11645,4,42.5,41.3]
[2,151.1,"GRAVEL BORROW FOR BRIDGE FOUNDATION","CY",5492,4,56.5,55.1]
[2,151.19999999999999,"GRAVEL BORROW FOR BACKFILLING STRUCTURES AND PIPES","CY",52990,9,45,45.46]
[2,151.30000000000001,"GRAVEL BORROW FOR SLOPE TREATMENT","CY",300,1,42.5,40]
[2,153,"CONTROLLED DENSITY FILL - EXCAVATABLE","CY",1372,6,150,155.47]
[2,153.1,"CONTROLLED DENSITY FILL - NON-EXCAVATABLE","CY",43,4,300,236.18]
[2,154,"SAND BORROW","CY",2310,3,30,30.62]
[2,156,"CRUSHED STONE","TON",25241.72,19,50,50.29]
[2,156.1,"CRUSHED STONE FOR BRIDGE FOUNDATIONS","TON",3250,4,58,57.26]
[2,156.80000000000001,"CRUSHED STONE FOR SUB-BASE","CY",1125,1,45,47]
[2,170,"FINE GRADING AND COMPACTING - SUBGRADE AREA","SY",1149536,23,4,4.03]
[2,180.01,"ENVIRONMENTAL HEALTH AND SAFETY PROGRAM","LS",32,9,5550,5000]
[2,180.02,"PERSONAL PROTECTION LEVEL C UPGRADE","HR",3064,9,10,9.2899999999999991]
[2,180.03,"LICENSED SITE PROFESSIONAL SERVICES","HR",3200,9,122.5,125.12]
[2,181.11,"DISPOSAL OF UNREGULATED SOIL","TON",8269,8,55,49.86]
[2,181.12,"DISPOSAL OF REGULATED SOIL - IN-STATE FACILITY","TON",1327,8,95,90.16]
[2,181.13,"DISPOSAL OF REGULATED SOIL - OUT-OF-STATE FACILITY","TON",1436,7,150,151.44]
[2,181.14,"DISPOSAL OF HAZARDOUS WASTE","TON",593,8,455,448.85]
[2,182.1,"INSPECTION AND TESTING FOR ASBESTOS","LS",34,7,2262.5,2227.62]
[2,182.2,"REMOVAL OF ASBESTOS","FT",4030,8,97.5,90.32]
[2,182.3,"ASBESTOS ABATEMENT FOR BUILDING DEMOLITION","LS",4,1,12000,12437.5]
[2,183.1,"TREATMENT OF CONTAMINATED GROUNDWATER","GAL",200,1,27,21.75]
[2,183.2,"DISPOSAL OF GRANULAR ACTIVATED CARBON","LB",400,1,10,9.5]
[2,184.1,"DISPOSAL OF TREATED WOOD PRODUCTS","TON",116,11,300,286.64999999999998]
[2,191,"DRIVE SAMPLE BORING","FT",1100,1,78.5,71.2]
[2,191.1,"HOLLOW STEM AUGER BORINGS","FT",100,1,126.5,124.6]
[2,191.11,"CORE BORING","FT",80,1,159,151.5]
[2,201,"CATCH BASIN","EA",2535,19,4000,3995.46]
[2,201.3,"SPECIAL CATCH BASIN","EA",16,1,5750,5562.5]
[2,202,"MANHOLE","EA",1047,16,4000,4111.8999999999996]
[2,202.2,"MANHOLE (9 TO 14 FOOT DEPTH)","EA",94,2,4800,5245.45]
[2,203,"SPECIAL MANHOLE","EA",39,2,14000,15045.83]
[2,204,"GUTTER INLET","EA",122,9,2200,2160.71]
[2,204.11,"GUTTER INLET - SPECIAL","EA",48,1,2000,1700]
[2,205,"LEACHING BASIN","EA",5,1,6000,5470]
[2,207.1,"DROP INLET, TYPE BF","EA",42,2,4200,4899.28]
[2,209.1,"DROP INLET, TYPE DF","EA",18,1,2600,2700]
[2,209.3,"DROP INLET CHANGE IN TYPE","EA",200,1,1500,1150]
[2,210,"SANITARY SEWER MANHOLE","EA",41,2,5500,5569.23]
[2,210.02,"SANITARY SEWER MANHOLE REMOVED","EA",22,2,900,730]
[2,220,"DRAINAGE STRUCTURE ADJUSTED","EA",4369,22,425,422.13]
[2,220.2,"DRAINAGE STRUCTURE REBUILT","FT",4996,15,400,414.17]
[2,220.3,"DRAINAGE STRUCTURE CHANGE IN TYPE","EA",295,12,1000,1008.73]
[2,220.5,"DRAINAGE STRUCTURE REMODELED","EA",714,10,900,890.57]
[2,220.6,"SANITARY STRUCTURE REBUILT","FT",65,3,420,419.17]
[2,220.7,"SANITARY STRUCTURE ADJUSTED","EA",1122,15,425,431.39]
[2,220.8,"SANITARY STRUCTURE REMODELED","EA",79,5,825,844.63]
[2,220.9,"SANITARY STRUCTURE ABANDONED","EA",12,1,600,566.66999999999996]
[2,221,"FRAME AND COVER","EA",1224,10,825,838.42]
[2,221.1,"FRAME AND COVER - SECURED","EA",1010,10,877.5,851.65]
[2,222,"FRAME AND GRATE - MASSDOT BAR TYPE","EA",867,8,925,916.49]
[2,222.1,"FRAME AND GRATE - MASSDOT CASCADE TYPE","EA",2233,16,950,966.6]
[2,222.2,"FRAME AND GRATE - MASSDOT DROP INLET","EA",185,2,775,904.27]
[2,222.3,"FRAME AND GRATE (OR COVER) MUNICIPAL STANDARD","EA",726,5,950,970.89]
[2,222.4,"LARGE HOOK LOCK BAR GRATE â€“ FURNISHED AND INSTALLED","EA",166,2,1750,1706.25]
[2,223.1,"FRAME AND GRATE (OR COVER) REMOVED AND STACKED","EA",545,6,100,97.69]
[2,223.2,"FRAME AND GRATE (OR COVER) REMOVED AND DISCARDED","EA",905,13,65,58.03]
[2,224.08,"8 INCH HOOD","EA",3,1,440,410]
[2,224.1,"10 INCH HOOD","EA",15,1,425,403.33]
[2,224.12,"12 INCH HOOD","EA",1019,6,450,436.58]
[2,224.18,"18 INCH HOOD","EA",7,1,600,597.14]
[2,227.3,"REMOVAL OF DRAINAGE STRUCTURE SEDIMENT","CY",12474,22,250,256.12]
[2,227.31,"REMOVAL OF DRAINAGE PIPE SEDIMENT","FT",87575,22,9.85,8.08]
[2,227.4,"MASONRY PLUG","SF",458,9,100,103.44]
[2,230.11500000000001,"15 INCH CORRUGATED METAL PIPE 16 GAGE","FT",15,1,150,150]
[2,230.21199999999999,"12 INCH CORRUGATED METAL PIPE 14 GAGE","FT",60,1,130,130]
[2,230.71199999999999,"12 INCH CORRUGATED METAL PIPE END SECTION","EA",3,1,1400,1366.67]
[2,234.12,"12 INCH DRAINAGE PIPE - OPTION","FT",23660,5,75.5,72.16]
[2,234.15,"15 INCH DRAINAGE PIPE - OPTION","FT",5220,2,80,68.67]
[2,234.18,"18 INCH DRAINAGE PIPE - OPTION","FT",15100,3,96.5,94.56]
[2,234.24,"24 INCH DRAINAGE PIPE - OPTION","FT",375,2,128.06,133.01]
[2,235.12,"12 INCH DRAINAGE PIPE FLARED END - OPTION","EA",36,4,650,680.35]
[2,235.18,"18 INCH DRAINAGE PIPE FLARED END - OPTION","EA",6,2,900,812.56]
[2,235.24,"24 INCH DRAINAGE PIPE FLARED END - OPTION","EA",4,1,1229.8,1064.9000000000001]
[2,238.1,"10 INCH DUCTILE IRON PIPE","FT",1990,5,100,110]
[2,238.12,"12 INCH DUCTILE IRON PIPE","FT",3180,2,88,83.11]
[2,241.12,"12 INCH REINFORCED CONCRETE PIPE","FT",54075,11,90,90.61]
[2,241.15,"15 INCH REINFORCED CONCRETE PIPE","FT",19195,8,95,96.28]
[2,241.18,"18 INCH REINFORCED CONCRETE PIPE","FT",9362,5,105,104.27]
[2,241.24,"24 INCH REINFORCED CONCRETE PIPE","FT",3190,4,130,130.94999999999999]
[2,241.3,"30 INCH REINFORCED CONCRETE PIPE","FT",690,1,144,143.83000000000001]
[2,241.36,"36 INCH REINFORCED CONCRETE PIPE","FT",480,1,167.5,166.33]
[2,241.42,"42 INCH REINFORCED CONCRETE PIPE","FT",1006,2,225,262.2]
[2,241.48,"48 INCH REINFORCED CONCRETE PIPE","FT",816,2,250,260.77]
[2,242.12,"12 INCH REINFORCED CONCRETE PIPE FLARED END","EA",118,4,1200,1053.5]
[2,242.15,"15 INCH REINFORCED CONCRETE PIPE FLARED END","EA",21,2,1250,1112.73]
[2,242.18,"18 INCH REINFORCED CONCRETE PIPE FLARED END","EA",26,3,1400,1317.5]
[2,242.24,"24 INCH REINFORCED CONCRETE PIPE FLARED END","EA",5,1,1750,1750]
[2,242.3,"30 INCH REINFORCED CONCRETE PIPE FLARED END","EA",6,1,1800,1666.67]
[2,242.36,"36 INCH REINFORCED CONCRETE PIPE FLARED END","EA",6,1,2200,2050]
[2,242.42,"42 INCH REINFORCED CONCRETE PIPE FLARED END","EA",6,1,2700,2666.67]
[2,242.48,"48 INCH REINFORCED CONCRETE PIPE FLARED END","EA",6,1,2627.5,2859.17]
[2,244.12,"12 INCH REINFORCED CONCRETE PIPE CLASS V","FT",2710,2,75,73.400000000000006]
[2,244.18,"18 INCH REINFORCED CONCRETE PIPE CLASS V","FT",210,1,100,96.33]
[2,250.06,"6 INCH POLYVINYL CHLORIDE SANITARY SEWER PIPE","FT",700,1,100,93.6]
[2,250.08,"8 INCH POLYVINYL CHLORIDE SANITARY SEWER PIPE","FT",4550,3,127.5,121.93]
[2,250.1,"10 INCH POLYVINYLCHLORIDE SANITARY SEWER PIPE","FT",20,1,450,450]
[2,252.12,"12 INCH CORRUGATED PLASTIC PIPE","FT",1300,3,85,86.67]
[2,258,"STONE FOR PIPE ENDS","SY",2646,10,82.5,80.510000000000005]
[2,265.06,"6 INCH PIPE SUBDRAIN - OPTION","FT",2460,2,66.63,58.58]
[2,269.06,"6 INCH SLOT-PERFORATED CORRUGATED PLASTIC PIPE (SUBDRAIN)","FT",5355,2,50,46.92]
[2,280,"HOT MIX ASPHALT WATERWAY","SY",6215,6,82,78.12]
[2,280.10000000000002,"HOT MIX ASPHALT WATERWAY","TON",1200,1,244.94,239.98]
[2,281,"CEMENT CONCRETE PAVING (WATERWAY)","SY",5132,2,110,136.38]
[2,302.04000000000002,"4 INCH DUCTILE IRON WATER PIPE (RUBBER GASKET)","FT",40,1,150,141.25]
[2,302.06,"6 INCH DUCTILE IRON WATER PIPE (RUBBER GASKET)","FT",1990,2,91,95.86]
[2,302.08,"8 INCH DUCTILE IRON WATER PIPE (RUBBER GASKET)","FT",1505,2,110,111.5]
[2,302.10000000000002,"10 INCH DUCTILE IRON WATER PIPE (RUBBER GASKET)","FT",40,1,135,141.25]
[2,302.12,"12 INCH DUCTILE IRON WATER PIPE (RUBBER GASKET)","FT",26765,3,123,153.16999999999999]
[2,303.06,"6 INCH DUCTILE IRON WATER PIPE (MECHANICAL JOINT)","FT",1710,3,105,107]
[2,303.08,"8 INCH DUCTILE IRON WATER PIPE (MECHANICAL JOINT)","FT",546,2,120,142.22]
[2,303.10000000000002,"10 INCH DUCTILE IRON WATER PIPE (MECHANICAL JOINT)","FT",1920,1,150,155.38]
[2,303.12,"12 INCH DUCTILE IRON WATER PIPE (MECHANICAL JOINT)","FT",22590,1,94,86]
[2,303.16000000000003,"16 INCH DUCTILE IRON WATER PIPE (MECHANICAL JOINT)","FT",30,1,155,136.66999999999999]
[2,303.18,"18 INCH DUCTILE IRON WATER PIPE (MECHANICAL JOINT)","FT",1900,1,380,407.5]
[2,303.24,"24 INCH DUCTILE IRON WATER PIPE (MECHANICAL JOINT)","FT",4240,1,370,350.25]
[2,309,"DUCTILE IRON FITTINGS FOR WATER PIPE","LB",121640,7,7.5,7.34]
[2,315.04000000000002,"4 INCH WATER MAIN REMOVED AND STACKED","FT",195,1,20,20]
[2,315.06,"6 INCH WATER MAIN REMOVED AND STACKED","FT",855,1,20,20]
[2,315.08,"8 INCH WATER MAIN REMOVED AND STACKED","FT",135,1,25,21.67]
[2,315.12,"12 INCH WATER MAIN REMOVED AND STACKED","FT",40,1,35,35]
[2,347.07499999999999,"3/4 INCH COPPER TUBING TYPE K","FT",2335,3,65,60.09]
[2,347.1,"1 INCH COPPER TUBING TYPE K","FT",8645,4,71.5,63.59]
[2,347.15,"1-1/2 INCH COPPER TUBING TYPE K","FT",165,2,100,92.22]
[2,347.2,"2 INCH COPPER TUBING TYPE K","FT",780,2,90,98.33]
[2,349.06,"6 INCH GATE VALVE","EA",23,2,2000,1861.54]
[2,350.06,"6 INCH GATE AND GATE BOX","EA",144,4,1900,1878.42]
[2,350.08,"8 INCH GATE AND GATE BOX","EA",22,3,2250,2303]
[2,350.1,"10 INCH GATE AND GATE BOX","EA",18,1,3000,2800]
[2,350.12,"12 INCH GATE AND GATE BOX","EA",146,2,3500,3958.33]
[2,354.12,"12 INCH AND UNDER GATE BOX REMOVED AND RESET","EA",4,1,500,475]
[2,356.24,"24 INCH BUTTERFLY VALVE AND BOX","EA",9,1,12250,13166.67]
[2,357.06,"6 INCH GATE BOX","EA",45,4,400,427.4]
[2,357.08,"8 INCH GATE BOX","EA",37,3,425,425]
[2,357.1,"10 INCH GATE BOX","EA",9,2,500,438.89]
[2,357.12,"12 INCH GATE BOX","EA",6,1,700,700]
[2,357.16,"16 INCH GATE BOX","EA",14,2,550,534.5]
[2,357.24,"24 INCH GATE BOX","EA",9,2,500,438.89]
[2,358,"GATE BOX ADJUSTED","EA",2100,16,250,242.3]
[2,358.1,"GATE BOX REMOVED AND STACKED","EA",260,5,115,151.91999999999999]
[2,363.07499999999999,"3/4 INCH CORPORATION COCK","EA",64,2,300,317.14]
[2,363.1,"1 INCH CORPORATION COCK","EA",177,6,400,439.29]
[2,363.15,"1-1/2 INCH CORPORATION COCK","EA",6,2,600,625]
[2,363.2,"2 INCH CORPORATION COCK","EA",8,2,600,460]
[2,367.08,"8 INCH CAST IRON PLUG","EA",6,1,315,288.33]
[2,367.12,"12 INCH CAST IRON PLUG","EA",8,1,450,416.5]
[2,369.12,"12 X 12 INCH TAPPING SLEEVE, VALVE AND BOX","EA",3,1,11000,10666.67]
[2,369.24,"24 X 24 INCH TAPPING SLEEVE, VALVE AND BOX","EA",4,1,57000,59750]
[2,370.1,"8 X 6 INCH TAPPING SLEEVE, VALVE AND BOX","EA",11,2,6000,5345.45]
[2,370.2,"10 X 6 INCH TAPPING SLEEVE, VALVE AND BOX","EA",18,2,7000,6381.82]
[2,370.4,"12 X 6 INCH TAPPING SLEEVE, VALVE AND BOX","EA",32,1,7250,7125]
[2,370.5,"12 X 8 INCH TAPPING SLEEVE, VALVE AND BOX","EA",56,1,8100,7925]
[2,371.06,"6 INCH COUPLING","EA",44,2,730,722.86]
[2,371.08,"8 INCH COUPLING","EA",24,2,862.5,754.17]
[2,371.12,"12 INCH COUPLING","EA",12,2,1000,938.5]
[2,371.16,"16 INCH COUPLING","EA",3,1,2500,2333.33]
[2,371.18,"18 INCH COUPLING","EA",16,1,2400,2100]
[2,371.24,"24 INCH COUPLING","EA",9,1,9500,9666.67]
[2,373.24,"24 INCH WATER PIPE INSULATION","FT",1440,1,264.89999999999998,269.95]
[2,376,"HYDRANT","EA",144,5,5300,5462.61]
[2,376.2,"HYDRANT - REMOVED AND RESET","EA",71,6,2875,2741.67]
[2,376.3,"HYDRANT - REMOVED AND STACKED","EA",47,3,800,796.67]
[2,376.5,"HYDRANT - ADJUSTED","EA",110,3,1450,1506.25]
[2,379.1,"1 INCH AIR RELEASE VALVE","EA",4,1,1750,1612.5]
[2,381,"SERVICE BOX","EA",356,8,375,359.02]
[2,381.1,"SERVICE BOX REMOVED AND RESET","EA",45,2,200,202.22]
[2,381.2,"SERVICE BOX REMOVED AND STACKED","EA",188,3,100,91.88]
[2,381.3,"SERVICE BOX ADJUSTED","EA",450,10,200,206.95]
[2,384,"CURB STOP","EA",317,4,400,420.67]
[2,402,"DENSE GRADED CRUSHED STONE FOR SUB-BASE","CY",70660,16,67,69.08]
[2,402.1,"DENSE GRADED CRUSHED STONE FOR SUB-BASE","TON",4480,1,55,55.86]
[2,402.11,"DENSE GRADED CRUSHED STONE FOR SHOULDERS","TON",150,1,100,105.09]
[2,402.13,"PAVEMENT MILLING MULCH FOR SHOULDERS","FT",51930,5,8,7.88]
[2,403.1,"CRUSHED STONE FOR BLENDING","TON",750,1,40,35]
[2,415.1,"PAVEMENT STANDARD MILLING","SY",562080,4,5,4.74]
[2,415.2,"PAVEMENT FINE MILLING","SY",1740248,8,7.5,6.09]
[2,415.3,"PAVEMENT MICRO MILLING","SY",607170,5,4,3.59]
[2,415.4,"BRIDGE PAVEMENT MILLING","SY",11090,4,20,18.350000000000001]
[2,430,"CEMENT CONCRETE BASE COURSE","SY",16665,11,63.5,62.44]
[2,431,"HIGH EARLY STRENGTH CEMENT CONCRETE BASE COURSE","SY",5850,3,70,79]
[2,440,"CALCIUM CHLORIDE FOR ROADWAY DUST CONTROL","LB",2086745,16,0.4,0.41]
[2,443,"WATER FOR ROADWAY DUST CONTROL","MGL",2640.9,16,75,78.62]
[2,450.22,"SUPERPAVE SURFACE COURSE â€“ 9.5 (SSC â€“ 9.5)","TON",29280,4,106.5,106.84]
[2,450.221,"SUPERPAVE SURFACE COURSE â€“ 9.5 POLYMER (SSC â€“ 9.5 - P)","TON",27240,2,92.5,103.8]
[2,450.23,"SUPERPAVE SURFACE COURSE - 12.5 (SSC - 12.5)","TON",124871,10,90.5,108.93]
[2,450.23099999999999,"SUPERPAVE SURFACE COURSE - 12.5 POLYMER (SSC - 12.5 - P)","TON",178210,9,95,94.84]
[2,450.24,"SUPERPAVE SURFACE COURSE â€“ 19.0 (SSC â€“ 19.0)","TON",12390,1,83,86.64]
[2,450.31,"SUPERPAVE INTERMEDIATE COURSE - 12.5 (SIC -12.5)","TON",8180,3,115,110.35]
[2,450.31099999999998,"SUPERPAVE INTERMEDIATE COURSE - 12.5 POLYMER (SIC -12.5 - P)","TON",33990,2,86,87.7]
[2,450.32,"SUPERPAVE INTERMEDIATE COURSE - 19.0 (SIC - 19.0)","TON",184995,15,90,98.39]
[2,450.42,"SUPERPAVE BASE COURSE - 37.5 (SBC - 37.5)","TON",195500,16,90,92.74]
[2,450.53,"SUPERPAVE LEVELING COURSE - 12.5 (SLC - 12.5)","TON",600,1,146,138]
[2,450.6,"SUPERPAVE BRIDGE SURFACE COURSE - 9.5 (SSC-B - 9.5)","TON",5052,5,217.5,280.83999999999997]
[2,450.601,"SUPERPAVE BRIDGE SURFACE COURSE - 9.5 POLYMER (SSC-B - 9.5 - P)","TON",140,1,235,229.29]
[2,450.61,"SUPERPAVE BRIDGE SURFACE COURSE - 12.5 (SSC-B - 12.5)","TON",497,3,200,279.07]
[2,450.61099999999999,"SUPERPAVE BRIDGE SURFACE COURSE - 12.5 POLYMER (SSC-B - 12.5 - P)","TON",425,1,135,136]
[2,450.7,"SUPERPAVE BRIDGE PROTECTIVE COURSE - 9.5 (SPC-B - 9.5)","TON",3458,3,202.5,189.57]
[2,450.71,"SUPERPAVE BRIDGE PROTECTIVE COURSE â€“ 12.5 (SPC-B - 12.5)","TON",2007,5,297.5,268.41000000000003]
[2,450.71100000000001,"SUPERPAVE BRIDGE PROTECTIVE COURSE â€“ 12.5POLYMER (SPC-B - 12.5 - P)","TON",425,1,135,136]
[2,450.8,"ASPHALT RUBBER GAP GRADED - 12.5 (ARGG - 12.5)","TON",115600,2,124,126.64]
[2,451,"HMA FOR PATCHING","TON",19631,30,200,198.85]
[2,452,"ASPHALT EMULSION FOR TACK COAT","GAL",483651,28,9,8.33]
[2,453,"HMA JOINT SEALANT","FT",1044479,19,1,0.86]
[2,457.1,"SUPERPAVE WATERPROOFING SURFACE COURSE - 9.5 (SSC-W-9.5)","TON",8030,3,262.5,248.9]
[2,470,"HOT MIX ASPHALT BERM","TON",1486,8,210,213.14]
[2,472,"TEMPORARY ASPHALT PATCHING","TON",24393,25,200,197.38]
[2,477,"MILLED RUMBLE STRIP (TYPE A)","FT",741200,5,2.4,2.92]
[2,477.1,"MILLED RUMBLE STRIP (TYPE B)","FT",20000,1,6.6,6.3]
[2,482.01,"HOT APPLIED ASPHALTIC CRACK FILLER","FT",5000,2,2.75,2.5]
[2,482.3,"SAWCUTTING ASPHALT PAVEMENT","FT",126025,3,3,3.7]
[2,482.31,"SAWING & SEALING JOINTS IN ASPHALT PAVEMENT AT BRIDGES","FT",8476,9,30,30.69]
[2,482.4,"SAWCUTTING PORTLAND CEMENT CONCRETE","FT",390,3,5,5.67]
[2,482.5,"SAWCUTTING ASPHALT PAVEMENT FOR BOX WIDENING","FT",188770,9,2.88,2.57]
[2,485,"GRANITE RUBBLE BLOCK PAVEMENT","SY",300,1,345,320]
[2,485.2,"GRANITE RUBBLE BLOCK PAVEMENT EXCL. COST OF CONCRETE BASE","SY",360,1,259,258.25]
[2,504,"GRANITE CURB TYPE VA4 - STRAIGHT","FT",193536,13,50,51.02]
[2,504.1,"GRANITE CURB TYPE VA4 - CURVED","FT",19300,8,57,57.23]
[2,504.2,"GRANITE CURB TYPE VA4 - SPLAYED END","EA",267,8,400,412]
[2,505,"GRANITE CURB TYPE VA5 - STRAIGHT","FT",2275,2,69,71.06]
[2,505.1,"GRANITE CURB TYPE VA5 - CURVED","FT",75,1,98,96]
[2,506,"GRANITE CURB TYPE VB - STRAIGHT","FT",146689,8,45,48.9]
[2,506.1,"GRANITE CURB TYPE VB - CURVED","FT",21185,8,54,58.88]
[2,509,"GRANITE TRANSITION CURB FOR PEDESTRIAN CURB RAMPS - STRAIGHT","FT",30490,17,55,56.23]
[2,509.1,"GRANITE TRANSITION CURB FOR PEDESTRIAN CURB RAMPS - CURVED","FT",20275,16,60,63.86]
[2,510,"GRANITE EDGING TYPE SA","FT",1657,3,45,47.21]
[2,510.1,"GRANITE EDGING TYPE SA (RADIUS 10 FEET OR LESS)","FT",394,2,64,62.46]
[2,511.1,"GRANITE EDGING TYPE SB - STRAIGHT","FT",15635,6,38,36.700000000000003]
[2,512.1,"GRANITE EDGING TYPE SB (RADIUS 10 FEET OR LESS)","FT",1265,5,50,50.07]
[2,514,"GRANITE CURB INLET - STRAIGHT","EA",1140,12,450,451.33]
[2,515,"GRANITE CURB INLET - CURVED","EA",136,6,500,503.29]
[2,516,"GRANITE CURB CORNER TYPE A","EA",665,6,300,325.2]
[2,517,"GRANITE CURB CORNER TYPE B","EA",12,1,450,421.33]
[2,517.01,"GRANITE CURB CORNER - TYPE C","EA",16,1,350,315]
[2,520,"CONCRETE CURB TYPE VA","FT",1320,2,51,58.17]
[2,570,"HOT MIX ASPHALT CURB - OPTION","FT",1680,1,18.5,17]
[2,570.20000000000005,"HOT MIX ASPHALT CURB TYPE 2","FT",14715,6,11,13.32]
[2,570.29999999999995,"HOT MIX ASPHALT CURB TYPE 3","FT",6555,3,10,12.04]
[2,572.20000000000005,"HOT MIX ASPHALT CURB TYPE 2","TON",300,1,155,156.66999999999999]
[2,580,"CURB REMOVED AND RESET","FT",48064,13,30,29.95]
[2,581,"CURB INLET REMOVED AND RESET","EA",104,5,200,186]
[2,582,"CURB CORNER REMOVED AND RESET","EA",6,1,200,190]
[2,583,"EDGING REMOVED AND RESET","FT",48657,5,28.5,27.29]
[2,590,"CURB REMOVED AND STACKED","FT",38580,4,5,4.93]
[2,591,"CURB INLET REMOVED AND STACKED","EA",138,2,50,47.19]
[2,592,"CURB CORNER REMOVED AND STACKED","EA",180,3,50,46.11]
[2,594,"CURB REMOVED AND DISCARDED","FT",28965,13,5,5.25]
[2,595,"CURB INLET REMOVED AND DISCARDED","EA",81,4,50,50]
[2,596,"CURB CORNER REMOVED AND DISCARDED","EA",85,3,30,38.85]
[2,597,"EDGING REMOVED AND DISCARDED","FT",15377,5,5,4.95]
[2,620.12,"GUARDRAIL, TL-2 (SINGLE FACED)","FT",14976,6,29,28.76]
[2,620.13,"GUARDRAIL, TL-3 (SINGLE FACED)","FT",255480,11,30,30.65]
[2,620.13099999999997,"GUARDRAIL, DEEP POST (SINGLE FACED)","FT",900,1,51.5,49.67]
[2,620.32000000000005,"GUARDRAIL - CURVED, TL-2 (SINGLE FACED)","FT",840,1,33.5,32.5]
[2,620.33000000000004,"GUARDRAIL - CURVED, TL-3 (SINGLE FACED)","FT",2378,4,32.25,32.36]
[2,621.13,"GUARDRAIL, TL-3 (DOUBLE FACED)","FT",123250,1,39.75,40.130000000000003]
[2,627.1,"TRAILING ANCHORAGE","EA",215,9,1940,1935.67]
[2,627.82000000000005,"GUARDRAIL TANGENT END TREATMENT, TL-2","EA",55,6,4235,4424.66]
[2,627.83000000000004,"GUARDRAIL TANGENT END TREATMENT, TL-3","EA",518,12,4345,4296.43]
[2,627.91999999999996,"GUARDRAIL FLARED END TREATMENT, TL-2","EA",28,1,4450,4408.75]
[2,627.92999999999995,"GUARDRAIL FLARED END TREATMENT, TL-3","EA",35,2,4500,4524.6400000000003]
[2,628.21,"TRANSITION TO NCHRP 350 GUARDRAIL","EA",255,11,1800,1790.19]
[2,628.22,"TRANSITION TO RIGID BARRIER (SINGLE FACED)","EA",24,1,5675,5679.17]
[2,628.23,"TRANSITION TO RIGID BARRIER (DOUBLE FACED)","EA",3,1,8000,7783.33]
[2,628.24,"TRANSITION TO BRIDGE RAIL","EA",416,8,4500,4686.22]
[2,628.25,"TRANSITION TO THRIE BEAM","EA",6,1,500,493.67]
[2,628.30999999999995,"IMPACT ATTENUATOR FOR SHOULDER, INCAPABLE OF REDIRECTION","EA",4,1,10000,8750]
[2,628.34,"IMPACT ATTENUATOR FOR MEDIAN, CAPABLE OF REDIRECTION","EA",52,3,42000,40161.15]
[2,629.4,"CAST-IN-PLACE CONCRETE MEDIAN BARRIER - DOUBLE FACED","FT",13350,1,347,330.67]
[2,629.5,"CAST-IN-PLACE MEDIAN BARRIER CAP","CY",100,1,705,810]
[2,630,"HIGHWAY GUARD REMOVED AND RESET","FT",3375,2,24,23.63]
[2,630.1,"HIGHWAY GUARD REMOVED AND STACKED","FT",3046,2,8.75,10.65]
[2,630.20000000000005,"HIGHWAY GUARD REMOVED AND DISCARDED","FT",280100,15,5.5,5.46]
[2,632,"GUARDRAIL POST - STEEL","EA",220,2,125,127.86]
[2,632.20000000000005,"INDIVIDUAL POST REMOVED AND RESET","EA",12,1,100,101.67]
[2,633,"GUARDRAIL OFFSET BLOCK - W BEAM","EA",220,2,16,16.04]
[2,634,"W BEAM GUARD PANEL","EA",170,2,250,254.71]
[2,644.14800000000002,"48 INCH CHAIN LINK FENCE (SPRING TENSION WIRE) VINYL COATED (LINE POST OPTION)","FT",2890,2,56,54.74]
[2,644.17200000000003,"72 INCH CHAIN LINK FENCE (SPRING TENSION WIRE) VINYL COATED (LINE POST OPTION)","FT",6820,2,55.75,55.87]
[2,645.072,"72 INCH CHAIN LINK FENCE (PIPE TOP RAIL) (LINE POST OPTION)","FT",2730,1,55,55.86]
[2,645.14800000000002,"48 INCH CHAIN LINK FENCE (PIPE TOP RAIL) VINYL COATED (LINE POST OPTION)","FT",595,1,40,42.14]
[2,645.17200000000003,"72 INCH CHAIN LINK FENCE (PIPE TOP RAIL) VINYL COATED (LINE POST OPTION)","FT",7700,1,60,61.14]
[2,650.048,"48 INCH CHAIN LINK GATE WITH GATE POSTS","FT",200,1,204.25,187.13]
[2,652.048,"48 INCH CHAIN LINK FENCE END POST","EA",28,2,420,392.38]
[2,652.072,"72 INCH CHAIN LINK FENCE END POST","EA",194,4,405,432.25]
[2,653.048,"48 INCH CHAIN LINK FENCE CORNER OR INTERMEDIATE BRACE POST","EA",40,1,387.5,387.25]
[2,653.072,"72 INCH CHAIN LINK FENCE CORNER OR INTERMEDIATE BRACE POST","EA",353,2,277.5,249.25]
[2,655,"CEDAR RAIL FENCE","FT",1260,1,73,73.709999999999994]
[2,657,"TEMPORARY FENCE","FT",15960,5,18,18.3]
[2,657.5,"TEMPORARY FENCE REMOVED AND RESET","FT",5825,2,10.5,11.17]
[2,665,"CHAIN LINK FENCE REMOVED AND STACKED","FT",2690,3,4,3.44]
[2,666,"CHAIN LINK FENCE REMOVED AND RESET","FT",3470,6,56.5,57.3]
[2,668,"CHAIN LINK FENCE GATE W/GATE POSTS REMOVED & RESET","EA",5,1,1550,1580]
[2,669,"FENCE REMOVED AND STACKED","FT",490,2,6,7.75]
[2,670,"FENCE REMOVED AND RESET","FT",1056,4,70,67.34]
[2,672,"FENCE GATE AND GATE POSTS REMOVED AND RESET","EA",7,1,2000,1978.57]
[2,685,"STONE MASONRY WALL IN CEMENT MORTAR","CY",1523.8,3,850,811.5]
[2,690.1,"STONE MASONRY WALL REMOVED AND REBUILT DRY","CY",60,1,735,755]
[2,697,"SEDIMENTATION FENCE","FT",2998,4,8.5,11.75]
[2,697.1,"SILT SACK","EA",2886,14,150,152.54]
[2,698.1,"GEOTEXTILE FABRIC FOR STABILIZATION","SY",5075,1,5,4.6399999999999997]
[2,698.2,"GEOTEXTILE FABRIC FOR SUBSURFACE DRAINAGE","SY",8420,2,7,7.08]
[2,698.3,"GEOTEXTILE FABRIC FOR SEPARATION","SY",17490,8,6,5.69]
[2,698.4,"GEOTEXTILE FABRIC FOR PERMANENT EROSION CONTROL","SY",30860,4,5,5.39]
[2,701,"CEMENT CONCRETE SIDEWALK","SY",106306,15,65,68.5]
[2,701.1,"CEMENT CONCRETE SIDEWALK AT DRIVEWAYS","SY",20785,10,70,73.23]
[5,874.7,"MISCELLANEOUS SIGNS REMOVED AND STACKED","EA",27,2,50,47.14]
[5,877,"SIGN POST REMOVED AND RESET","EA",600,1,85,85]
[5,877.1,"SIGN POST REMOVED AND DISCARDED","EA",788,2,15,14.4]
[5,901,"4000 PSI, 1.5 INCH, 565 CEMENT CONCRETE","CY",953,7,1200,1158.76]
[5,901.3,"4000 PSI, 1.5 INCH, 565 CEMENT CONCRETE FOR POST FOUNDATION","CY",2,1,1525,1525]
[5,903,"3000 PSI, 1.5 INCH, 470 CEMENT CONCRETE","CY",849,11,495.56,443.76]
[5,904,"4000 PSI, 3/4 INCH, 610 CEMENT CONCRETE","CY",10,1,2550,2267]
[5,904.3,"5000 PSI, 3/4 INCH, 685 HP CEMENT CONCRETE","CY",413,3,4494.5,4712.3100000000004]
[5,905,"4000 PSI, 3/8 INCH, 660 CEMENT CONCRETE","CY",276,8,4775,5064.2]
[5,909.2,"CEMENTITIOUS MORTAR FOR PATCHING","SF",5250,3,85,86.12]
[5,910,"STEEL REINFORCEMENT FOR STRUCTURES","LB",330,2,9,8.1199999999999992]
[5,910.1,"STEEL REINFORCEMENT FOR STRUCTURES - EPOXY COATED","LB",246330,16,3.68,3.56]
[5,912,"DRILLING AND GROUTING DOWELS","EA",11576,2,65,70.67]
[5,920,"GRANITE CAPSTONE","FT",250,1,177.5,185]
[5,942.10199999999998,"STEEL PILE HP 10 X 57","FT",4900,1,192.5,192.57]
[5,945.202,"ROCK SOCKET EXCAVATION 3.5 FOOT DIAMETER","FT",60,1,10,8.33]
[5,948.41,"DYNAMIC LOAD TEST BY CONTRACTOR","EA",28,1,6800,6900]
[5,948.5,"PILE SHOES","EA",56,1,150,137.5]
[5,961.20100000000002,"CLEAN (FULL REMOVAL) AND PAINT STEEL BRIDGE NO. ________","LS",24,4,612000,619118.93000000005]
[5,961.202,"CLEAN (FULL REMOVAL) AND PAINT STEEL BRIDGE NO. ________","LS",9,2,500000,475795.41]
[5,965,"MEMBRANE WATERPROOFING FOR BRIDGE DECKS","SY",1630,4,50,44.32]
[5,966,"MEMBRANE WATERPROOFING FOR BRIDGE DECK REPAIRS","SF",30780,2,3.8,3.21]
[5,970,"BITUMINOUS DAMP-PROOFING","SY",328,1,26,28]
[5,975.4,"PROTECTIVE SCREEN TYPE II","FT",2550,1,690,739.8]
[5,975.5,"ALUMINUM HANDRAIL","FT",485,1,467.5,502]
[5,983,"DUMPED RIPRAP","TON",2520,3,88,86.2]
[5,983.1,"RIPRAP","TON",2256,2,89,90.84]
[5,983.11,"MODIFIED RIPRAP","TON",1000,1,105,102]
[5,985.01,"SLOPE PAVING REMOVED AND RESET","SY",720,1,192.5,182.65]
[5,986,"MODIFIED ROCKFILL","TON",33972,6,90,92.76]
[5,987.02,"SPECIAL SLOPE PAVING UNDER BRIDGE REMOVED AND RESET","SY",2775,2,57.5,48.67]
[5,988,"CHANNEL PAVING","SY",1120,1,110.18,106.19]
[5,991.1,"CONTROL OF WATER - STRUCTURE NO. ______","LS",7,1,416750,401357.14]
[5,991.2,"CONTROL OF WATER - STRUCTURE NO. ______","LS",4,1,326650,325825]
[5,992.1,"ALTERATION TO BRIDGE STRUCTURE NO. ______","LS",14,2,590000,550785.71]
[5,994.01,"TEMPORARY PROTECTIVE SHIELDING BRIDGE NO. _______________","LS",2,2,50000,50000]
[5,994.1,"TEMPORARY PROTECTIVE SHIELDING","SF",43850,5,9.06,10.029999999999999]
[5,995.01,"BRIDGE STRUCTURE, BRIDGE NO. ______","LS",2,2,3900500,3900500]
[5,995.02,"BRIDGE STRUCTURE, BRIDGE NO. _______","LS",7,1,14100000,14071513.710000001]
[5,995.03,"BRIDGE STRUCTURE, BRIDGE NO. _______","LS",8,1,9500000,8953250]
[5,996.01,"WALL STRUCTURE, WALL NO. ________________","LS",8,1,641500,605375]
[6,100,"SCHEDULE OF OPERATIONS - FIXED PRICE $__________","LS",28,6,13000,12348.21]
[6,100.002,"LABORER","HR",5922,5,102.5,111.82]
[6,100.1,"BASE LABOR RATE","HR",103670,7,122,122.1]
[6,100.5,"ELECTRICAL WORK","LS",1,1,15960548,15960548]
[6,100.61,"HVAC WORK","LS",1,1,1111000,1111000]
[6,100.71,"MASONRY WORK","LS",1,1,1843100,1843100]
[6,100.75,"PAINTING","LS",1,1,1219860,1219860]
[6,100.78,"MISCELLANEOUS AND ORNAMENTAL IRON WORK","LS",5,1,822000,910400]
[6,101,"CLEARING AND GRUBBING","A",2.2000000000000002,3,50000,45176.47]
[6,101.1,"CLEARING","A",36,1,16174,15587]
[6,102.1,"TREE TRIMMING","FT",1425,1,20,20.6]
[6,102.2,"TREE TRIMMING","LS",10,1,10000,9775]
[6,102.3,"HERBICIDE TREATMENT FOR INVASIVE PLANTS","HR",384,1,562.5,552.91999999999996]
[6,102.33,"INVASIVE PLANT MANAGEMENT STRATEGY","HR",72,1,295,291]
[6,102.511,"TREE PROTECTION â€“ ARMORING & PRUNING","EA",180,3,350,329.94]
[6,102.521,"TREE AND PLANT PROTECTION FENCE","FT",2030,4,10,10.210000000000001]
[6,103,"TREE REMOVED - DIAMETER UNDER 24 INCHES","EA",237,3,1700,1568.56]
[6,104,"TREE REMOVED - DIAMETER 24 INCHES AND OVER","EA",88,1,1837,1743.5]
[6,105,"STUMP REMOVED","EA",15,1,299.5,266.33]
[6,106.87,"JACKING SUPERSTRUCTURE","LS",2,1,800400,875200]
[6,106.88,"JACKING AND SHORING","EA",68,1,2275,2275]
[6,107.48,"PREFORMED JOINT FILLER","FT",2072,1,9.85,9.85]
[6,107.96,"STRUCTURAL STEEL REPAIRS","LS",5,1,600000,614200]
[6,107.97,"STRUCTURAL STEEL REPAIRS","LB",55975,2,27,28]
[6,120,"EARTH EXCAVATION","CY",22000,1,48.25,45]
[6,120.1,"UNCLASSIFIED EXCAVATION","CY",2615,9,80,81.739999999999995]
[6,121,"CLASS A ROCK EXCAVATION","CY",495,1,147.5,138.22]
[6,127.1,"REINFORCED CONCRETE EXCAVATION","CY",22,2,1375,1166.67]
[6,127.4,"REINFORCED CONCRETE DECK EXCAVATION (FULL DEPTH)","SY",565,2,1425,1695]
[6,127.41,"REINFORCED CONCRETE DECK EXCAVATION (PARTIAL DEPTH)","CY",526,2,6000,5003.33]
[6,129.19999999999999,"OLD PAVEMENT EXCAVATION","SY",4130,1,25,30]
[6,129.6,"BRIDGE PAVEMENT EXCAVATION","SY",185,1,20,50]
[6,140,"BRIDGE EXCAVATION","CY",1600,1,60,56.25]
[6,141.1,"TEST PIT FOR EXPLORATION","CY",788,4,122.5,126.25]
[6,142,"CLASS B TRENCH EXCAVATION","CY",960,1,50,45.17]
[6,144,"CLASS B ROCK EXCAVATION","CY",53,2,215,222.5]
[6,146,"DRAINAGE STRUCTURE REMOVED","EA",42,2,1100,1112.27]
[6,150,"ORDINARY BORROW","CY",1345,3,35,29.8]
[6,150.1,"SPECIAL BORROW","CY",500,1,44,47.75]
[6,151,"GRAVEL BORROW","CY",16335,6,50,55.11]
[6,151.01,"GRAVEL BORROW - TYPE C","CY",180,1,50,43.33]
[6,151.1,"GRAVEL BORROW FOR BRIDGE FOUNDATION","CY",385,1,75,83]
[6,151.19999999999999,"GRAVEL BORROW FOR BACKFILLING STRUCTURES AND PIPES","CY",775,1,75,73]
[6,153,"CONTROLLED DENSITY FILL - EXCAVATABLE","CY",24,3,275,275]
[6,156,"CRUSHED STONE","TON",2395,6,42.75,41.69]
[6,170,"FINE GRADING AND COMPACTING - SUBGRADE AREA","SY",65624,6,11.53,10.98]
[6,180.01,"ENVIRONMENTAL HEALTH AND SAFETY PROGRAM","LS",14,3,8000,7371.43]
[6,180.02,"PERSONAL PROTECTION LEVEL C UPGRADE","HR",2230,5,10,8.33]
[6,180.03,"LICENSED SITE PROFESSIONAL SERVICES","HR",2310,5,127.5,131.05000000000001]
[6,181.11,"DISPOSAL OF UNREGULATED SOIL","TON",2805,4,46,44.5]
[6,181.12,"DISPOSAL OF REGULATED SOIL - IN-STATE FACILITY","TON",1335,4,75,76.400000000000006]
[6,181.13,"DISPOSAL OF REGULATED SOIL - OUT-OF-STATE FACILITY","TON",740,4,135,145]
[6,181.14,"DISPOSAL OF HAZARDOUS WASTE","TON",430,3,430,425.63]
[6,182.1,"INSPECTION AND TESTING FOR ASBESTOS","LS",6,1,1700,1526.67]
[6,182.2,"REMOVAL OF ASBESTOS","FT",140,1,197.5,183.57]
[6,182.3,"ASBESTOS ABATEMENT FOR BUILDING DEMOLITION","LS",1,1,50000,50000]
[6,183.1,"TREATMENT OF CONTAMINATED GROUNDWATER","GAL",44000,2,4,4.05]
[6,183.2,"DISPOSAL OF GRANULAR ACTIVATED CARBON","LB",6000,1,5,3.7]
[6,184.1,"DISPOSAL OF TREATED WOOD PRODUCTS","TON",24,2,500,498.85]
[6,188.1,"TESTING OF PCB BALLASTS","LS",1,1,9000,9000]
[6,188.2,"DISPOSAL OF PCB BALLASTS","LS",1,1,35000,35000]
[6,188.3,"DISPOSAL OF MERCURY CONTAINING LAMPS","EA",400,1,70,70]
[6,188.4,"DISPOSAL OF MERCURY CONTAINING DEVICES","EA",10,1,9500,9500]
[6,191,"DRIVE SAMPLE BORING","FT",610,1,70,66.42]
[6,193,"MOBILIZATION AND DISMANTLING OF BORING EQUIPMENT","LS",4,1,3000,2500]
[6,201,"CATCH BASIN","EA",195,2,5850,6041.38]
[6,202,"MANHOLE","EA",94,2,6550,6534.36]
[6,204,"GUTTER INLET","EA",40,1,2500,2710.3]
[6,206,"DROP INLET, TYPE A","EA",4,1,7385,7385]
[6,220,"DRAINAGE STRUCTURE ADJUSTED","EA",925,5,462.5,472.91]
[6,220.2,"DRAINAGE STRUCTURE REBUILT","FT",761,5,550,477.68]
[6,220.3,"DRAINAGE STRUCTURE CHANGE IN TYPE","EA",27,1,1400,1283.54]
[6,220.5,"DRAINAGE STRUCTURE REMODELED","EA",20,1,800,752.52]
[6,220.6,"SANITARY STRUCTURE REBUILT","FT",110,1,566.04999999999995,516.1]
[6,220.7,"SANITARY STRUCTURE ADJUSTED","EA",303,4,462.5,445.64]
[6,221,"FRAME AND COVER","EA",30,3,900,824]
[6,221.1,"FRAME AND COVER - SECURED","EA",270,3,1302.5,1167.5]
[6,222,"FRAME AND GRATE - MASSDOT BAR TYPE","EA",388,3,750,650.6]
[6,222.1,"FRAME AND GRATE - MASSDOT CASCADE TYPE","EA",302,4,1150,1166.25]
[6,222.3,"FRAME AND GRATE (OR COVER) MUNICIPAL STANDARD","EA",564,1,950,932.84]
[6,223.1,"FRAME AND GRATE (OR COVER) REMOVED AND STACKED","EA",120,1,137.5,128.91999999999999]
[6,223.2,"FRAME AND GRATE (OR COVER) REMOVED AND DISCARDED","EA",51,2,80,80]
[6,225.52,"TRAP AND HOOD MUNICIPAL STANDARD","EA",180,1,575,587.75]
[6,227.3,"REMOVAL OF DRAINAGE STRUCTURE SEDIMENT","CY",1254,6,250,228.83]
[6,227.31,"REMOVAL OF DRAINAGE PIPE SEDIMENT","FT",18980,4,10,9.17]
[6,227.4,"MASONRY PLUG","SF",4,1,300,337.5]
[6,234.12,"12 INCH DRAINAGE PIPE - OPTION","FT",8800,1,124.5,119.27]
[6,235.12,"12 INCH DRAINAGE PIPE FLARED END - OPTION","EA",14,1,1075,1092.8599999999999]
[6,238.1,"10 INCH DUCTILE IRON PIPE","FT",4416,2,162.5,155.38]
[6,238.12,"12 INCH DUCTILE IRON PIPE","FT",180,1,170,170]
[6,241.12,"12 INCH REINFORCED CONCRETE PIPE","FT",1260,1,150,150]
[6,241.18,"18 INCH REINFORCED CONCRETE PIPE","FT",30,1,167.5,167.5]
[6,241.24,"24 INCH REINFORCED CONCRETE PIPE","FT",350,1,130,115]
[6,242.12,"12 INCH REINFORCED CONCRETE PIPE FLARED END","EA",10,1,1675,1675]
[6,242.24,"24 INCH REINFORCED CONCRETE PIPE FLARED END","EA",3,1,3000,2800]
[6,252.12,"12 INCH CORRUGATED PLASTIC PIPE","FT",38,1,142.5,142.5]
[6,258,"STONE FOR PIPE ENDS","SY",174,2,100,100]
[6,309,"DUCTILE IRON FITTINGS FOR WATER PIPE","LB",490,1,8.25,8.5]
[6,347.1,"1 INCH COPPER TUBING TYPE K","FT",200,1,107,101.75]
[6,347.2,"2 INCH COPPER TUBING TYPE K","FT",175,1,130,115.71]
[6,358,"GATE BOX ADJUSTED","EA",607,5,250,262.35000000000002]
[6,381,"SERVICE BOX","EA",12,1,340,272.5]
[6,381.3,"SERVICE BOX ADJUSTED","EA",189,4,262.5,251.65]
[6,384,"CURB STOP","EA",7,1,475,450]
[6,402.1,"DENSE GRADED CRUSHED STONE FOR SUB-BASE","TON",1260,1,73.5,69.44]
[6,402.11,"DENSE GRADED CRUSHED STONE FOR SHOULDERS","TON",332,1,80,80]
[6,415.1,"PAVEMENT STANDARD MILLING","SY",363600,2,4.22,3.99]
[6,415.2,"PAVEMENT FINE MILLING","SY",72000,1,10,11.18]
[6,415.3,"PAVEMENT MICRO MILLING","SY",30000,1,7.13,7.13]
[6,415.4,"BRIDGE PAVEMENT MILLING","SY",67950,2,26.25,34.130000000000003]
[6,431,"HIGH EARLY STRENGTH CEMENT CONCRETE BASE COURSE","SY",9600,1,56.9,58.4]
[6,440,"CALCIUM CHLORIDE FOR ROADWAY DUST CONTROL","LB",76500,1,0.5,0.44]
[6,443,"WATER FOR ROADWAY DUST CONTROL","MGL",120.12,2,80,78.86]
[6,450.1,"OPEN GRADED FRICTION COURSE - 9.5 - POLYMER MODIFIED (OGFC â€“ P)","TON",1800,1,180,180]
[6,450.22,"SUPERPAVE SURFACE COURSE â€“ 9.5 (SSC â€“ 9.5)","TON",8610,2,190,201.72]
[6,450.221,"SUPERPAVE SURFACE COURSE â€“ 9.5 POLYMER (SSC â€“ 9.5 - P)","TON",3800,1,176,176]
[6,450.23,"SUPERPAVE SURFACE COURSE - 12.5 (SSC - 12.5)","TON",56360,3,112,120.04]
[6,450.23099999999999,"SUPERPAVE SURFACE COURSE - 12.5 POLYMER (SSC - 12.5 - P)","TON",24638,2,347.5,321]
[6,450.31,"SUPERPAVE INTERMEDIATE COURSE - 12.5 (SIC -12.5)","TON",1990,2,200,194.07]
[6,450.32,"SUPERPAVE INTERMEDIATE COURSE - 19.0 (SIC - 19.0)","TON",675,2,230,224.67]
[6,450.42,"SUPERPAVE BASE COURSE - 37.5 (SBC - 37.5)","TON",1800,1,180,180.67]
[6,450.53,"SUPERPAVE LEVELING COURSE - 12.5 (SLC - 12.5)","TON",900,1,205,210]
[6,450.601,"SUPERPAVE BRIDGE SURFACE COURSE - 9.5 POLYMER (SSC-B - 9.5 - P)","TON",1700,1,300,300]
[6,450.7,"SUPERPAVE BRIDGE PROTECTIVE COURSE - 9.5 (SPC-B - 9.5)","TON",15,1,1,1]
[6,451,"HMA FOR PATCHING","TON",4999,7,270,250.75]
[6,452,"ASPHALT EMULSION FOR TACK COAT","GAL",67063,7,10,8.31]
[6,453,"HMA JOINT SEALANT","FT",344387,7,1.5,1.56]
[6,457.1,"SUPERPAVE WATERPROOFING SURFACE COURSE - 9.5 (SSC-W-9.5)","TON",2384,1,367.5,367.5]
[6,470,"HOT MIX ASPHALT BERM","TON",220,3,305,297.5]
[6,472,"TEMPORARY ASPHALT PATCHING","TON",2702,7,237.5,236.57]
[6,477,"MILLED RUMBLE STRIP (TYPE A)","FT",106400,2,1.74,2.5099999999999998]
[6,477.1,"MILLED RUMBLE STRIP (TYPE B)","FT",3000,1,15,15.24]
[6,482.31,"SAWING & SEALING JOINTS IN ASPHALT PAVEMENT AT BRIDGES","FT",1100,1,52.38,52.38]
[6,482.4,"SAWCUTTING PORTLAND CEMENT CONCRETE","FT",800,1,5.75,5.75]
[6,504,"GRANITE CURB TYPE VA4 - STRAIGHT","FT",55835,4,51.3,53.68]
[6,504.1,"GRANITE CURB TYPE VA4 - CURVED","FT",5607,4,60,60.8]
[6,504.2,"GRANITE CURB TYPE VA4 - SPLAYED END","EA",15,1,500,508.33]
[6,505,"GRANITE CURB TYPE VA5 - STRAIGHT","FT",40,1,67.5,67.5]
[6,506,"GRANITE CURB TYPE VB - STRAIGHT","FT",20,1,62.5,62.5]
[6,509,"GRANITE TRANSITION CURB FOR PEDESTRIAN CURB RAMPS - STRAIGHT","FT",5250,3,55,56.27]
[6,509.1,"GRANITE TRANSITION CURB FOR PEDESTRIAN CURB RAMPS - CURVED","FT",2400,3,64.66,63.95]
[6,511.1,"GRANITE EDGING TYPE SB - STRAIGHT","FT",108,2,50,50]
[6,514,"GRANITE CURB INLET - STRAIGHT","EA",189,3,475,483.22]
[6,516,"GRANITE CURB CORNER TYPE A","EA",79,3,340,390]
[6,570.20000000000005,"HOT MIX ASPHALT CURB TYPE 2","FT",320,2,51,47.83]
[6,570.29999999999995,"HOT MIX ASPHALT CURB TYPE 3","FT",3800,2,18,17.77]
[6,580,"CURB REMOVED AND RESET","FT",36070,5,35,35.44]
[6,581,"CURB INLET REMOVED AND RESET","EA",37,3,230,220]
[6,582,"CURB CORNER REMOVED AND RESET","EA",50,1,130,130]
[6,583,"EDGING REMOVED AND RESET","FT",445,2,40,37]
[6,594,"CURB REMOVED AND DISCARDED","FT",600,2,11,12.25]
[6,597,"EDGING REMOVED AND DISCARDED","FT",200,1,12.5,12.5]
[6,620.12,"GUARDRAIL, TL-2 (SINGLE FACED)","FT",17840,2,31.5,30.86]
[6,620.13,"GUARDRAIL, TL-3 (SINGLE FACED)","FT",7060,2,44,42]
[6,620.32000000000005,"GUARDRAIL - CURVED, TL-2 (SINGLE FACED)","FT",1630,2,35,32.65]
[6,620.33000000000004,"GUARDRAIL - CURVED, TL-3 (SINGLE FACED)","FT",200,1,23.5,23.5]
[6,621.12,"GUARDRAIL, TL-2 (DOUBLE FACED)","FT",400,1,23.5,23.5]
[6,621.13,"GUARDRAIL, TL-3 (DOUBLE FACED)","FT",400,1,57.5,57.5]
[6,627.1,"TRAILING ANCHORAGE","EA",70,3,2000,2051.44]
[6,627.73,"GUARDRAIL END TREATMENT, TL-3 (DOUBLE FACED)","EA",4,1,10100,10100]
[6,627.82000000000005,"GUARDRAIL TANGENT END TREATMENT, TL-2","EA",40,2,4375,4432.43]
[6,627.83000000000004,"GUARDRAIL TANGENT END TREATMENT, TL-3","EA",4,1,5200,5200]
[6,627.91999999999996,"GUARDRAIL FLARED END TREATMENT, TL-2","EA",4,1,4332,4332]
[6,627.92999999999995,"GUARDRAIL FLARED END TREATMENT, TL-3","EA",12,2,4967,5014.75]
[6,628.21,"TRANSITION TO NCHRP 350 GUARDRAIL","EA",4,1,1487.5,1487.5]
[6,628.22,"TRANSITION TO RIGID BARRIER (SINGLE FACED)","EA",12,2,4852.5,4576.25]
[6,628.23,"TRANSITION TO RIGID BARRIER (DOUBLE FACED)","EA",4,1,6150,6150]
[6,628.24,"TRANSITION TO BRIDGE RAIL","EA",32,2,4552.5,4126.25]
[6,628.25,"TRANSITION TO THRIE BEAM","EA",24,2,1150,1132.5]
[6,628.32000000000005,"IMPACT ATTENUATOR FOR SHOULDER, CAPABLE OF REDIRECTION","EA",2,1,52893.5,52893.5]
[6,628.34,"IMPACT ATTENUATOR FOR MEDIAN, CAPABLE OF REDIRECTION","EA",6,1,8170,8170]
[6,629.29999999999995,"CAST-IN-PLACE CONCRETE BARRIER - SINGLE FACED","FT",400,1,935,935]
[6,630,"HIGHWAY GUARD REMOVED AND RESET","FT",702,1,16.38,16.38]
[6,630.20000000000005,"HIGHWAY GUARD REMOVED AND DISCARDED","FT",22685,3,6,6.2]
[6,632,"GUARDRAIL POST - STEEL","EA",872,2,137.5,132.5]
[6,632.1,"GUARDRAIL POST - WOOD","EA",120,1,93.5,93.5]
[6,632.4,"INDIVIDUAL POST REMOVED AND DISCARDED","EA",360,1,10,10]
[6,633,"GUARDRAIL OFFSET BLOCK - W BEAM","EA",62,1,30.5,30.5]
[6,633.1,"GUARDRAIL OFFSET BLOCK - THRIE BEAM","EA",342,2,32,33.25]
[6,634,"W BEAM GUARD PANEL","EA",580,1,277.5,277.5]
[6,634.1,"THRIE BEAM GUARD PANEL","EA",520,2,355,356.25]
[6,644.072,"72 INCH CHAIN LINK FENCE (SPRING TENSION WIRE) (LINE POST OPTION)","FT",1500,1,64.25,64.25]
[6,644.14800000000002,"48 INCH CHAIN LINK FENCE (SPRING TENSION WIRE) VINYL COATED (LINE POST OPTION)","FT",1500,1,56,56]
[6,644.17200000000003,"72 INCH CHAIN LINK FENCE (SPRING TENSION WIRE) VINYL COATED (LINE POST OPTION)","FT",1500,1,63.5,63.5]
[6,644.19600000000003,"96 INCH CHAIN LINK FENCE (SPRING TENSION WIRE) VINYL COATED (LINE POST OPTION)","FT",1500,1,85.63,85.63]
[6,645.072,"72 INCH CHAIN LINK FENCE (PIPE TOP RAIL) (LINE POST OPTION)","FT",35,1,30,30]
[6,645.14800000000002,"48 INCH CHAIN LINK FENCE (PIPE TOP RAIL) VINYL COATED (LINE POST OPTION)","FT",120,1,50,55]
[6,645.17200000000003,"72 INCH CHAIN LINK FENCE (PIPE TOP RAIL) VINYL COATED (LINE POST OPTION)","FT",447,1,60,60]
[6,650.072,"72 INCH CHAIN LINK GATE WITH GATE POSTS","FT",354,3,199,190.5]
[6,652.072,"72 INCH CHAIN LINK FENCE END POST","EA",304,2,200,165]
[6,653.072,"72 INCH CHAIN LINK FENCE CORNER OR INTERMEDIATE BRACE POST","EA",80,1,200,200]
[6,654.072,"72 INCH CHAIN LINK FENCE FABRIC","FT",1000,1,28.38,28.38]
[6,657,"TEMPORARY FENCE","FT",7800,2,30,29.96]
[6,657.5,"TEMPORARY FENCE REMOVED AND RESET","FT",1950,1,3,3]
[6,666,"CHAIN LINK FENCE REMOVED AND RESET","FT",640,2,42,37.25]
[6,670,"FENCE REMOVED AND RESET","FT",480,1,35.5,36.380000000000003]
[6,697.1,"SILT SACK","EA",539,7,210,230.27]
[6,698.3,"GEOTEXTILE FABRIC FOR SEPARATION","SY",6602,2,22.5,20.03]
[6,698.4,"GEOTEXTILE FABRIC FOR PERMANENT EROSION CONTROL","SY",2434,2,10,8.99]
[6,701,"CEMENT CONCRETE SIDEWALK","SY",47654,5,72,65.73]
[6,701.1,"CEMENT CONCRETE SIDEWALK AT DRIVEWAYS","SY",4375,3,85,78.099999999999994]
[6,701.2,"CEMENT CONCRETE PEDESTRIAN CURB RAMP","SY",6940,3,100,112.42]
[6,702,"HOT MIX ASPHALT SIDEWALK OR DRIVEWAY","TON",3160,4,255,239.17]
[6,703.1,"CONCRETE WHEEL STOP","EA",26,1,275,275]
[6,707.1,"PARK BENCH","EA",15,1,3200,3066.67]
[6,707.15,"PARK BENCH REMOVED AND RESET","EA",4,1,1500,1500]
[6,707.8,"STEEL BOLLARD","EA",2,1,665,665]
[6,707.9,"BICYCLE RACK","EA",30,1,1300,1266.67]
[6,711,"BOUND REMOVED AND RESET","EA",8,1,835,793.13]
[6,715,"RURAL MAIL BOX REMOVED AND RESET","EA",1,1,100,100]
[6,715.1,"MAIL BOX REMOVED AND RESET","EA",5,1,100,100]
[6,734,"SIGN REMOVED AND RESET","EA",80,1,225,237.5]
[6,740,"ENGINEERS FIELD OFFICE AND EQUIPMENT (TYPE A)","MO",654,8,3175,3257.11]
[6,747,"EQUIPMENT FOR ENGINEERS FIELD OFFICE","LS",4,2,35000,35375]
[6,748,"MOBILIZATION","LS",26,5,85000,87203.9]
[6,748.1,"EMERGENCY RESPONSE","EA",147,6,500,588.82000000000005]
[6,751,"LOAM BORROW","CY",6267,8,55,57.06]
[6,755.35,"INLAND WETLAND REPLICATION AREA","LS",4,1,12500,10500]
[6,755.75,"WETLAND SPECIALIST","HR",240,1,165,158.5]
[6,755.76,"WETLANDS MONITORING REPORTS","LS",10,1,6700,6890]
[6,756,"NPDES STORMWATER POLLUTION PREVENTION PLAN","LS",8,1,10000,10125]
[6,765,"SEEDING","SY",24450,7,2,2.17]
[6,767.12099999999998,"SEDIMENT CONTROL BARRIER","FT",56766,7,8,8]
[6,767.31,"STRAW MULCH","SY",1069,2,5.5,5.9]
[6,767.6,"AGED PINE BARK MULCH","CY",480,1,82.5,84.25]
[6,769,"PAVEMENT MILLING MULCH UNDER GUARD RAIL","FT",20685,2,12,11.46]
[6,772.33600000000001,"CEDAR - RED 5-6 FEET","EA",36,1,450,468.75]
[6,785.17499999999995,"ANDROMEDA - MOUNTAIN 24-36 INCH","EA",19,1,121,121]
[6,786.46699999999998,"JUNIPER - SARGENT'S GREEN 24-30 INCH","EA",8,1,97,97]
[6,787.255,"YEW - SPREADING DENSE 24-30 INCH","EA",20,1,150,150]
[6,788.01300000000003,"ALDER SHRUB - SPECKLED 2 GALLON","EA",33,1,60,60.7]
[6,789.33299999999997,"BAYBERRY SHRUB - NORTHERN 2-3 FEET","EA",70,1,75,74.8]
[6,789.63300000000004,"BLUEBERRY - HIGHBUSH 2-3 FEET","EA",99,1,63.5,63.51]
[6,790.71900000000005,"DOGWOOD - SILKY 2-3 FEET","EA",66,1,58.25,57.85]
[6,794.33299999999997,"SUMAC SHRUB - FRAGRANT 2-3 FEET","EA",9,1,64,64]
[6,795.00900000000001,"VIBURNUM - ARROWWOOD 18-24 INCHES","EA",70,1,40,39.21]
[6,795.15700000000004,"WINTERBERRY - FEMALE 24-30 INCH","EA",50,1,60,61.87]
[6,795.43299999999999,"WILLOW - PUSSY 2-3 FEET","EA",100,1,42.75,42.59]
[6,804.2,"2 INCH ELECTRICAL CONDUIT TYPE NM - PLASTIC (UL)","FT",300,1,45,45.2]
[6,804.3,"3 INCH ELECTRICAL CONDUIT TYPE NM - PLASTIC -(UL)","FT",3150,2,50,48.46]
[6,808.2,"2 INCH ELECTRICAL CONDUIT TY RM - STEEL - (PLASTIC COATED)","FT",1500,1,80,72]
[6,811.22,"ELECTRIC HANDHOLE - SD2.022","EA",24,1,1200,1200]
[6,811.31,"PULL BOX 12 X 12 INCHES - SD2.031","EA",60,1,1050,1016.39]
[6,811.35,"PULL BOX ADJUSTED","EA",10,1,300,282.5]
[6,811.37,"ELECTRIC HANDHOLE ADJUSTED","EA",15,1,425,408.33]
[6,811.39,"ELECTRIC HANDHOLE REMOVED AND STACKED","EA",2,1,150,150]
[6,812.09,"LIGHT STANDARD FOUNDATION PRECAST","EA",25,1,2700,2610]
[6,813.4,"WIRE TYPE 8 NO. 10 DIRECT BURIAL","FT",6800,1,1.5,1.53]
[6,813.42,"WIRE TYPE 8 NO. 6 DIRECT BURIAL","FT",5500,1,2.65,2.76]
[6,819.83100000000002,"WIRE LOOP INSTALLED IN ROADWAY","FT",1900,2,15,14.5]
[6,823.6,"HIGHWAY LIGHTING LOAD CENTER","LS",5,1,25000,24600]
[6,824.51,"FLASHING WARNING BEACON REMOVED AND STACKED","LS",5,1,1016,876.4]
[6,832,"WARNING-REGULATORY AND ROUTE MARKER - ALUMINUM PANEL (TYPE A)","SF",4772,4,15,14.21]
[6,833.5,"DEMOUNTABLE REFLECTORIZED DELINEATOR - GUARD RAIL","EA",860,2,7.88,7.75]
[6,833.7,"DELINEATION FOR GUARD RAIL TERMINI","EA",170,2,56,50.44]
[6,834.17,"REFLECTORIZED FLEXIBLE DELINEATOR POST (AMBER)","EA",220,2,80,68.75]
[6,834.18,"REFLECTORIZED FLEXIBLE DELINEATOR POST (WHITE)","EA",1602,2,80,67.5]
[6,841.2,"SUPPORTS FOR GUIDE SIGN (D6-5 INCH TUBULAR POST) STEEL","EA",10,1,1678,1695.6]
[6,847.1,"SIGN SUP (N/GUIDE)+RTE MKR W/1 BRKWAY POST ASSEMBLY - STEEL","EA",1271,4,130,139.47999999999999]
[6,848.1,"SIGN SUP (N/GUIDE)+RTE MKR W/2 BRKWAY POST ASSEMBLIES-STEEL","EA",72,1,239.5,245.67]
[6,850.41,"ROADWAY FLAGGER","HR",975,7,57.5,63.87]
[6,851.1,"TRAFFIC CONES FOR TRAFFIC MANAGEMENT","DAY",2225,5,10,12.57]
[6,852,"SAFETY SIGNING FOR TRAFFIC MANAGEMENT","SF",11508,11,15,14.16]
[6,853.1,"PORTABLE BREAKAWAY BARRICADE TYPE III","EA",74,3,120,117.42]
[6,853.21,"TEMPORARY BARRIER REMOVED AND RESET","FT",5200,1,12.5,12.5]
[6,853.23,"TEMPORARY BARRIER (TL-3)","FT",5600,2,27.5,30]
[6,853.33,"TEMPORARY BARRIER - LIMITED DEFLECTION (TL-3)","FT",3500,3,46,44]
[6,853.40300000000002,"TRUCK MOUNTED ATTENUATOR","DAY",5965,11,102,110.8]
[6,853.50099999999998,"TEMPORARY IMPACT ATTENUATOR REMOVED AND RESET","EA",20,1,500,500]
[6,853.53,"TEMPORARY IMPACT ATTENUATOR UNIDIRECTIONAL, NON-REDIRECTIVE (TL-3)","EA",6,1,9500,10333.33]
[6,853.63,"TEMPORARY IMPACT ATTENUATOR UNIDIRECTIONAL, REDIRECTIVE (TL-3)","EA",2,1,8685,8685]
[6,853.73,"TEMPORARY IMPACT ATTENUATOR BI-DIRECTIONAL, NON-REDIRECTIVE (TL-3)","EA",20,1,1250,1250]
[6,853.8,"TEMPORARY ILLUMINATION FOR WORK ZONE","DAY",932,9,50,58]
[6,854.01599999999996,"TEMPORARY PAVING MARKINGS - 6 INCH (PAINTED)","FT",264900,3,0.28999999999999998,0.25]
[6,854.03599999999994,"TEMPORARY PAVING MARKINGS - 6 INCH (TAPE)","FT",87550,6,1.9,1.9]
[6,854.1,"PAVEMENT MARKING REMOVAL","SF",5750,3,3.75,4.25]
[6,854.6,"TEMPORARY PORTABLE RUMBLE STRIP","DAY",2510,3,50,40.159999999999997]
[6,856,"ARROW BOARD","DAY",7640,13,10,10.64]
[6,856.12,"PORTABLE CHANGEABLE MESSAGE SIGN","DAY",5125,10,24.4,25.38]
[6,859,"REFLECTORIZED DRUM","DAY",205980,9,0.39,0.33]
[6,859.1,"REFLECTORIZED DRUMS WITH SEQUENTIAL FLASHING WARNING LIGHTS","DAY",7495,4,5,4.2699999999999996]
[6,860.10599999999999,"6 INCH REFLECTORIZED WHITE LINE (PAINTED)","FT",128,1,20,25]
[6,864.04,"PAVEMENT ARROWS AND LEGENDS REFLECTORIZED WHITE (THERMOPLASTIC)","SF",8820,3,21.17,20.29]
[6,864.07,"PAVEMENT ARROW AND LEGENDS (EPOXY)","SF",4000,2,14.38,13.94]
[6,864.31,"SLOTTED PAVEMENT MARKER ONE-WAY WHITE","EA",952,1,31.5,31.5]
[6,864.33,"SLOTTED PAVEMENT MARKER TWO-WAY WHITE/RED","EA",1568,1,31.5,31.5]
[6,864.34,"SLOTTED PAVEMENT MARKER TWO-WAY YELLOW/RED","EA",200,1,31.5,31.5]
[6,866.10599999999999,"6 INCH REFLECTORIZED WHITE LINE (THERMOPLASTIC)","FT",114800,2,1.1000000000000001,1.07]
[6,866.11199999999997,"12 INCH REFLECTORIZED WHITE LINE (THERMOPLASTIC)","FT",31000,3,5,4.8099999999999996]
[6,867.10599999999999,"6 INCH REFLECTORIZED YELLOW LINE (THERMOPLASTIC)","FT",104600,2,1.08,1.07]
[6,867.11199999999997,"12 INCH REFLECTORIZED YELLOW LINE (THERMOPLASTIC)","FT",1500,2,5,4.72]
[6,868.06,"6 INCH REFLECTORIZED WHITE LINE (EPOXY)","FT",40000,1,1,1]
[6,868.12,"12 INCH REFLECTORIZED WHITE LINE (EPOXY)","FT",27800,1,1.75,1.75]
[6,869.06,"6 INCH REFLECTORIZED YELLOW LINE (EPOXY)","FT",34000,1,1.25,1.25]
[6,869.12,"12 INCH REFLECTORIZED YELLOW LINE (EPOXY)","FT",1600,1,5.75,5.75]
[6,874,"STREET NAME SIGN","EA",90,1,87,87.44]
[6,874.2,"TRAFFIC SIGN REMOVED AND RESET","EA",30,1,125,75]
[6,901,"4000 PSI, 1.5 INCH, 565 CEMENT CONCRETE","CY",1535,1,1200,1210]
[6,901.3,"4000 PSI, 1.5 INCH, 565 CEMENT CONCRETE FOR POST FOUNDATION","CY",10,1,200,200]
[6,904,"4000 PSI, 3/4 INCH, 610 CEMENT CONCRETE","CY",4,1,800,800]
[6,905,"4000 PSI, 3/8 INCH, 660 CEMENT CONCRETE","CY",1440,1,3512.5,3254.17]
[6,908,"CEMENT FOR POINTING","BAG",424,1,52.5,52.5]
[6,909.2,"CEMENTITIOUS MORTAR FOR PATCHING","SF",28000,2,19,20.75]
[6,909.99,"RAPID SET CEMENT","BAG",20,1,75,75]
[6,910,"STEEL REINFORCEMENT FOR STRUCTURES","LB",42420,1,2.5,2.41]
[6,910.1,"STEEL REINFORCEMENT FOR STRUCTURES - EPOXY COATED","LB",31300,3,2.6,4.82]
[6,912,"DRILLING AND GROUTING DOWELS","EA",3600,1,30,25]
[6,913.3,"CORING AND GROUTING DOWELS","EA",200,1,26.75,26.75]
[6,950.1,"TEMPORARY SHORING","LS",4,1,85000,77750]
[6,955,"TREATED TIMBER","MBF",3.75,1,40000,36400]
[6,960.1,"STRUCTURAL STEEL - COATED STEEL","LB",240000,1,7.5,8.0500000000000007]
[6,961.20100000000002,"CLEAN (FULL REMOVAL) AND PAINT STEEL BRIDGE NO. ________","LS",4,1,988410,1178852.5]
[6,964.1,"EPOXY BONDING COMPOUND","SF",19440,1,2.25,2.25]
[6,983,"DUMPED RIPRAP","TON",600,1,122.5,122.5]
[6,983.1,"RIPRAP","TON",40,1,245,245]
[6,986,"MODIFIED ROCKFILL","TON",810,1,85.5,84.34]
[6,986.2,"MODIFIED ROCKFILL","CY",10,1,475,475]
[6,994.1,"TEMPORARY PROTECTIVE SHIELDING","SF",1300,1,14,20]
[9,100.5,"ELECTRICAL WORK","LS",1,1,1100940,1100940]
[9,100.61,"HVAC WORK","LS",2,1,3551772,3743123.3]
[9,100.71,"MASONRY WORK","LS",2,1,14015,14015]
[9,100.75,"PAINTING","LS",2,1,267720,267720]
[9,950.1,"TEMPORARY SHORING","LS",2,1,151345,151345]
["All Districts",741,"ENGINEERS FIELD OFFICE AND EQUIPMENT (TYPE B)","MO",21,1,2000,2133.33]
["All Districts",745,"PEDESTRIAN BUS SHELTER","EA",12,1,15200,14733.33]
["All Districts",747,"EQUIPMENT FOR ENGINEERS FIELD OFFICE","LS",12,8,7250,6748.92]
["All Districts",748,"MOBILIZATION","LS",374,94,76000,66864.86]
["All Districts",748.1,"EMERGENCY RESPONSE","EA",547,35,500,482.56]
["All Districts",751,"LOAM BORROW","CY",398294,122,58.39,57.5]
["All Districts",751.7,"COMPOST TOPDRESSING","SY",5850,2,10,8.52]
["All Districts",752,"TOPSOIL REHANDLED AND SPREAD","CY",67905,7,33,33.450000000000003]
["All Districts",755.35,"INLAND WETLAND REPLICATION AREA","LS",16,4,23000,23734.38]
["All Districts",755.45,"WETLAND RESTORATION","SY",19170,6,50,51.77]
["All Districts",755.75,"WETLAND SPECIALIST","HR",5286,12,183,175.38]
["All Districts",755.76,"WETLANDS MONITORING REPORTS","LS",55,10,8000,7114.1]
["All Districts",756,"NPDES STORMWATER POLLUTION PREVENTION PLAN","LS",204,57,6500,5467.57]
["All Districts",760,"IMPERVIOUS SOIL BORROW","CY",580,4,90,87.65]
["All Districts",765,"SEEDING","SY",2309928,102,2,2.09]
["All Districts",765.2,"SEED FOR EROSION CONTROL","LB",1121,5,37.5,50.29]
["All Districts",767.12099999999998,"SEDIMENT CONTROL BARRIER","FT",2265477,112,7,6.55]
["All Districts",767.2,"HAY MULCH","SY",5655,3,2.4,2.13]
["All Districts",767.31,"STRAW MULCH","SY",193386,12,2,1.63]
["All Districts",767.4,"WOOD CHIP MULCH","CY",268,7,100,90.99]
["All Districts",767.6,"AGED PINE BARK MULCH","CY",4664,25,78.5,77.38]
["All Districts",767.8,"BALES OF HAY FOR EROSION CONTROL","EA",1720,5,18,18.920000000000002]
["All Districts",767.9,"JUTE MESH","SY",59790,8,6,6.07]
["All Districts",769,"PAVEMENT MILLING MULCH UNDER GUARD RAIL","FT",3077151.17,75,8,8.1300000000000008]
["All Districts",772.33299999999997,"CEDAR-RED 2-3 FEET","EA",108,1,83,80.319999999999993]
["All Districts",772.33600000000001,"CEDAR - RED 5-6 FEET","EA",36,1,450,468.75]
["All Districts",773.22400000000005,"PINE - PITCH 4-5 FEET","EA",86,2,397.5,377.63]
["All Districts",773.43600000000004,"PINE - WHITE 5-6 FEET","EA",518,3,360,362.81]
["All Districts",774.04100000000005,"SPRUCE - COLORADO GREEN 8-10 FEET","EA",9,1,850,841.06]
["All Districts",774.13599999999997,"SPRUCE - NORWAY 5-6 FEET","EA",20,1,388,413.6]
["All Districts",774.23500000000001,"SPRUCE - SERBIAN 5-6 FEET","EA",52,1,335,358.75]
["All Districts",774.63800000000003,"SPRUCE - WHITE 5-6 FEET","EA",35,1,294,333.3]
["All Districts",775.03499999999997,"HOPHORNBEAM - AMERICAN 2-2.5 INCH CALIPER","EA",24,1,737.5,735.63]
["All Districts",775.14,"LINDEN - AMERICAN 2-2.5 INCH CALIPER","EA",8,1,770,735]
["All Districts",775.14700000000005,"LINDEN - LITTLE LEAF 2-2.5 INCH CALIPER","EA",69,2,710,704.68]
["All Districts",775.43100000000004,"LOCUST - HONEY - 'SHADEMASTER' 2-2.5 INCH CALIPER","EA",80,1,645,651.25]
["All Districts",775.43399999999997,"LOCUST - HONEY - 'SHADEMASTER' 3-3.5 INCH CALIPER","EA",22,1,1000,1031.3599999999999]
["All Districts",775.43700000000001,"LOCUST - HONEY - 'SKYLINE' 2-2.5 INCH CALIPER","EA",7,1,800,827.71]
["All Districts",776.52300000000002,"MAPLE - RED - 'ARMSTRONG' 2-2.5 INCH CALIPER","EA",124,4,700,728.75]
["All Districts",776.54300000000001,"MAPLE - RED - 'OCTOBER GLORY' 2-2.5 INCH CALIPER","EA",212,7,720,717.62]
["All Districts",776.55100000000004,"MAPLE - RED - 'OCTOBER GLORY' 3-3.5 INCH CALIPER","EA",3,1,1000,1050]
["All Districts",776.55700000000002,"MAPLE - RED - 'RED SUNSET' 2-2.5 INCH CALIPER","EA",49,1,690,693.74]
["All Districts",776.83600000000001,"MAPLE - SUGAR 2-2.5 INCHES CALIPER","EA",73,2,650,697.19]
["All Districts",776.851,"MAPLE - SUGAR - 'LEGACY' 2-2.5 INCH CALIPER","EA",92,2,720,722.92]
["All Districts",776.93499999999995,"MAPLE - SYCAMORE 2-2.5 INCH CALIPER","EA",21,1,660,675.46]
["All Districts",777.03599999999994,"OAK - NORTHERN RED 2-2.5 INCH CALIPER","EA",66,3,671,687.37]
["All Districts",777.04200000000003,"OAK - NORTHERN RED 2.5-3 INCH CALIPER","EA",18,1,765,751.67]
["All Districts",777.13800000000003,"OAK - PIN 2-2.5 INCH CALIPER","EA",179,6,700,679.82]
["All Districts",777.26099999999997,"OAK - SWAMP WHITE 1.5-2 INCH CALIPER","EA",108,2,500,474.07]
["All Districts",777.44200000000001,"PLANETREE - AMERICAN 2-2.5 INCH CALIPER","EA",25,1,635,657.3]
["All Districts",777.54200000000003,"PLANETREE - LONDON 2-2.5 INCH CALIPER","EA",30,1,655,637.16999999999996]
["All Districts",777.673,"SWEETGUM 2-2.5 INCH CALIPER","EA",193,3,662.5,653.80999999999995]
["All Districts",778.16099999999994,"BIRCH - RIVER 'HERITAGE' 8-10 FOOT CLUMP","EA",92,2,447.5,454.47]
["All Districts",778.16499999999996,"BIRCH - RIVER 'HERITAGE' 12-14 FOOT CLUMP","EA",9,1,625,612.66999999999996]
["All Districts",778.37300000000005,"CHERRY - SARGENT 1.5-2 INCH CALIPER","EA",28,2,528,495.44]
["All Districts",778.37699999999995,"CHERRY - SARGENT 2.5-3 INCH CALIPER","EA",14,1,825,774.29]
["All Districts",778.41700000000003,"CRABAPPLE - 'CENTURION' 2.5-3 INCH CALIPER","EA",55,1,850,765]
["All Districts",778.423,"CRABAPPLE - 'DONALD WYMAN' 1.5-2 INCH CALIPER","EA",45,1,625,605]
["All Districts",778.45299999999997,"CRABAPPLE - 'RED JADE' - WEEPING 1.5-2 INCH CALIPER","EA",6,1,570,579]
["All Districts",778.47299999999996,"CRABAPPLE - 'ZUMI' 1.5-2 INCH CALIPER","EA",84,2,412.5,440.61]
["All Districts",781.17100000000005,"HACKBERRY TREE 1.5-2 INCH CALIPER","EA",24,2,512.5,471.58]
["All Districts",781.26700000000005,"HAWTHORN - 'WINTER KING' 2.5-3 INCH CALIPER","EA",40,1,750,736.75]
["All Districts",781.57299999999998,"LILAC TREE - JAPANESE CLUMP 8-10 FOOT CLUMP","EA",20,1,665,662]
["All Districts",781.57500000000005,"LILAC TREE - JAPANESE CLUMP 10-12 FOOT CLUMP","EA",18,2,700,808.5]
["All Districts",781.57899999999995,"LILAC TREE - JAPANESE 2-2.5 INCH CALIPER","EA",12,1,615,612.5]
["All Districts",782.14499999999998,"MAIDENHAIR TREE 2-2.5 INCH CALIPER","EA",60,1,610,608.75]
["All Districts",782.423,"PEAR - CALLERY - 'CHANTICLEER' 2-2.5 INCH CALIPER","EA",72,1,532.5,544.38]
["All Districts",782.53599999999994,"REDBUD - EASTERN 5-6 FEET","EA",6,1,302,305.27999999999997]
["All Districts",782.53700000000003,"REDBUD - EASTERN 1.5-2 INCH CALIPER","EA",40,2,485,528.5]
["All Districts",782.63400000000001,"REDWOOD - DAWN 2-2.5 INCH CALIPER","EA",12,1,605,603.75]
["All Districts",783.04499999999996,"SHAD TREE - DOWNY 6-8 FEET","EA",119,1,472.5,429.86]
["All Districts",783.04899999999998,"SHAD TREE - DOWNY 2-2.5 INCH CALIPER","EA",85,1,682.5,706.5]
["All Districts",783.44200000000001,"TULIP TREE 2.5-3 INCH CALIPER","EA",12,1,721.5,717]
["All Districts",783.46500000000003,"TUPELO 1.5-2 INCH CALIPER","EA",44,1,528,521.5]
["All Districts",783.46699999999998,"TUPELO 2-2.5 INCH CALIPER","EA",18,1,681,655.9]
["All Districts",783.64700000000005,"ZELKOVA - 'VILLAGE GREEN' 2.5-3 INCH CALIPER","EA",72,1,750,741.06]
["All Districts",785.17499999999995,"ANDROMEDA - MOUNTAIN 24-36 INCH","EA",19,1,121,121]
["All Districts",785.58699999999999,"HOLLY - JAPANESE - 'HETZ' 24-30 INCH","EA",32,1,107.5,107.5]
["All Districts",785.63099999999997,"INKBERRY 18-24 INCH","EA",32,1,90,86.25]
["All Districts",785.63300000000004,"INKBERRY 2-3 FEET","EA",27,1,117,125.89]
["All Districts",785.73099999999999,"INKBERRY - COMPACT 18-24 INCH","EA",18,1,90,85.5]
["All Districts",785.73299999999995,"INKBERRY - COMPACT 24-30 INCH","EA",48,1,70,71]
["All Districts",786.03099999999995,"JUNIPER - ANDORRA 18-24 INCH","EA",496,1,64.5,67]
["All Districts",786.08100000000002,"JUNIPER - BAR HARBOR 15-18 INCH","EA",102,1,83.5,77.209999999999994]
["All Districts",786.10900000000004,"JUNIPER - 'BLUE RUG' 12-15 INCH","EA",44,1,23.5,23.75]
["All Districts",786.46699999999998,"JUNIPER - SARGENT'S GREEN 24-30 INCH","EA",8,1,97,97]
["All Districts",786.471,"JUNIPER - 'SEA GREEN' 18-24 INCH","EA",20,1,54,53]
["All Districts",787.255,"YEW - SPREADING DENSE 24-30 INCH","EA",20,1,150,150]
["All Districts",787.26300000000003,"YEW - SPREADING ENGLISH 24-30 INCH SPREAD","EA",24,1,200,214.14]
["All Districts",788.01300000000003,"ALDER SHRUB - SPECKLED 2 GALLON","EA",73,3,56,54.25]
["All Districts",789.33100000000002,"BAYBERRY SHRUB - NORTHERN 18-24 INCH","EA",56,1,80,70.75]
["All Districts",789.33299999999997,"BAYBERRY SHRUB - NORTHERN 2-3 FEET","EA",70,1,75,74.8]
["All Districts",789.63300000000004,"BLUEBERRY - HIGHBUSH 2-3 FEET","EA",119,2,60,56.17]
["All Districts",790.53099999999995,"DOGWOOD - GRAY TWIG 18-24 INCH","EA",270,1,40,37.700000000000003]
["All Districts",790.63099999999997,"DOGWOOD - REDOSIER 18-24 INCH","EA",48,1,35,39]
["All Districts",790.71900000000005,"DOGWOOD - SILKY 2-3 FEET","EA",101,3,55,51.69]
["All Districts",791.31299999999999,"FOTHERGILLA - DWARF 18-24 INCH SPREAD","EA",516,1,90.53,87.46]
["All Districts",793.31700000000001,"PRIVET - AMUR 24-30 INCH","EA",50,1,78,71.900000000000006]
["All Districts",793.73099999999999,"SPIREA - 'ANTHONY WATERER' 2-3 FEET","EA",12,1,35.5,36]
["All Districts",794.33299999999997,"SUMAC SHRUB - FRAGRANT 2-3 FEET","EA",9,1,64,64]
["All Districts",794.63300000000004,"SUMAC SHRUB - STAGHORN 2-3 FEET","EA",15,1,45,47.1]
["All Districts",794.73099999999999,"SUMMERSWEET SHRUB 18-24 INCH","EA",301,1,60,63.29]
["All Districts",794.73699999999997,"SUMMERSWEET SHRUB 3-4 FEET","EA",21,1,60,57.21]
["All Districts",794.80499999999995,"SWEETFERN 2 GALLON","EA",264,1,27.5,29.06]
["All Districts",795.00900000000001,"VIBURNUM - ARROWWOOD 18-24 INCHES","EA",85,2,42.25,40.85]
["All Districts",795.053,"VIBURNUM - HIGHBUSH CRANBERRY 3-4 FEET","EA",27,2,100,94.93]
["All Districts",795.07899999999995,"VIBURNUM - WITHEROD 18-24 INCH","EA",36,1,65,59.92]
["All Districts",795.15099999999995,"WINTERBERRY - MALE 18-24 INCH","EA",95,2,53,51.64]
["All Districts",795.15300000000002,"WINTERBERRY - MALE 24-30 INCH","EA",6,1,85,78.59]
["All Districts",795.15499999999997,"WINTERBERRY - FEMALE 18-24 INCH","EA",48,1,40,39.25]
["All Districts",795.15700000000004,"WINTERBERRY - FEMALE 24-30 INCH","EA",219,4,60,63.79]
["All Districts",795.43299999999999,"WILLOW - PUSSY 2-3 FEET","EA",100,1,42.75,42.59]
["All Districts",796.22500000000002,"ROSE - PINK MEIDILAND 2 GALLON","EA",20,1,29.5,29.25]
["All Districts",796.41899999999998,"COMMON RUSH 1 GALLON","EA",125,1,25,21.72]
["All Districts",796.423,"DWARF FOUNTAIN GRASS - 'HAMELN' 1 GALLON","EA",6884,5,24,22.19]
["All Districts",796.42700000000002,"FEATHER REED GRASS 2 GALLON","EA",180,1,30,30.44]
["All Districts",796.44899999999996,"MAIDEN GRASS 'MORNING LIGHT' 2 GALLON","EA",258,1,30,31]
["All Districts",796.76300000000003,"DAYLILY - 'STELLA D'ORO' 1 GALLON","EA",4670,2,20,22.14]
["All Districts",796.84100000000001,"SEDUM 'AUTUMN JOY' 2 QUART","EA",160,1,28,27]
["All Districts",801.22,"2 INCH ELECTRICAL CONDUIT - TYPE NM (DOUBLE)","FT",5560,1,46,43]
["All Districts",801.24,"2 INCH ELECTRICAL CONDUIT - TYPE NM (4 BANK)","FT",880,1,115,123.75]
["All Districts",801.26,"2 INCH ELECTRICAL CONDUIT - TYPE NM (6 BANK)","FT",160,1,195,190]
["All Districts",801.32,"3 INCH ELECTRICAL CONDUIT - TYPE NM (DOUBLE)","FT",44825,4,45,43.67]
["All Districts",801.34,"3 INCH ELECTRICAL CONDUIT - TYPE NM (4 BANK)","FT",625,1,57.5,54.25]
["All Districts",801.42,"4 INCH ELECTRICAL CONDUIT - TYPE NM (DOUBLE)","FT",26660,5,63.5,66.61]
["All Districts",801.44,"4 INCH ELECTRICAL CONDUIT - TYPE NM (4 BANK)","FT",14500,4,85,90.09]
["All Districts",801.46,"4 INCH ELECTRICAL CONDUIT - TYPE NM (6 BANK)","FT",27150,2,132.5,120.58]
["All Districts",801.62,"6 INCH ELECTRICAL CONDUIT - TYPE NM (DOUBLE)","FT",1200,1,48,44]
["All Districts",804.1,"1 INCH ELECTRICAL CONDUIT TYPE NM - PLASTIC -(UL)","FT",3195,3,40,38.1]
["All Districts",804.15,"1-1/2 INCH ELECTRICAL CONDUIT TYPE NM - PLASTIC -(UL)","FT",120,1,54.5,54.5]
["All Districts",804.2,"2 INCH ELECTRICAL CONDUIT TYPE NM - PLASTIC (UL)","FT",31020,16,40,37.65]
["All Districts",804.3,"3 INCH ELECTRICAL CONDUIT TYPE NM - PLASTIC -(UL)","FT",564502,41,45,44.85]
["All Districts",804.4,"4 INCH ELECTRICAL CONDUIT TYPE NM - PLASTIC -(UL)","FT",69075,7,39,40.83]
["All Districts",804.6,"6 INCH ELECTRICAL CONDUIT TYPE NM - PLASTIC -(UL)","FT",1050,1,35,36.93]
["All Districts",806.1,"1 INCH ELECTRICAL CONDUIT TYPE RM - GALVANIZED STEEL","FT",960,1,35,34.5]
["All Districts",806.15,"1-1/2 INCH ELECTRICAL CONDUIT TYPE RM - GALVANIZED STEEL","FT",656,1,37.5,38.75]
["All Districts",806.2,"2 INCH ELECTRICAL CONDUIT TYPE RM - GALVANIZED STEEL","FT",320,1,47.5,47.75]
["All Districts",806.3,"3 INCH ELECTRICAL CONDUIT TYPE RM - GALVANIZED STEEL","FT",2850,4,88,95.43]
["All Districts",806.4,"4 INCH ELECTRICAL CONDUIT TYPE RM - GALVANIZED STEEL","FT",3600,1,82,83.25]
["All Districts",806.6,"6 INCH ELECTRICAL CONDUIT TYPE RM - GALVANIZED STEEL","FT",4620,1,100,108.33]
["All Districts",808.2,"2 INCH ELECTRICAL CONDUIT TY RM - STEEL - (PLASTIC COATED)","FT",2290,2,80,78.290000000000006]
["All Districts",810,"CONDUIT ENCASED IN CONCRETE - SD 4.041","FT",2400,1,65,67.38]
["All Districts",810.91,"MAINTENANCE OF TRAFFIC CONTROL SIGNAL SYSTEMS","LS",3,1,40000,37333.33]
["All Districts",811.1,"ELECTRIC MANHOLE - SD2.010","EA",89,2,2650,2627.5]
["All Districts",811.21,"ELECTRIC HANDHOLE - SD2.021","EA",14,1,1100,1250]
["All Districts",811.22,"ELECTRIC HANDHOLE - SD2.022","EA",1203,20,1250,1274.02]
["All Districts",811.23,"ELECTRIC HANDHOLE - SD2.023","EA",589,8,1750,1683.13]
["All Districts",811.24,"ELECTRIC HANDHOLE - SD2.024","EA",96,2,1799.84,1831.24]
["All Districts",811.27,"ELECTRIC HANDHOLE - (MUNICIPAL STANDARD)","EA",2003,8,1400,1387.35]
["All Districts",811.3,"PULL BOX 8 X 23 INCHES - SD2.030","EA",391,3,1125,1088.6400000000001]
["All Districts",811.31,"PULL BOX 12 X 12 INCHES - SD2.031","EA",3158,37,1000,988.39]
["All Districts",811.35,"PULL BOX ADJUSTED","EA",191,9,300,287.23]
["All Districts",811.36,"ELECTRIC MANHOLE ADJUSTED","EA",60,5,600,590.20000000000005]
["All Districts",811.37,"ELECTRIC HANDHOLE ADJUSTED","EA",417,14,350,357.29]
["All Districts",811.39,"ELECTRIC HANDHOLE REMOVED AND STACKED","EA",45,4,300,350]
["All Districts",811.71,"JUNCTION BOX 18 X 12 X 8 INCHES","EA",39,2,1410,1395.95]
["All Districts",812.09,"LIGHT STANDARD FOUNDATION PRECAST","EA",908,6,1825,1871.58]
["All Districts",812.13,"LIGHT STANDARD FOUNDATION SD3.013","EA",869,6,3000,2958.21]
["All Districts",812.14,"LIGHT STANDARD FOUNDATION SD3.014","EA",157,2,4500,4718.8100000000004]
["All Districts",812.2,"LIGHTING LOAD CENTER FOUNDATION","EA",19,3,5500,5066.54]
["All Districts",812.3,"STANDARD SIGNAL POST FOUNDATION SD3.030","EA",2,1,1500,1500]
["All Districts",812.4,"SIGNAL MAST ARM FOUNDATION","EA",18,1,12000,12366.67]
["All Districts",813.3,"WIRE TYPE 7 NO. 10 GENERAL PURPOSE","FT",420300,5,1.6,1.48]
["All Districts",813.31,"WIRE TYPE 7 NO. 8 GENERAL PURPOSE","FT",24320,2,2.2000000000000002,2.19]
["All Districts",813.32,"WIRE TYPE 7 NO. 6 GENERAL PURPOSE","FT",290830,6,2.2999999999999998,2.34]
["All Districts",813.33,"WIRE TYPE 7 NO. 4 GENERAL PURPOSE","FT",389390,2,2,2]
["All Districts",813.34,"WIRE TYPE 7 NO. 2 GENERAL PURPOSE","FT",695200,1,2.56,2.5]
["All Districts",813.35,"WIRE TYPE 7 NO. 1 GENERAL PURPOSE","FT",13800,2,4.5,4.43]
["All Districts",813.36,"WIRE TYPE 7 NO. 1/0 GENERAL PURPOSE","FT",525,1,7.4,7.27]
["All Districts",813.4,"WIRE TYPE 8 NO. 10 DIRECT BURIAL","FT",118960,5,1.5,1.53]
["All Districts",813.41,"WIRE TYPE 8 NO. 8 DIRECT BURIAL","FT",94000,1,1.35,1.45]
["All Districts",813.42,"WIRE TYPE 8 NO. 6 DIRECT BURIAL","FT",532750,5,2.2000000000000002,2.17]
["All Districts",813.43,"WIRE TYPE 8 NO. 4 DIRECT BURIAL","FT",1651430,4,2.4500000000000002,2.58]
["All Districts",813.44,"WIRE TYPE 8 NO. 2 DIRECT BURIAL","FT",186000,1,3.6,3.83]
["All Districts",813.45,"WIRE TYPE 8 NO. 1 DIRECT BURIAL","FT",720,1,5.3,5.42]
["All Districts",813.46,"WIRE TYPE 8 NO. 1/0 DIRECT BURIAL","FT",102000,1,5.75,5.75]
["All Districts",813.52,"WIRE TYPE 10 - #8 GROUNDING AND BONDING","FT",23600,2,2.1,2.14]
["All Districts",813.53,"WIRE TYPE 11 - LOOP DETECTOR LEAD IN","FT",20100,2,2.25,3.75]
["All Districts",813.6,"EQUIPMENT GROUNDING","LS",7,2,2150,1802.86]
["All Districts",813.72,"GROUND ROD 10 FEET LONG","EA",367,3,150,165]
["All Districts",813.79,"INTERCONNECT CABLE SYSTEM","LS",15,3,17750,16095.43]
["All Districts",813.79100000000005,"INTERCONNECT CABLE SYSTEM","FT",4400,1,8,8.5]
["All Districts",813.8,"SERVICE CONNECTION (OVERHEAD)","LS",9,3,6150,5232.22]
["All Districts",813.81,"SERVICE CONNECTION (UNDERGROUND)","LS",13,3,5850,4761.54]
["All Districts",815,"TRAFFIC CONTROL SIGNAL","LS",7,1,165000,168390]
["All Districts",815.1,"TRAFFIC CONTROL SIGNAL LOCATION NO. 1","LS",38,6,258000,247355.66]
["All Districts",815.2,"TRAFFIC CONTROL SIGNAL LOCATION NO. 2","LS",21,3,216500,235024.76]
["All Districts",815.3,"TRAFFIC CONTROL SIGNAL LOCATION NO. 3","LS",27,5,158000,154168.37]
["All Districts",815.4,"TRAFFIC CONTROL SIGNAL LOCATION NO. 4","LS",4,1,119750,116600]
["All Districts",815.98,"FOOTING COST ADJUSTMENT","FT",234,3,15,307]
["All Districts",816,"TRAFFIC SIGNAL REMOVED AND RESET","LS",3,1,5500,4833.33]
["All Districts",816.01,"TRAFFIC SIGNAL RECONSTRUCTION LOCATION NO. 1","LS",117,22,192500,193473.19]
["All Districts",816.02,"TRAFFIC SIGNAL RECONSTRUCTION LOCATION NO. 2","LS",60,11,210000,218576]
["All Districts",816.03,"TRAFFIC SIGNAL RECONSTRUCTION LOCATION NO. 3","LS",11,4,134330,148060.82]
["All Districts",816.4,"TRAFFIC CONTROL SIGNAL REMOVED AND RESET","LS",6,1,9750,8000]
["All Districts",816.8,"TRAFFIC CONTROL SIGNAL REMOVED AND STACKED","LS",38,9,6000,5623.95]
["All Districts",816.81,"TEMPORARY TRAFFIC CONTROL SIGNAL","LS",28,5,72500,71756.740000000005]
["All Districts",816.9,"TRAFFIC CONTROL SIGNAL REMOVED AND TRANSPORTED","LS",7,1,6000,5128.57]
["All Districts",817.1,"SIGNAL POST AND BASE STANDARD - 8 FOOT","EA",46,2,1925,1949]
["All Districts",817.11,"SIGNAL POST AND BASE STANDARD - 10 FOOT","EA",60,1,625,615]
["All Districts",817.2,"SIGNAL POST AND BASE PEDESTAL - 8 FOOT","EA",3,1,16000,13476.67]
["All Districts",817.6,"SIGNAL MAST ARM 20 FEET - STEEL","EA",2,1,2100,2050]
["All Districts",817.61,"SIGNAL MAST ARM 25 FEET - STEEL","EA",5,2,4300,3760]
["All Districts",817.62,"SIGNAL MAST ARM 30 FEET - STEEL","EA",23,3,11150,10956.15]
["All Districts",817.63,"SIGNAL MAST ARM 35 FEET - STEEL","EA",7,2,6400,5640]
["All Districts",817.64,"SIGNAL MAST ARM 40 FEET - STEEL","EA",11,2,7100,6080]
["All Districts",817.65,"SIGNAL MAST ARM 45 FEET - STEEL","EA",11,2,7600,6500]
["All Districts",817.66,"SIGNAL MAST ARM 50 FEET - STEEL","EA",4,1,8650,8650]
["All Districts",817.67,"SIGNAL MAST ARM 55 FEET - STEEL","EA",2,1,10250,10250]
["All Districts",817.68,"SIGNAL MAST ARM 60 FEET - STEEL","EA",2,1,11000,11000]
["All Districts",818.11,"SIGNAL HEAD 1 WAY, ONE SECTION 12 INCH LENS","EA",40,1,292.5,277.5]
["All Districts",818.13,"SIGNAL HEAD 1 WAY, THREE SECTION 12 INCH LENS","EA",160,1,837.5,797.5]
["All Districts",818.14,"SIGNAL HEAD 1 WAY, FOUR SECTION 12 INCH LENS","EA",48,1,912.5,875]
["All Districts",818.15,"SIGNAL HEAD 1 WAY, FIVE SECTION 12 INCH LENS","EA",40,1,937.5,925]
["All Districts",819.83100000000002,"WIRE LOOP INSTALLED IN ROADWAY","FT",161455,22,14.75,14.12]
["All Districts",820.1,"HIGHWAY LIGHTING - ROADWAY","LS",5,1,55000,50000]
["All Districts",820.11,"HIGHWAY LIGHTING - UNDERPASS","LS",3,1,50000,48333.33]
["All Districts",821.12,"HIGHWAY LIGHTING POLE (ANCHOR BASE) 8 FOOT BRACKET","EA",108,1,6000,5756]
["All Districts",822.88,"HIGH MAST TOWER (100 FOOT MOUNTING HEIGHT)","EA",35,1,44754.91,47772.83]
["All Districts",823.6,"HIGHWAY LIGHTING LOAD CENTER","LS",34,5,23000,21689.439999999999]
["All Districts",823.61,"HIGHWAY LIGHTING LOAD CENTER NO.1","LS",16,3,18250,18333.75]
["All Districts",823.62,"HIGHWAY LIGHTING LOAD CENTER NO.2","LS",9,2,20000,20833.330000000002]
["All Districts",823.7,"HIGHWAY LIGHTING POLE AND LUMINAIRE REMOVED AND RESET","EA",14,3,2250,2195.36]
["All Districts",823.71,"HIGHWAY LIGHTING POLE AND LUMINAIRE REMOVED AND STACKED","EA",428,3,680,663.61]
["All Districts",824.1,"FLASHING WARNING BEACON TYPE D","LS",5,1,9639.07,7275.63]
["All Districts",824.2,"FLASHING WARNING BEACON TYPE A","LS",3,1,9575,9050]
["All Districts",824.5,"FLASHING WARNING BEACON REMOVED AND RESET","LS",3,1,3950,3300]
["All Districts",824.51,"FLASHING WARNING BEACON REMOVED AND STACKED","LS",5,1,1016,876.4]
["All Districts",824.71,"HIGHWAY WARNING SIGN - ILLUMINATED REMOVED AND STACKED","LS",3,1,1320,1280]
["All Districts",826.51,"FIRE ALARM BOX REMOVED AND RESET","EA",3,1,1000,1050]
["All Districts",827.21,"24 INCH WARNING CLUSTER (H1-2) - ALUMINUM PANEL (TYPE A)","EA",42,4,150,157.96]
["All Districts",827.33,"ABUTMENT WARNING SIGN (H1-3) - ALUMINUM PANEL (TYPE A)","EA",46,2,160,168.5]
["All Districts",828.01,"OVERHEAD GUIDE SIGN REMOVED AND RESET","SF",2310,1,17.5,18.399999999999999]
["All Districts",828.02,"OVERHEAD GUIDE SIGN REMOVED AND STACKED","EA",8,1,1337.5,1337.5]
["All Districts",828.03,"OVERHEAD GUIDE SIGN REMOVED","EA",4,1,2000,2100]
["All Districts",828.1,"OVERHEAD GUIDE SIGN - ALUMINUM PANEL (TYPE B)","SF",67184,9,24.25,24.83]
["All Districts",829,"ROADSIDE GUIDE SIGN (G) - ALUMINUM PANEL (TYPE B)","SF",35169.5,14,25,24.57]
["All Districts",831,"ROADSIDE GUIDE SIGN (D6/D8) - ALUMINUM PANEL (TYPE A)","SF",13838,13,25,26.11]
["All Districts",832,"WARNING-REGULATORY AND ROUTE MARKER - ALUMINUM PANEL (TYPE A)","SF",156500,94,14,13.63]
["All Districts",833.5,"DEMOUNTABLE REFLECTORIZED DELINEATOR - GUARD RAIL","EA",13550,20,7.5,7.8]
["All Districts",833.7,"DELINEATION FOR GUARD RAIL TERMINI","EA",5641,45,56,56.5]
["All Districts",834,"DEMOUNTABLE REFLECTORIZED REFERENCE LOCATION SIGN","EA",686,6,155,159.22999999999999]
["All Districts",834.17,"REFLECTORIZED FLEXIBLE DELINEATOR POST (AMBER)","EA",7078,14,42,41.56]
["All Districts",834.18,"REFLECTORIZED FLEXIBLE DELINEATOR POST (WHITE)","EA",9801,14,43.09,44.08]
["All Districts",836.5,"DEMOUNTABLE REFLECTORIZED STATION MARKER","EA",2244,6,45.25,46.7]
["All Districts",840.101,"SUPPORTS FOR OVERHEAD GUIDE SIGN (OD-1) STEEL","LS",20,3,135000,148039.20000000001]
["All Districts",840.10199999999998,"SUPPORTS FOR OVERHEAD GUIDE SIGN (OD-2) STEEL","LS",15,3,95000,81739.33]
["All Districts",840.10299999999995,"SUPPORTS FOR OVERHEAD GUIDE SIGN (OD-3) STEEL","LS",7,2,75000,76392.14]
["All Districts",840.10400000000004,"SUPPORTS FOR OVERHEAD GUIDE SIGN (OD-4) STEEL","LS",14,3,75000,76675.710000000006]
["All Districts",840.10500000000002,"SUPPORTS FOR OVERHEAD GUIDE SIGN (OD-5) STEEL","LS",12,2,140000,127333.5]
["All Districts",840.10599999999999,"SUPPORTS FOR OVERHEAD GUIDE SIGN (OD-6) STEEL","LS",1,1,95000,95000]
["All Districts",840.10699999999997,"SUPPORTS FOR OVERHEAD GUIDE SIGN (OD-7) STEEL","LS",6,1,111000,114000]
["All Districts",840.10799999999995,"SUPPORTS FOR OVERHEAD GUIDE SIGN (OD-8) STEEL","LS",8,2,42000,44550]
["All Districts",840.10900000000004,"SUPPORTS FOR OVERHEAD GUIDE SIGN (OD-9) STEEL","LS",8,2,73250,67556.25]
["All Districts",840.11,"SUPPORTS FOR OVERHEAD GUIDE SIGN (OD-10) STEEL","LS",7,1,50000,45600]
["All Districts",841.1,"SUPPORTS FOR GUIDE SIGN (D6 W/ D8-5 INCH TUBULAR POST) STEEL","EA",222,10,1650,1671.11]
["All Districts",841.2,"SUPPORTS FOR GUIDE SIGN (D6-5 INCH TUBULAR POST) STEEL","EA",161,8,1700,1694.8]
["All Districts",841.6,"SUPPORTS FOR GUIDE SIGN (I-2A-5 INCH TUBULAR POST) STEEL","EA",33,6,1200,1293.33]
["All Districts",841.8,"SUPPORTS FOR GUIDE SIGN (D6 - SPECIAL DESIGN) STEEL","EA",78,4,2800,2810.18]
["All Districts",844.101,"SUPPORTS FOR GUIDE SIGN (G1) STEEL","LS",24,5,7000,7002.8]
["All Districts",844.10199999999998,"SUPPORTS FOR GUIDE SIGN (G2) STEEL","LS",19,3,6500,6487.75]
["All Districts",844.10299999999995,"SUPPORTS FOR GUIDE SIGN (G3) STEEL","LS",22,4,6625,6625.79]
["All Districts",844.10400000000004,"SUPPORTS FOR GUIDE SIGN (G4) STEEL","LS",18,3,5800,5471.39]
["All Districts",844.10500000000002,"SUPPORTS FOR GUIDE SIGN (G5) STEEL","LS",18,3,5800,5471.39]
["All Districts",845.1,"SUPPORT FOR GUIDE SIGN (E5-1) STEEL","EA",1,1,2700,2700]
["All Districts",846.1,"SUPPORT FOR GUIDE SIGN (E5-1A) STEEL","EA",83,5,2725,2537.9299999999998]
["All Districts",847.1,"SIGN SUP (N/GUIDE)+RTE MKR W/1 BRKWAY POST ASSEMBLY - STEEL","EA",20972,93,140,143.08000000000001]
["All Districts",848.1,"SIGN SUP (N/GUIDE)+RTE MKR W/2 BRKWAY POST ASSEMBLIES-STEEL","EA",2672,26,250,255.65]
["All Districts",850.41,"ROADWAY FLAGGER","HR",187418,106,60,62.21]
["All Districts",851.1,"TRAFFIC CONES FOR TRAFFIC MANAGEMENT","DAY",14744,53,97.5,96.45]
["All Districts",852,"SAFETY SIGNING FOR TRAFFIC MANAGEMENT","SF",516807.25,174,20,21.97]
["All Districts",853.1,"PORTABLE BREAKAWAY BARRICADE TYPE III","EA",3591,84,130,127.91]
["All Districts",853.2,"TEMPORARY BARRIER (TL-2)","FT",64982.44,25,50,48.18]
["All Districts",853.21,"TEMPORARY BARRIER REMOVED AND RESET","FT",637190,56,14,14.26]
["All Districts",853.23,"TEMPORARY BARRIER (TL-3)","FT",118775,32,53.5,52.63]
["All Districts",853.3,"TEMPORARY RESTRAINED BARRIER","FT",4780,2,100,103.57]
["All Districts",853.31,"TEMPORARY RESTRAINED BARRIER REMOVED AND RESET","FT",6640,2,14,13.31]
["All Districts",853.33,"TEMPORARY BARRIER - LIMITED DEFLECTION (TL-3)","FT",361285,29,80,74.38]
["All Districts",853.40300000000002,"TRUCK MOUNTED ATTENUATOR","DAY",103401,118,130,131.27000000000001]
["All Districts",853.41,"TEMPORARY IMPACT ATTENUATOR FOR SHLDR, INCAPABLE OF REDIRECTION","EA",219,10,5040,5208.8]
["All Districts",853.41099999999994,"TEMPORARY IMPACT ATTENUATOR FOR SHOULDER, INCAPABLE OF REDIRECTION, REMOVED AND RESET","EA",345,5,1420,1458.3]
["All Districts",853.42,"TEMPORARY IMPACT ATTENUATOR FOR SHOULDER, CAPABLE OF REDIRECTION","EA",114,5,6200,6563]
["All Districts",853.42100000000005,"TEMPORARY IMPACT ATTENUATOR FOR SHOULDER, CAPABLE OF REDIRECTION, REMOVED AND RESET","EA",44,2,2000,1965]
["All Districts",853.43,"TEMPORARY IMPACT ATTENUATOR FOR MEDIAN, INCAPABLE OF REDIRECTION","EA",38,4,5982.5,5870.74]
["All Districts",853.43100000000004,"TEMPORARY IMPACT ATTENUATOR FOR MEDIAN, INCAPABLE OF REDIRECTION, REMOVED AND RESET","EA",8,1,1786.5,1818.25]
["All Districts",853.50099999999998,"TEMPORARY IMPACT ATTENUATOR REMOVED AND RESET","EA",1012,46,1500,1458.08]
["All Districts",853.52,"TEMPORARY IMPACT ATTENUATOR UNIDIRECTIONAL, NON-REDIRECTIVE (TL-2)","EA",46,5,4500,4087.5]
["All Districts",853.53,"TEMPORARY IMPACT ATTENUATOR UNIDIRECTIONAL, NON-REDIRECTIVE (TL-3)","EA",174,14,6000,6237.48]
["All Districts",853.62,"TEMPORARY IMPACT ATTENUATOR UNIDIRECTIONAL, REDIRECTIVE (TL-2)","EA",74,2,6000,6369.8]
["All Districts",853.63,"TEMPORARY IMPACT ATTENUATOR UNIDIRECTIONAL, REDIRECTIVE (TL-3)","EA",336,22,6000,6106.37]
["All Districts",853.72,"TEMPORARY IMPACT ATTENUATOR BI-DIRECTIONAL, NON-REDIRECTIVE (TL-2)","EA",18,1,4000,3811.11]
["All Districts",853.73,"TEMPORARY IMPACT ATTENUATOR BI-DIRECTIONAL, NON-REDIRECTIVE (TL-3)","EA",60,6,5500,5198.74]
["All Districts",853.8,"TEMPORARY ILLUMINATION FOR WORK ZONE","DAY",26972,83,100,106.24]
["All Districts",853.83,"TEMPORARY IMPACT ATTENUATOR BI-DIRECTIONAL, REDIRECTIVE (TL-3)","EA",54,5,6000,6018.18]
["All Districts",854.01599999999996,"TEMPORARY PAVING MARKINGS - 6 INCH (PAINTED)","FT",24867207,87,0.4,0.37]
["All Districts",854.03599999999994,"TEMPORARY PAVING MARKINGS - 6 INCH (TAPE)","FT",2552947,90,1.5,1.44]
["All Districts",854.1,"PAVEMENT MARKING REMOVAL","SF",1675743,59,2,1.89]
["All Districts",854.5,"RAISED PAVEMENT MARKER REMOVAL","EA",9385,6,20,16.47]
["All Districts",854.6,"TEMPORARY PORTABLE RUMBLE STRIP","DAY",51596,34,50,42.57]
["All Districts",856,"ARROW BOARD","DAY",328740,157,10,9.82]
["All Districts",856.12,"PORTABLE CHANGEABLE MESSAGE SIGN","DAY",578380,154,24,23.56]
["All Districts",859,"REFLECTORIZED DRUM","DAY",16545957,151,0.25,0.26]
["All Districts",859.1,"REFLECTORIZED DRUMS WITH SEQUENTIAL FLASHING WARNING LIGHTS","DAY",493407,115,5,4.3499999999999996]
["All Districts",860.10599999999999,"6 INCH REFLECTORIZED WHITE LINE (PAINTED)","FT",4123650,14,0.5,0.43]
["All Districts",860.11199999999997,"12 INCH REFLECTORIZED WHITE LINE (PAINTED)","FT",157646,5,1.78,2.12]
["All Districts",861.10599999999999,"6 INCH REFLECTORIZED YELLOW LINE (PAINTED)","FT",3449780,16,0.5,0.47]
["All Districts",861.11199999999997,"12 INCH REFLECTORIZED YELLOW LINE (PAINTED)","FT",11100,2,1.5,1.54]
["All Districts",864,"PAVEMENT ARROW REFLECTORIZED WHITE (PAINTED)","SF",12450,3,4,3.9]
["All Districts",864.01,"PAVEMENT ARROW AND LEGENDS REFLECTORIZED WHITE - INLAY TAPE","SF",28830,4,49.88,49.27]
["All Districts",864.02,"PAVEMENT ARROW AND LEGENDS - TAPE","SF",7712,7,47.5,44.09]
["All Districts",864.04,"PAVEMENT ARROWS AND LEGENDS REFLECTORIZED WHITE (THERMOPLASTIC)","SF",327796,65,10,8.84]
["All Districts",864.07,"PAVEMENT ARROW AND LEGENDS (EPOXY)","SF",6610,4,8.5,9.02]
["All Districts",864.31,"SLOTTED PAVEMENT MARKER ONE-WAY WHITE","EA",30249,25,25,25.98]
["All Districts",864.32,"SLOTTED PAVEMENT MARKER ONE-WAY YELLOW","EA",13993,15,26.4,27.38]
["All Districts",864.33,"SLOTTED PAVEMENT MARKER TWO-WAY WHITE/RED","EA",22415,19,25.25,26.28]
["All Districts",864.34,"SLOTTED PAVEMENT MARKER TWO-WAY YELLOW/RED","EA",19500,18,25,25.1]
["All Districts",864.35,"SLOTTED PAVEMENT MARKER TWO-WAY YELLOW/YELLOW","EA",35366,20,28.38,27.42]
["All Districts",866.10599999999999,"6 INCH REFLECTORIZED WHITE LINE (THERMOPLASTIC)","FT",4591277,41,1.05,1.03]
["All Districts",866.11199999999997,"12 INCH REFLECTORIZED WHITE LINE (THERMOPLASTIC)","FT",890015,48,4.5,4.1900000000000004]
["All Districts",866.20600000000002,"6 INCH REFLECTORIZED WHITE LINE (POLYUREA) (RECESSED)","FT",3169102,30,2,2.09]
["All Districts",866.21199999999999,"12 INCH REFLECTORIZED WHITE LINE (POLYUREA) (RECESSED)","FT",254532,26,7,7.1]
["All Districts",867.10599999999999,"6 INCH REFLECTORIZED YELLOW LINE (THERMOPLASTIC)","FT",4179190,41,1.05,1.03]
["All Districts",867.11199999999997,"12 INCH REFLECTORIZED YELLOW LINE (THERMOPLASTIC)","FT",75020,27,4.5,4.12]
["All Districts",867.20600000000002,"6 INCH REFLECTORIZED YELLOW LINE (POLYUREA) (RECESSED)","FT",2647368,29,2,2.08]
["All Districts",867.21199999999999,"12 INCH REFLECTORIZED YELLOW LINE (POLYUREA) (RECESSED)","FT",20100,11,8,7.78]
["All Districts",868.06,"6 INCH REFLECTORIZED WHITE LINE (EPOXY)","FT",43350,3,1,1.04]
["All Districts",868.12,"12 INCH REFLECTORIZED WHITE LINE (EPOXY)","FT",27800,1,1.75,1.75]
["All Districts",869.06,"6 INCH REFLECTORIZED YELLOW LINE (EPOXY)","FT",37800,3,1.05,1.1200000000000001]
["All Districts",869.12,"12 INCH REFLECTORIZED YELLOW LINE (EPOXY)","FT",1600,1,5.75,5.75]
["All Districts",874,"STREET NAME SIGN","EA",3973,43,120,118.75]
["All Districts",874.1,"STREET SIGN REMOVED AND RESET","EA",165,9,150,138.47999999999999]
["All Districts",874.2,"TRAFFIC SIGN REMOVED AND RESET","EA",4127,75,124.44,115.75]
["All Districts",874.3,"TRAFFIC SIGNS REMOVED AND STACKED","LS",5,2,964.5,785.8]
["All Districts",874.4,"TRAFFIC SIGN REMOVED AND STACKED","EA",4490,40,35,35.07]
["All Districts",874.6,"TEMPORARY MASKING OF SIGNS","SF",90,1,20,18.329999999999998]
["All Districts",874.7,"MISCELLANEOUS SIGNS REMOVED AND STACKED","EA",34,5,100,83]
["All Districts",877,"SIGN POST REMOVED AND RESET","EA",600,1,85,85]
["All Districts",877.1,"SIGN POST REMOVED AND DISCARDED","EA",1409,7,22.5,18.36]
["All Districts",877.2,"SIGN POST REMOVED AND STACKED","EA",14,2,40,38.33]
["All Districts",901,"4000 PSI, 1.5 INCH, 565 CEMENT CONCRETE","CY",8841,27,1200,1144.3499999999999]
["All Districts",901.3,"4000 PSI, 1.5 INCH, 565 CEMENT CONCRETE FOR POST FOUNDATION","CY",311,6,412.5,365.95]
["All Districts",902,"3500 PSI, 1.5 INCH, 520 CEMENT CONCRETE","CY",6,1,975,975]
["All Districts",903,"3000 PSI, 1.5 INCH, 470 CEMENT CONCRETE","CY",1955,27,450,431.62]
["All Districts",904,"4000 PSI, 3/4 INCH, 610 CEMENT CONCRETE","CY",543.5,13,1500,1441.43]
["All Districts",904.3,"5000 PSI, 3/4 INCH, 685 HP CEMENT CONCRETE","CY",2061,7,2000,2191.5100000000002]
["All Districts",904.4,"4000 PSI, 3/4 INCH, 585 HP CEMENT CONCRETE","CY",66,1,5000,7486.77]
["All Districts",905,"4000 PSI, 3/8 INCH, 660 CEMENT CONCRETE","CY",6652,40,4000,4495.93]
["All Districts",905.2,"5000 PSI, 3/8 INCH, 710 HP CEMENT CONCRETE","CY",447,4,3000,3987.99]
["All Districts",907,"SAWCUT GROOVES IN CONCRETE BRIDGE DECK","SY",9900,1,15,16]
["All Districts",908,"CEMENT FOR POINTING","BAG",454,2,225,186]
["All Districts",908.1,"CONCRETE PENETRANT","SF",267750,3,2,3.03]
["All Districts",909.2,"CEMENTITIOUS MORTAR FOR PATCHING","SF",51017,22,85,81.87]
["All Districts",909.99,"RAPID SET CEMENT","BAG",60,3,100,90]
["All Districts",910,"STEEL REINFORCEMENT FOR STRUCTURES","LB",330570,20,4,3.71]
["All Districts",910.1,"STEEL REINFORCEMENT FOR STRUCTURES - EPOXY COATED","LB",858663,59,3,3.42]
["All Districts",910.2,"STEEL REINFORCEMENT FOR STRUCTURES - COATED","LB",246060,1,3.5,3.5]
["All Districts",910.4,"MECHANICAL REINFORCING BAR SPLICER","EA",105,3,65,66.5]
["All Districts",911.1,"SHEAR CONNECTORS","EA",930,1,16.98,17.920000000000002]
["All Districts",912,"DRILLING AND GROUTING DOWELS","EA",16490,10,57.5,54.12]
["All Districts",912.1,"DRILLING AND GROUTING DOWELS","FT",20880,1,32.5,32.5]
["All Districts",912.4,"DRILLED AND GROUTED #4 DOWELS","EA",1690,2,65,64.290000000000006]
["All Districts",912.5,"DRILLED AND GROUTED #5 DOWELS","EA",10456,7,50,49.8]
["All Districts",912.6,"DRILLED AND GROUTED #6 DOWELS","EA",8440,3,58.88,55.87]
["All Districts",913.2,"CORING AND GROUTING ANCHOR BOLTS","EA",1344,1,155,158.57]
["All Districts",913.3,"CORING AND GROUTING DOWELS","EA",200,1,26.75,26.75]
["All Districts",920,"GRANITE CAPSTONE","FT",250,1,177.5,185]
["All Districts",942.10199999999998,"STEEL PILE HP 10 X 57","FT",9040,2,170,173.56]
["All Districts",942.12400000000002,"STEEL PILE HP 12 X 84","FT",95293,4,205,181.41]
["All Districts",942.14200000000005,"STEEL PILE HP 14 X 89","FT",66265,2,110,129.74]
["All Districts",944.12400000000002,"STEEL PILE SPLICE HP 12 X 84","EA",21,1,500,525]
["All Districts",944.14200000000005,"STEEL PILE SPLICE HP 14 X 89","EA",75,1,1150,1016.67]
["All Districts",945.10199999999998,"DRILLED SHAFT EXCAVATION 3.5 FOOT DIAMETER","FT",165,1,582.5,503.67]
["All Districts",945.10500000000002,"DRILLED SHAFT EXCAVATION 5.0 FOOT DIAMETER","FT",4932,1,850,1047.27]
["All Districts",945.202,"ROCK SOCKET EXCAVATION 3.5 FOOT DIAMETER","FT",135,2,1000,2044.38]
["All Districts",945.20399999999995,"ROCK SOCKET EXCAVATION 4.5 FOOT DIAMETER","FT",1575,1,1600,1533.33]
["All Districts",945.30499999999995,"OBSTRUCTION EXCAVATION 5.0 FOOT DIAMETER","FT",120,1,2314.33,2128.58]
["All Districts",945.40499999999997,"TRIAL SHAFT 5.0 FOOT DIAMETER","FT",635,1,4600,4406.4399999999996]
["All Districts",945.50199999999995,"DRILLED SHAFT 3.5 FOOT DIAMETER","FT",360,1,750,822.67]
["All Districts",945.505,"DRILLED SHAFT 5.0 FOOT DIAMETER","FT",13010,1,1350,1373.86]
["All Districts",945.60500000000002,"PERMANENT CASING 5.0 FOOT DIAMETER","FT",10385,1,650,658.93]
["All Districts",945.71,"CROSS HOLE SONIC TESTING ACCESS PIPES","FT",39582,1,5.5,4.66]
["All Districts",945.72,"CROSS HOLE SONIC TEST","EA",105,1,2500,2743.58]
["All Districts",945.81,"OSTERBERG LOAD CELL AXIAL LOAD TEST","EA",4,1,255000,242322.66]
["All Districts",946.12,"PRECAST-PRESTRESSED CONCRETE PILE - 12 INCH","FT",17200,1,86.2,94.31]
["All Districts",947,"TEST PILE","FT",216,1,420,378.23]
["All Districts",948.1,"SHORT DURATION LOAD TEST","EA",7,2,65000,65106.97]
["All Districts",948.41,"DYNAMIC LOAD TEST BY CONTRACTOR","EA",142,7,7000,7217.69]
["All Districts",948.5,"PILE SHOES","EA",1193,6,170,158.33000000000001]
["All Districts",950.1,"TEMPORARY SHORING","LS",22,5,190000,171895.46]
["All Districts",955,"TREATED TIMBER","MBF",3.75,1,40000,36400]
["All Districts",960.1,"STRUCTURAL STEEL - COATED STEEL","LB",249146,2,7.5,7.94]
["All Districts",961.101,"CLEAN AND PAINT (OVERCOAT) STEEL BRIDGE NO. _______________","LS",5,1,535000,496921.4]
["All Districts",961.20100000000002,"CLEAN (FULL REMOVAL) AND PAINT STEEL BRIDGE NO. ________","LS",39,8,649400,638497.47]
["All Districts",961.202,"CLEAN (FULL REMOVAL) AND PAINT STEEL BRIDGE NO. ________","LS",15,4,524989.30000000005,534138.28]
["All Districts",961.20299999999997,"CLEAN (FULL REMOVAL) AND PAINT STEEL BRIDGE NO. _______","LS",10,2,414472,375014.7]
["All Districts",961.20399999999995,"CLEAN (FULL REMOVAL) AND PAINT STEEL BRIDGE NO. ________","LS",9,2,395000,345708]
["All Districts",961.20500000000004,"CLEAN (FULL REMOVAL) AND PAINT STEEL BRIDGE NO. _____","LS",5,1,275000,275068]
["All Districts",964.1,"EPOXY BONDING COMPOUND","SF",120055,17,4,3.53]
["All Districts",964.7,"EPOXY MORTAR FOR PATCHING","SF",650,3,40,40]
["All Districts",965,"MEMBRANE WATERPROOFING FOR BRIDGE DECKS","SF",520952,2,35,8]
["All Districts",965,"MEMBRANE WATERPROOFING FOR BRIDGE DECKS","SY",1630,4,35,44.32]
["All Districts",966,"MEMBRANE WATERPROOFING FOR BRIDGE DECK REPAIRS","SF",395384,12,4.5,4.03]
["All Districts",968.1,"SCUPPER AND DOWNSPOUT","EA",52,2,9150,13050]
["All Districts",968.4,"SCUPPER-REMOVED","EA",60,1,1733.5,1733.5]
["All Districts",970,"BITUMINOUS DAMP-PROOFING","SY",2008,2,25,24]
["All Districts",972,"STRIP SEAL BRIDGE JOINT SYSTEM","FT",1330,2,555,512.83000000000004]
["All Districts",974.1,"METAL BRIDGE RAILING REMOVED AND RESET","FT",300,1,149,132.6]
["All Districts",974.3,"METAL BRIDGE RAILING REMOVED","FT",760,1,100,100]
["All Districts",975.4,"PROTECTIVE SCREEN TYPE II","FT",2550,1,690,739.8]
["All Districts",975.5,"ALUMINUM HANDRAIL","FT",485,1,467.5,502]
["All Districts",983,"DUMPED RIPRAP","TON",42770,13,70,69.47]
["All Districts",983.01,"DUMPED RIPRAP","CY",1200,2,100,99.64]
["All Districts",983.1,"RIPRAP","TON",24026,11,80,80.91]
["All Districts",983.11,"MODIFIED RIPRAP","TON",3000,2,100,92.2]
["All Districts",983.3,"RIPRAP REMOVED AND RELAID","CY",4001,3,112.61,89.42]
["All Districts",984.601,"DUMPED STONE FOR EROSION CONTROL","TON",60,1,90,90]
["All Districts",985.01,"SLOPE PAVING REMOVED AND RESET","SY",720,1,192.5,182.65]
["All Districts",986,"MODIFIED ROCKFILL","TON",67297,25,80,77.69]
["All Districts",986.1,"MODIFIED ROCKFILL","SY",8010,2,55,54.57]
["All Districts",986.2,"MODIFIED ROCKFILL","CY",3968,4,100,104.19]
["All Districts",987,"SPECIAL SLOPE PAVING UNDER BRIDGE - OPTION","SY",720,2,120,112.33]
["All Districts",987.02,"SPECIAL SLOPE PAVING UNDER BRIDGE REMOVED AND RESET","SY",2885,4,105,102.2]
["All Districts",987.3,"SPECIAL SLOPE PAVING UNDER BRIDGE - CEMENT CONCRETE","SY",13525,7,145,157.59]
["All Districts",988,"CHANNEL PAVING","SY",1120,1,110.18,106.19]
["All Districts",991.1,"CONTROL OF WATER - STRUCTURE NO. ______","LS",45,16,100000,82650.06]
["All Districts",991.2,"CONTROL OF WATER - STRUCTURE NO. ______","LS",7,2,50000,42142.86]
["All Districts",992.1,"ALTERATION TO BRIDGE STRUCTURE NO. ______","LS",38,6,558000,527764.43000000005]
["All Districts",992.2,"ALTERATION TO BRIDGE STRUCTURE NO. ______","LS",5,1,325000,308809.40000000002]
["All Districts",992.3,"TEMPORARY SUPPORTS FOR BRIDGE STRUCTURE","LS",12,3,90000,87959]
["All Districts",992.32,"TEMPORARY SUPPORTS FOR PIPING","LS",7,1,800000,778571.43]
["All Districts",993.1,"TEMPORARY BRIDGE NO. ______","LS",2,1,2147691,2648845.5]
["All Districts",994.01,"TEMPORARY PROTECTIVE SHIELDING BRIDGE NO. _______________","LS",18,9,65000,54142.26]
["All Districts",994.1,"TEMPORARY PROTECTIVE SHIELDING","SF",279953,26,10.5,10.46]
["All Districts",995,"BRIDGE SUPERSTRUCTURE, BRIDGE NO._______","LS",28,3,3187500,3379342.22]
["All Districts",995.01,"BRIDGE STRUCTURE, BRIDGE NO. ______","LS",55,10,1438406.45,1053132.42]
["All Districts",995.01099999999997,"CULVERT STRUCTURE, CULVERT NO. _______","LS",8,1,869000,829362.27]
["All Districts",995.02,"BRIDGE STRUCTURE, BRIDGE NO. _______","LS",11,2,9870120.5,9842953.0899999999]
["All Districts",995.03,"BRIDGE STRUCTURE, BRIDGE NO. _______","LS",3,1,5401000,6608666.6699999999]
["All Districts",996.01,"WALL STRUCTURE, WALL NO. ________________","LS",23,4,430000,453086.96]
["All Districts",996.02,"WALL STRUCTURE, WALL NO. ________________","LS",9,2,350000,342666.67]
["All Districts",996.31,"MECHANICALLY STABILIZED EARTH WALL","SY",954,1,785,760]
[1,100,"SCHEDULE OF OPERATIONS - FIXED PRICE $__________","LS",36,6,14000,10305.56]
[1,100.001,"ELECTRICIAN","HR",1120,1,137.5,131.25]
[1,100.005,"PLUMBER","HR",1120,1,145,139.75]
[1,100.1,"BASE LABOR RATE","HR",6270,4,131,133.05000000000001]
[1,100.5,"ELECTRICAL WORK","LS",1,1,83000,83000]
[1,100.61,"HVAC WORK","LS",1,1,68515,68515]
[1,101,"CLEARING AND GRUBBING","A",40,8,31500,34014.85]
[1,102,"SELECTIVE CLEARING AND THINNING","A",11.75,3,21500,21779.040000000001]
[1,102.1,"TREE TRIMMING","FT",29450,5,13,12.57]
[1,102.12,"TREE TRIMMING","EA",8,1,250,250]
[1,102.3,"HERBICIDE TREATMENT FOR INVASIVE PLANTS","HR",720,2,400,385.39]
[1,102.33,"INVASIVE PLANT MANAGEMENT STRATEGY","HR",280,2,180,173.89]
[1,102.511,"TREE PROTECTION â€“ ARMORING & PRUNING","EA",485,7,400,374.1]
[1,102.521,"TREE AND PLANT PROTECTION FENCE","FT",17215,7,7.45,7.54]
[1,102.55,"ARBORIST","HR",525,1,136.5,139.30000000000001]
[1,103,"TREE REMOVED - DIAMETER UNDER 24 INCHES","EA",102,2,1200,1217.57]
[1,104,"TREE REMOVED - DIAMETER 24 INCHES AND OVER","EA",57,4,2800,2826.94]
[1,107.02,"LOW ALLOY STEEL PLATES","LB",73000,2,1,1.1100000000000001]
[1,107.85,"SEALING RANDOM CRACKS IN CEMENT CONCRETE PAVEMENT","FT",2400,1,25,24.17]
[1,107.855,"PRESSURE INJECTION OF CRACKS","FT",1695,2,115,106.25]
[1,107.97,"STRUCTURAL STEEL REPAIRS","LB",6900,1,81,81.33]
[1,114.1,"DEMOLITION OF SUPERSTRUCTURE OF BRIDGE NO. _____","LS",11,3,275000,281680.09000000003]
[1,116,"REMOVAL OF TEMPORARY STRUCTURE","LS",5,1,100000,105877.4]
[1,118,"TEMPORARY CONSTRUCTION ACCESS ROAD","LS",5,2,77500,66000]
[1,120,"EARTH EXCAVATION","CY",191020,17,32,33.39]
[1,120.1,"UNCLASSIFIED EXCAVATION","CY",4265,6,50,48.69]
[1,121,"CLASS A ROCK EXCAVATION","CY",3211,12,100,122.58]
[1,123,"MUCK EXCAVATION","CY",400,1,60,63.65]
[1,125,"TOPSOIL EXCAVATED AND STACKED","CY",630,1,24,23.33]
[1,127,"CONCRETE EXCAVATION","CY",21293,3,180,146.62]
[1,127.1,"REINFORCED CONCRETE EXCAVATION","CY",2355,5,800,1633.56]
[1,127.4,"REINFORCED CONCRETE DECK EXCAVATION (FULL DEPTH)","SY",108,1,855,793]
[1,127.41,"REINFORCED CONCRETE DECK EXCAVATION (PARTIAL DEPTH)","CY",168,1,2855,3148.57]
[1,129.19999999999999,"OLD PAVEMENT EXCAVATION","SY",1375,1,41,40.200000000000003]
[1,129.5,"TRACK EXCAVATION","FT",52760,1,15,16]
[1,140,"BRIDGE EXCAVATION","CY",20436,6,40,38.89]
[1,140.1,"BRIDGE EXCAVATION WITHIN COFFERDAM","CY",5700,2,94,81.13]
[1,141,"CLASS A TRENCH EXCAVATION","CY",15753,16,40,37.21]
[1,141.1,"TEST PIT FOR EXPLORATION","CY",3522,17,100,96.12]
[1,142,"CLASS B TRENCH EXCAVATION","CY",10661.5,9,40,36.11]
[1,143,"CHANNEL EXCAVATION","CY",4000,1,38,37.5]
[1,144,"CLASS B ROCK EXCAVATION","CY",2289,17,152.5,159.13999999999999]
[1,145,"DRAINAGE STRUCTURE ABANDONED","EA",40,2,685,578.91]
[1,146,"DRAINAGE STRUCTURE REMOVED","EA",271,8,775,728.59]
[1,150,"ORDINARY BORROW","CY",17550,5,35,34.81]
[1,150.1,"SPECIAL BORROW","CY",7560,4,39.06,35.43]
[1,151,"GRAVEL BORROW","CY",152289,16,45.5,44.81]
[1,151.01,"GRAVEL BORROW - TYPE C","CY",2030,6,40,39.79]
[1,151.1,"GRAVEL BORROW FOR BRIDGE FOUNDATION","CY",3000,1,60.5,57.83]
[1,151.19999999999999,"GRAVEL BORROW FOR BACKFILLING STRUCTURES AND PIPES","CY",6831,5,53.18,51.25]
[1,151.21,"GRAVEL BORROW FOR RIPRAP","CY",600,1,53.5,49.8]
[1,152,"PROCESSED GRAVEL","CY",4340,4,51.5,52.78]
[1,152.5,"PEASTONE FOR DRIVEWAYS","TON",300,1,55,52.6]
[1,153,"CONTROLLED DENSITY FILL - EXCAVATABLE","CY",192,3,200,171.34]
[1,153.1,"CONTROLLED DENSITY FILL - NON-EXCAVATABLE","CY",88,5,350,337.5]
[1,156,"CRUSHED STONE","TON",7957,18,55,52.69]
[1,156.5,"CRUSHED STONE FOR FILTER BLANKET","CY",175,1,71,69.430000000000007]
[1,157.1,"GABIONS","CY",240,1,575,590]
[1,157.19999999999999,"RENO MATTRESS","CY",180,1,575,588.33000000000004]
[1,170,"FINE GRADING AND COMPACTING - SUBGRADE AREA","SY",424260,18,4.88,4.3600000000000003]
[1,180.01,"ENVIRONMENTAL HEALTH AND SAFETY PROGRAM","LS",17,5,5060,5089.3500000000004]
[1,180.02,"PERSONAL PROTECTION LEVEL C UPGRADE","HR",172,3,20,18.57]
[1,180.03,"LICENSED SITE PROFESSIONAL SERVICES","HR",1600,4,130,125.32]
[1,181.11,"DISPOSAL OF UNREGULATED SOIL","TON",910,3,66.5,66.7]
[1,181.12,"DISPOSAL OF REGULATED SOIL - IN-STATE FACILITY","TON",760,3,115,113.51]
[1,181.13,"DISPOSAL OF REGULATED SOIL - OUT-OF-STATE FACILITY","TON",490,3,170,169.54]
[1,181.14,"DISPOSAL OF HAZARDOUS WASTE","TON",380,3,470,472.83]
[1,182.1,"INSPECTION AND TESTING FOR ASBESTOS","LS",10,3,2750,2630]
[1,182.2,"REMOVAL OF ASBESTOS","FT",1410,2,85,85.67]
[1,183.1,"TREATMENT OF CONTAMINATED GROUNDWATER","GAL",5500,2,12.75,11.75]
[1,183.2,"DISPOSAL OF GRANULAR ACTIVATED CARBON","LB",2500,2,7.14,7.47]
[1,184.1,"DISPOSAL OF TREATED WOOD PRODUCTS","TON",1989.1,13,325,315.56]
[1,201,"CATCH BASIN","EA",612.87,12,4000,4158.42]
[1,201.3,"SPECIAL CATCH BASIN","EA",23,2,7000,6825]
[1,202,"MANHOLE","EA",279.77999999999997,11,4500,4428.3100000000004]
[1,202.2,"MANHOLE (9 TO 14 FOOT DEPTH)","EA",17.760000000000002,1,6000,6093.75]
[1,203,"SPECIAL MANHOLE","EA",33,2,6500,6238.89]
[1,204,"GUTTER INLET","EA",55,6,2000,2027.07]
[1,205,"LEACHING BASIN","EA",24,2,6350,6420]
[1,206,"DROP INLET, TYPE A","EA",16,1,4000,4287.5]
[1,207,"DROP INLET, TYPE B","EA",6,1,5000,4983.33]
[1,207.1,"DROP INLET, TYPE BF","EA",2,1,6500,6500]
[1,209,"DROP INLET, TYPE D","EA",15,1,3800,4060]
[1,209.1,"DROP INLET, TYPE DF","EA",36,2,3400,3418.15]
[1,210,"SANITARY SEWER MANHOLE","EA",10,1,6000,5830]
[1,220,"DRAINAGE STRUCTURE ADJUSTED","EA",942,13,500,483.87]
[1,220.2,"DRAINAGE STRUCTURE REBUILT","FT",1021.5,9,500,506.26]
[1,220.3,"DRAINAGE STRUCTURE CHANGE IN TYPE","EA",69,7,1025,1094.6199999999999]
[1,220.5,"DRAINAGE STRUCTURE REMODELED","EA",35,5,1000,919.14]
[1,220.6,"SANITARY STRUCTURE REBUILT","FT",237,4,420,429.01]
[1,220.7,"SANITARY STRUCTURE ADJUSTED","EA",251,9,450,466.02]
[1,220.8,"SANITARY STRUCTURE REMODELED","EA",41,2,1000,963.66]
[1,221,"FRAME AND COVER","EA",370,8,900,913.71]
[1,221.1,"FRAME AND COVER - SECURED","EA",83,5,900,873.53]
[1,222,"FRAME AND GRATE - MASSDOT BAR TYPE","EA",4,1,1300,1300]
[1,222.1,"FRAME AND GRATE - MASSDOT CASCADE TYPE","EA",642,12,977.5,994.7]
[1,222.2,"FRAME AND GRATE - MASSDOT DROP INLET","EA",21,1,900,924.29]
[1,222.3,"FRAME AND GRATE (OR COVER) MUNICIPAL STANDARD","EA",420,1,836,857.2]
[1,222.4,"LARGE HOOK LOCK BAR GRATE â€“ FURNISHED AND INSTALLED","EA",221,2,2500,2533.33]
[1,223.1,"FRAME AND GRATE (OR COVER) REMOVED AND STACKED","EA",140,4,100,104.08]
[1,223.2,"FRAME AND GRATE (OR COVER) REMOVED AND DISCARDED","EA",359,9,100,82.94]
[1,224.12,"12 INCH HOOD","EA",176,2,500,584.38]
[1,227.3,"REMOVAL OF DRAINAGE STRUCTURE SEDIMENT","CY",992,14,300,288.95999999999998]
[1,227.31,"REMOVAL OF DRAINAGE PIPE SEDIMENT","FT",66880,13,10,8.7799999999999994]
[1,227.4,"MASONRY PLUG","SF",220,3,100,106.08]
[1,234.12,"12 INCH DRAINAGE PIPE - OPTION","FT",12255,6,100,96.49]
[1,234.15,"15 INCH DRAINAGE PIPE - OPTION","FT",5680,2,85.5,91.04]
[1,234.18,"18 INCH DRAINAGE PIPE - OPTION","FT",5970,4,137.5,128.58000000000001]
[1,234.24,"24 INCH DRAINAGE PIPE - OPTION","FT",170,2,150,143.18]
[1,235.12,"12 INCH DRAINAGE PIPE FLARED END - OPTION","EA",8,2,925,887.5]
[1,235.18,"18 INCH DRAINAGE PIPE FLARED END - OPTION","EA",6,1,1125,1083.33]
[1,235.24,"24 INCH DRAINAGE PIPE FLARED END - OPTION","EA",6,1,1300,1266.67]
[1,238.1,"10 INCH DUCTILE IRON PIPE","FT",1010,3,132,131.27000000000001]
[1,238.12,"12 INCH DUCTILE IRON PIPE","FT",4160,2,200,192]
[1,241.12,"12 INCH REINFORCED CONCRETE PIPE","FT",6733,4,97.5,89.1]
[1,241.15,"15 INCH REINFORCED CONCRETE PIPE","FT",280,1,100,106.43]
[1,241.18,"18 INCH REINFORCED CONCRETE PIPE","FT",24,1,222.5,206.67]
[1,241.24,"24 INCH REINFORCED CONCRETE PIPE","FT",863,3,147.5,135.87]
[1,241.48,"48 INCH REINFORCED CONCRETE PIPE","FT",250,1,320,339.69]
[1,242.12,"12 INCH REINFORCED CONCRETE PIPE FLARED END","EA",65,2,1050,1079.01]
[1,242.18,"18 INCH REINFORCED CONCRETE PIPE FLARED END","EA",9,1,1500,1388.89]
[1,242.24,"24 INCH REINFORCED CONCRETE PIPE FLARED END","EA",14,1,1800,1764.29]
[1,243.12,"12 INCH REINFORCED CONCRETE PIPE CLASS IV","FT",590,2,98.5,92.57]
[1,243.15,"15 INCH REINFORCED CONCRETE PIPE CLASS IV","FT",1710,1,100,96.89]
[1,244.12,"12 INCH REINFORCED CONCRETE PIPE CLASS V","FT",240,1,100,94.17]
[1,250.06,"6 INCH POLYVINYL CHLORIDE SANITARY SEWER PIPE","FT",4060,3,75,70.930000000000007]
[1,250.08,"8 INCH POLYVINYL CHLORIDE SANITARY SEWER PIPE","FT",1175,1,105,109]
[1,258,"STONE FOR PIPE ENDS","SY",633,6,100,97.22]
[1,269.06,"6 INCH SLOT-PERFORATED CORRUGATED PLASTIC PIPE (SUBDRAIN)","FT",2700,3,70,62.95]
[1,269.08,"8 INCH SLOT-PERFORATED CORRUGATED PLASTIC PIPE (SUBDRAIN)","FT",100,1,125,125]
[1,280,"HOT MIX ASPHALT WATERWAY","SY",3597,7,85,82.54]
[1,280.10000000000002,"HOT MIX ASPHALT WATERWAY","TON",1096,6,262.5,248.5]
[1,281,"CEMENT CONCRETE PAVING (WATERWAY)","SY",90,1,200,231.67]
[1,281.2,"JUTE MESH (WATERWAYS)","SY",3880,1,7,6.5]
[1,302.06,"6 INCH DUCTILE IRON WATER PIPE (RUBBER GASKET)","FT",75,1,150,159.4]
[1,303.06,"6 INCH DUCTILE IRON WATER PIPE (MECHANICAL JOINT)","FT",640,2,127.5,131.88999999999999]
[1,303.08,"8 INCH DUCTILE IRON WATER PIPE (MECHANICAL JOINT)","FT",1256,2,160,158.71]
[1,303.12,"12 INCH DUCTILE IRON WATER PIPE (MECHANICAL JOINT)","FT",1134,2,200,202.53]
[1,309,"DUCTILE IRON FITTINGS FOR WATER PIPE","LB",8360,5,7.25,7.06]
[1,315.08,"8 INCH WATER MAIN REMOVED AND STACKED","FT",980,1,30,28.9]
[1,315.12,"12 INCH WATER MAIN REMOVED AND STACKED","FT",795,1,32.5,32.4]
[1,347.1,"1 INCH COPPER TUBING TYPE K","FT",1010,3,70,74.87]
[1,349.08,"8 INCH GATE VALVE","EA",8,1,2500,2362.5]
[1,350.06,"6 INCH GATE AND GATE BOX","EA",5,1,2000,1910]
[1,350.08,"8 INCH GATE AND GATE BOX","EA",8,1,2500,2412.5]
[1,350.12,"12 INCH GATE AND GATE BOX","EA",8,1,3600,3550]
[1,357.06,"6 INCH GATE BOX","EA",5,1,500,510.4]
[1,357.08,"8 INCH GATE BOX","EA",27,3,500,477.31]
[1,357.12,"12 INCH GATE BOX","EA",4,1,395,336.25]
[1,357.16,"16 INCH GATE BOX","EA",5,1,600,606.6]
[1,357.2,"20 INCH GATE BOX","EA",5,1,600,617.20000000000005]
[1,358,"GATE BOX ADJUSTED","EA",585,10,275,261.33999999999997]
[1,358.1,"GATE BOX REMOVED AND STACKED","EA",3,1,150,116.67]
[1,363.1,"1 INCH CORPORATION COCK","EA",6,1,500,514.78]
[1,370.1,"8 X 6 INCH TAPPING SLEEVE, VALVE AND BOX","EA",24,2,7300,8048.07]
[1,371.08,"8 INCH COUPLING","EA",13,2,1000,895]
[1,371.12,"12 INCH COUPLING","EA",10,1,1362.5,1395]
[1,373.08,"8 INCH WATER PIPE INSULATION","FT",750,1,84,81.33]
[1,373.12,"12 INCH WATER PIPE INSULATION","FT",750,1,101,101.17]
[1,376.2,"HYDRANT - REMOVED AND RESET","EA",35,3,3000,2910.53]
[1,376.5,"HYDRANT - ADJUSTED","EA",10,2,2000,1835]
[1,381,"SERVICE BOX","EA",42,4,400,377.41]
[1,381.3,"SERVICE BOX ADJUSTED","EA",122,5,250,234.41]
[1,384,"CURB STOP","EA",12,2,500,478.47]
[1,384.2,"CURB STOP BOX ADJUSTED","EA",6,1,250,241.67]
[1,402,"DENSE GRADED CRUSHED STONE FOR SUB-BASE","CY",27885,17,75,73.16]
[1,402.1,"DENSE GRADED CRUSHED STONE FOR SUB-BASE","TON",40,1,115,115]
[1,402.12,"DENSE GRADED CRUSHED STONE FOR SHOULDERS","CY",3200,2,70,73.94]
[1,402.13,"PAVEMENT MILLING MULCH FOR SHOULDERS","FT",219080,5,5.6,5.99]
[1,415.1,"PAVEMENT STANDARD MILLING","SY",143760,2,7.25,6.47]
[1,415.2,"PAVEMENT FINE MILLING","SY",1677505,8,8.2799999999999994,7.06]
[1,415.3,"PAVEMENT MICRO MILLING","SY",31410,3,8.7200000000000006,8.8699999999999992]
[1,415.4,"BRIDGE PAVEMENT MILLING","SY",465,1,85,76]
[1,430,"CEMENT CONCRETE BASE COURSE","SY",1470,1,65,63.83]
[1,431,"HIGH EARLY STRENGTH CEMENT CONCRETE BASE COURSE","SY",140,1,90,90.71]
[1,440,"CALCIUM CHLORIDE FOR ROADWAY DUST CONTROL","LB",827425,15,0.45,0.45]
[1,443,"WATER FOR ROADWAY DUST CONTROL","MGL",1015,13,100,84.43]
[1,450.22,"SUPERPAVE SURFACE COURSE â€“ 9.5 (SSC â€“ 9.5)","TON",34050,4,104.22,99.25]
[1,450.221,"SUPERPAVE SURFACE COURSE â€“ 9.5 POLYMER (SSC â€“ 9.5 - P)","TON",4320,1,100,101.28]
[1,450.23,"SUPERPAVE SURFACE COURSE - 12.5 (SSC - 12.5)","TON",3480,3,170,162.22]
[1,450.23099999999999,"SUPERPAVE SURFACE COURSE - 12.5 POLYMER (SSC - 12.5 - P)","TON",294400,6,103,106.71]
[1,450.31,"SUPERPAVE INTERMEDIATE COURSE - 12.5 (SIC -12.5)","TON",4110,4,180,183.06]
[1,450.32,"SUPERPAVE INTERMEDIATE COURSE - 19.0 (SIC - 19.0)","TON",62830,7,98,102.6]
[1,450.32100000000003,"SUPERPAVE INTERMEDIATE COURSE - 19.0 POLYMER (SIC - 19.0 - P)","TON",2450,1,155,156.71]
[1,450.41,"SUPERPAVE BASE COURSE - 25.0 (SBC - 25.0)","TON",2300,1,100,103.55]
[4,847.1,"SIGN SUP (N/GUIDE)+RTE MKR W/1 BRKWAY POST ASSEMBLY - STEEL","EA",2992,18,140,144.69999999999999]
[4,848.1,"SIGN SUP (N/GUIDE)+RTE MKR W/2 BRKWAY POST ASSEMBLIES-STEEL","EA",653,6,250,254.68]
[4,850.41,"ROADWAY FLAGGER","HR",5710,11,25,31.17]
[4,851.1,"TRAFFIC CONES FOR TRAFFIC MANAGEMENT","DAY",5075,9,50,145.09]
[4,852,"SAFETY SIGNING FOR TRAFFIC MANAGEMENT","SF",54868,27,15,14.23]
[4,853.1,"PORTABLE BREAKAWAY BARRICADE TYPE III","EA",312,12,120,132.91999999999999]
[4,853.2,"TEMPORARY BARRIER (TL-2)","FT",21660,4,60,57.87]
[4,853.21,"TEMPORARY BARRIER REMOVED AND RESET","FT",42010,4,8,8.35]
[4,853.23,"TEMPORARY BARRIER (TL-3)","FT",3000,1,0.15,0.15]
[4,853.33,"TEMPORARY BARRIER - LIMITED DEFLECTION (TL-3)","FT",12690,4,55,54.43]
[4,853.40300000000002,"TRUCK MOUNTED ATTENUATOR","DAY",24287,20,140.79,139.38999999999999]
[4,853.41,"TEMPORARY IMPACT ATTENUATOR FOR SHLDR, INCAPABLE OF REDIRECTION","EA",7,2,5000,4520.08]
[4,853.42,"TEMPORARY IMPACT ATTENUATOR FOR SHOULDER, CAPABLE OF REDIRECTION","EA",84,3,6200,6533.55]
[4,853.42100000000005,"TEMPORARY IMPACT ATTENUATOR FOR SHOULDER, CAPABLE OF REDIRECTION, REMOVED AND RESET","EA",36,1,1900,1783.33]
[4,853.43,"TEMPORARY IMPACT ATTENUATOR FOR MEDIAN, INCAPABLE OF REDIRECTION","EA",10,1,7150,6553.42]
[4,853.50099999999998,"TEMPORARY IMPACT ATTENUATOR REMOVED AND RESET","EA",176,4,236,737.48]
[4,853.53,"TEMPORARY IMPACT ATTENUATOR UNIDIRECTIONAL, NON-REDIRECTIVE (TL-3)","EA",2,1,1,1]
[4,853.62,"TEMPORARY IMPACT ATTENUATOR UNIDIRECTIONAL, REDIRECTIVE (TL-2)","EA",60,1,6000,6367.52]
[4,853.63,"TEMPORARY IMPACT ATTENUATOR UNIDIRECTIONAL, REDIRECTIVE (TL-3)","EA",3,1,60,60]
[4,853.8,"TEMPORARY ILLUMINATION FOR WORK ZONE","DAY",5305,12,100,157.61000000000001]
[4,854.01599999999996,"TEMPORARY PAVING MARKINGS - 6 INCH (PAINTED)","FT",4920950,14,0.35,0.38]
[4,854.03599999999994,"TEMPORARY PAVING MARKINGS - 6 INCH (TAPE)","FT",531890,15,1.25,1.36]
[4,854.1,"PAVEMENT MARKING REMOVAL","SF",137900,10,2,1.93]
[4,854.6,"TEMPORARY PORTABLE RUMBLE STRIP","DAY",28505,8,47.5,44.4]
[4,856,"ARROW BOARD","DAY",53124,24,10,10.07]
[4,856.12,"PORTABLE CHANGEABLE MESSAGE SIGN","DAY",74853,25,23.32,23.57]
[4,859,"REFLECTORIZED DRUM","DAY",1944715,22,0.25,0.26]
[4,859.1,"REFLECTORIZED DRUMS WITH SEQUENTIAL FLASHING WARNING LIGHTS","DAY",47930,20,5,4.62]
[4,860.10599999999999,"6 INCH REFLECTORIZED WHITE LINE (PAINTED)","FT",1500000,1,0.11,0.11]
[4,861.10599999999999,"6 INCH REFLECTORIZED YELLOW LINE (PAINTED)","FT",1500000,1,0.11,0.11]
[4,864,"PAVEMENT ARROW REFLECTORIZED WHITE (PAINTED)","SF",9440,1,2.5,2.4700000000000002]
[4,864.04,"PAVEMENT ARROWS AND LEGENDS REFLECTORIZED WHITE (THERMOPLASTIC)","SF",130780,15,12.32,11.31]
[4,864.07,"PAVEMENT ARROW AND LEGENDS (EPOXY)","SF",2610,2,6.75,6.21]
[4,864.31,"SLOTTED PAVEMENT MARKER ONE-WAY WHITE","EA",3965,4,25,24.45]
[4,864.34,"SLOTTED PAVEMENT MARKER TWO-WAY YELLOW/RED","EA",4890,3,21.61,22.21]
[4,866.10599999999999,"6 INCH REFLECTORIZED WHITE LINE (THERMOPLASTIC)","FT",1443095,7,1.25,1.1000000000000001]
[4,866.11199999999997,"12 INCH REFLECTORIZED WHITE LINE (THERMOPLASTIC)","FT",210025,10,4.5199999999999996,4.33]
[4,867.10599999999999,"6 INCH REFLECTORIZED YELLOW LINE (THERMOPLASTIC)","FT",1090010,7,1.25,1.1299999999999999]
[4,867.11199999999997,"12 INCH REFLECTORIZED YELLOW LINE (THERMOPLASTIC)","FT",8645,4,3.9,3.89]
[4,868.06,"6 INCH REFLECTORIZED WHITE LINE (EPOXY)","FT",2550,1,1.08,1.22]
[4,869.06,"6 INCH REFLECTORIZED YELLOW LINE (EPOXY)","FT",3000,1,1.05,1.2]
[4,874,"STREET NAME SIGN","EA",367,7,150,150.22]
[4,874.1,"STREET SIGN REMOVED AND RESET","EA",26,3,150,154.9]
[4,874.2,"TRAFFIC SIGN REMOVED AND RESET","EA",1094,17,123.33,116.05]
[4,874.4,"TRAFFIC SIGN REMOVED AND STACKED","EA",325,8,40,37.47]
[4,874.7,"MISCELLANEOUS SIGNS REMOVED AND STACKED","EA",6,1,87.5,83.33]
[4,877.1,"SIGN POST REMOVED AND DISCARDED","EA",409,2,25,25]
[4,901,"4000 PSI, 1.5 INCH, 565 CEMENT CONCRETE","CY",12,2,925.22,905.09]
[4,901.3,"4000 PSI, 1.5 INCH, 565 CEMENT CONCRETE FOR POST FOUNDATION","CY",52,2,300,275]
[4,903,"3000 PSI, 1.5 INCH, 470 CEMENT CONCRETE","CY",57.5,5,379.94,344.95]
[4,904,"4000 PSI, 3/4 INCH, 610 CEMENT CONCRETE","CY",25,1,710,694]
[4,904.3,"5000 PSI, 3/4 INCH, 685 HP CEMENT CONCRETE","CY",900,2,3011.32,4252.17]
[4,904.4,"4000 PSI, 3/4 INCH, 585 HP CEMENT CONCRETE","CY",66,1,5000,7486.77]
[4,905,"4000 PSI, 3/8 INCH, 660 CEMENT CONCRETE","CY",90,2,4000,4500]
[4,908.1,"CONCRETE PENETRANT","SF",147300,1,1.48,1.52]
[4,909.99,"RAPID SET CEMENT","BAG",10,1,130,130]
[4,910,"STEEL REINFORCEMENT FOR STRUCTURES","LB",93010,5,3.5,3.25]
[4,910.1,"STEEL REINFORCEMENT FOR STRUCTURES - EPOXY COATED","LB",107450,3,2.83,3.35]
[4,910.2,"STEEL REINFORCEMENT FOR STRUCTURES - COATED","LB",246060,1,3.5,3.5]
[4,911.1,"SHEAR CONNECTORS","EA",930,1,16.98,17.920000000000002]
[4,912.1,"DRILLING AND GROUTING DOWELS","FT",20880,1,32.5,32.5]
[4,912.5,"DRILLED AND GROUTED #5 DOWELS","EA",40,1,40,36.979999999999997]
[4,912.6,"DRILLED AND GROUTED #6 DOWELS","EA",6000,1,52.5,52.25]
[4,942.12400000000002,"STEEL PILE HP 12 X 84","FT",87625,1,89,88.3]
[4,942.14200000000005,"STEEL PILE HP 14 X 89","FT",52165,1,100,97.53]
[4,945.10500000000002,"DRILLED SHAFT EXCAVATION 5.0 FOOT DIAMETER","FT",4932,1,850,1047.27]
[4,945.20399999999995,"ROCK SOCKET EXCAVATION 4.5 FOOT DIAMETER","FT",1575,1,1600,1533.33]
[4,945.30499999999995,"OBSTRUCTION EXCAVATION 5.0 FOOT DIAMETER","FT",120,1,2314.33,2128.58]
[4,945.40499999999997,"TRIAL SHAFT 5.0 FOOT DIAMETER","FT",635,1,4600,4406.4399999999996]
[4,945.505,"DRILLED SHAFT 5.0 FOOT DIAMETER","FT",13010,1,1350,1373.86]
[4,945.60500000000002,"PERMANENT CASING 5.0 FOOT DIAMETER","FT",10385,1,650,658.93]
[4,945.71,"CROSS HOLE SONIC TESTING ACCESS PIPES","FT",39582,1,5.5,4.66]
[4,945.72,"CROSS HOLE SONIC TEST","EA",105,1,2500,2743.58]
[4,945.81,"OSTERBERG LOAD CELL AXIAL LOAD TEST","EA",4,1,255000,242322.66]
[4,948.41,"DYNAMIC LOAD TEST BY CONTRACTOR","EA",24,1,10500,10504.48]
[4,948.5,"PILE SHOES","EA",624,1,120,110]
[4,950.1,"TEMPORARY SHORING","LS",5,1,50000,46000]
[4,961.20100000000002,"CLEAN (FULL REMOVAL) AND PAINT STEEL BRIDGE NO. ________","LS",3,1,70000,77883.86]
[4,964.1,"EPOXY BONDING COMPOUND","SF",21360,1,7,7]
[4,966,"MEMBRANE WATERPROOFING FOR BRIDGE DECK REPAIRS","SF",1400,1,5.5,5.14]
[4,968.1,"SCUPPER AND DOWNSPOUT","EA",20,1,23750,23750]
[4,968.4,"SCUPPER-REMOVED","EA",60,1,1733.5,1733.5]
[4,974.3,"METAL BRIDGE RAILING REMOVED","FT",760,1,100,100]
[4,983.1,"RIPRAP","TON",500,1,95,72.5]
[4,983.3,"RIPRAP REMOVED AND RELAID","CY",3626,2,123.11,107.24]
[4,986,"MODIFIED ROCKFILL","TON",40,1,90,77.5]
[4,987.02,"SPECIAL SLOPE PAVING UNDER BRIDGE REMOVED AND RESET","SY",40,1,300,299.5]
[4,991.1,"CONTROL OF WATER - STRUCTURE NO. ______","LS",7,2,200000,218098.06]
[4,994.01,"TEMPORARY PROTECTIVE SHIELDING BRIDGE NO. _______________","LS",2,1,51451.69,43240.33]
[4,994.1,"TEMPORARY PROTECTIVE SHIELDING","SF",45145,2,15.75,14.9]
[4,995.01,"BRIDGE STRUCTURE, BRIDGE NO. ______","LS",5,1,31675000,31145600]
[5,100,"SCHEDULE OF OPERATIONS - FIXED PRICE $__________","LS",54,10,25000,22527.84]
[5,100.002,"LABORER","HR",150,1,100,105]
[5,100.1,"BASE LABOR RATE","HR",80100,4,110,108.88]
[5,100.61,"HVAC WORK","LS",3,1,752530,770343.33]
[5,101,"CLEARING AND GRUBBING","A",285,9,33000,30582.93]
[5,101.1,"CLEARING","A",26.5,4,18922.5,18975.36]
[5,102,"SELECTIVE CLEARING AND THINNING","A",16.25,12,20000,20905.259999999998]
[5,102.1,"TREE TRIMMING","FT",26612,5,15,13.92]
[5,102.12,"TREE TRIMMING","EA",109,2,600,641]
[5,102.2,"TREE TRIMMING","LS",7,2,13500,12857.14]
[5,102.3,"HERBICIDE TREATMENT FOR INVASIVE PLANTS","HR",904,3,427.5,481.98]
[5,102.33,"INVASIVE PLANT MANAGEMENT STRATEGY","HR",312,3,197,185.67]
[5,102.511,"TREE PROTECTION â€“ ARMORING & PRUNING","EA",1895,8,365,368.36]
[5,102.521,"TREE AND PLANT PROTECTION FENCE","FT",23764,9,10.75,10.98]
[5,102.55,"ARBORIST","HR",90,1,287.5,255.83]
[5,103,"TREE REMOVED - DIAMETER UNDER 24 INCHES","EA",362,9,1700,1675.35]
[5,104,"TREE REMOVED - DIAMETER 24 INCHES AND OVER","EA",105,4,2650,2594.48]
[5,105,"STUMP REMOVED","EA",58,5,325,337]
[5,106.15,"BLEEDER (BRIDGE DECK) PVC","EA",30,1,900,877.55]
[5,107.855,"PRESSURE INJECTION OF CRACKS","FT",5100,1,105,97]
[5,107.97,"STRUCTURAL STEEL REPAIRS","LB",50000,1,35,32.1]
[5,114.1,"DEMOLITION OF SUPERSTRUCTURE OF BRIDGE NO. _____","LS",6,2,262500,265000]
[5,115.1,"DEMOLITION OF BRIDGE NO. _____","LS",7,1,500000,469571.43]
[5,115.3,"DEMOLITION OF BRIDGE NO. _____","LS",6,1,500000,495833.33]
[5,120,"EARTH EXCAVATION","CY",92955,5,45,44.32]
[5,120.1,"UNCLASSIFIED EXCAVATION","CY",1200615,19,45,46.3]
[5,121,"CLASS A ROCK EXCAVATION","CY",110,3,112.5,117.5]
[5,123,"MUCK EXCAVATION","CY",4400,1,46,46.36]
[5,125,"TOPSOIL EXCAVATED AND STACKED","CY",46600,2,25,23.42]
[5,127.1,"REINFORCED CONCRETE EXCAVATION","CY",26213,12,2300,2709.5]
[5,127.4,"REINFORCED CONCRETE DECK EXCAVATION (FULL DEPTH)","SY",4295,4,607.5,631.17999999999995]
[5,127.41,"REINFORCED CONCRETE DECK EXCAVATION (PARTIAL DEPTH)","CY",795,3,2737.5,2657.31]
[5,129.19999999999999,"OLD PAVEMENT EXCAVATION","SY",1140,1,2.5,1.75]
[5,129.5,"TRACK EXCAVATION","FT",35600,1,29.5,30.5]
[5,129.6,"BRIDGE PAVEMENT EXCAVATION","SY",7000,6,40,33.5]
[5,140,"BRIDGE EXCAVATION","CY",490350,3,50,48.48]
[5,141,"CLASS A TRENCH EXCAVATION","CY",49809,11,54.38,50.83]
[5,141.1,"TEST PIT FOR EXPLORATION","CY",11595,15,120,113.66]
[5,142,"CLASS B TRENCH EXCAVATION","CY",47520,12,30,30.79]
[5,143,"CHANNEL EXCAVATION","CY",210,1,100,97.14]
[5,144,"CLASS B ROCK EXCAVATION","CY",24554,17,187.5,188.26]
[5,145,"DRAINAGE STRUCTURE ABANDONED","EA",84,2,850,753.02]
[5,146,"DRAINAGE STRUCTURE REMOVED","EA",2220,12,850,808.35]
[5,150,"ORDINARY BORROW","CY",45102,8,30,28.95]
[5,150.1,"SPECIAL BORROW","CY",496800,1,29,30.82]
[5,151,"GRAVEL BORROW","CY",718100,19,45,47.47]
[5,151.01,"GRAVEL BORROW - TYPE C","CY",7730,8,60,61.97]
[5,151.1,"GRAVEL BORROW FOR BRIDGE FOUNDATION","CY",23584,2,64,62.04]
[5,151.19999999999999,"GRAVEL BORROW FOR BACKFILLING STRUCTURES AND PIPES","CY",465580,6,45,46.57]
[5,152,"PROCESSED GRAVEL","CY",6000,1,0.01,0.01]
[5,152.69999999999999,"PEASTONE","TON",138,1,57.5,60]
[5,153,"CONTROLLED DENSITY FILL - EXCAVATABLE","CY",1110,1,165.68,145.38999999999999]
[5,153.1,"CONTROLLED DENSITY FILL - NON-EXCAVATABLE","CY",1636,2,252.69,267.95]
[5,154,"SAND BORROW","CY",475,1,1,1]
[5,156,"CRUSHED STONE","TON",42692,15,45,45.21]
[5,156.1,"CRUSHED STONE FOR BRIDGE FOUNDATIONS","TON",28040,2,72.5,83.23]
[5,157.1,"GABIONS","CY",630,1,352.5,359]
[5,170,"FINE GRADING AND COMPACTING - SUBGRADE AREA","SY",1332665,19,9,8.84]
[5,180.01,"ENVIRONMENTAL HEALTH AND SAFETY PROGRAM","LS",29,8,9000,7907.04]
[5,180.02,"PERSONAL PROTECTION LEVEL C UPGRADE","HR",4602,7,10,7.35]
[5,180.03,"LICENSED SITE PROFESSIONAL SERVICES","HR",7939,7,125,122.52]
[5,181.11,"DISPOSAL OF UNREGULATED SOIL","TON",38700,7,45.25,42.88]
[5,181.12,"DISPOSAL OF REGULATED SOIL - IN-STATE FACILITY","TON",98168,7,70,69.84]
[5,181.13,"DISPOSAL OF REGULATED SOIL - OUT-OF-STATE FACILITY","TON",34930,7,131,133.34]
[5,181.14,"DISPOSAL OF HAZARDOUS WASTE","TON",1240,6,405,452.09]
[5,182.1,"INSPECTION AND TESTING FOR ASBESTOS","LS",19,6,3058.26,3022.5]
[5,182.2,"REMOVAL OF ASBESTOS","FT",8780,6,75,87.28]
[5,183.1,"TREATMENT OF CONTAMINATED GROUNDWATER","GAL",128000,2,5.28,6.33]
[5,183.2,"DISPOSAL OF GRANULAR ACTIVATED CARBON","LB",1500,1,5.5,5.83]
[5,184.1,"DISPOSAL OF TREATED WOOD PRODUCTS","TON",1614,11,400,370.4]
[5,191,"DRIVE SAMPLE BORING","FT",900,1,110,116]
[5,191.1,"HOLLOW STEM AUGER BORINGS","FT",180,1,1,1]
[5,191.11,"CORE BORING","FT",180,1,1,1]
[5,201,"CATCH BASIN","EA",7250,12,4850,4521.37]
[5,202,"MANHOLE","EA",3394,14,5778,5525.43]
[5,202.2,"MANHOLE (9 TO 14 FOOT DEPTH)","EA",98,3,8975,8953.57]
[5,203,"SPECIAL MANHOLE","EA",19,2,7500,7362.5]
[5,204.11,"GUTTER INLET - SPECIAL","EA",39,4,2750,2741.9]
[5,205,"LEACHING BASIN","EA",15,2,5500,6217.14]
[5,206,"DROP INLET, TYPE A","EA",12,1,3709.88,3336.63]
[5,206.1,"DROP INLET, TYPE AF","EA",18,1,5332.33,5610.78]
[5,209.1,"DROP INLET, TYPE DF","EA",30,1,2500,2182.61]
[5,210,"SANITARY SEWER MANHOLE","EA",7,1,8235,8352.86]
[5,210.02,"SANITARY SEWER MANHOLE REMOVED","EA",18,1,1765,1705]
[5,220,"DRAINAGE STRUCTURE ADJUSTED","EA",12161,19,450,445.19]
[5,220.2,"DRAINAGE STRUCTURE REBUILT","FT",1639,19,500,494.94]
[5,220.3,"DRAINAGE STRUCTURE CHANGE IN TYPE","EA",362,9,1200,1194.4000000000001]
[5,220.5,"DRAINAGE STRUCTURE REMODELED","EA",250,11,865,766.92]
[5,220.6,"SANITARY STRUCTURE REBUILT","FT",292,5,550,489.04]
[5,220.7,"SANITARY STRUCTURE ADJUSTED","EA",864,11,450,444.19]
[5,220.8,"SANITARY STRUCTURE REMODELED","EA",95,2,1000,861.82]
[5,220.9,"SANITARY STRUCTURE ABANDONED","EA",21,1,1380,1451.43]
[5,221,"FRAME AND COVER","EA",1976,10,867.5,839.97]
[5,221.1,"FRAME AND COVER - SECURED","EA",2232,11,800,729.29]
[5,222,"FRAME AND GRATE - MASSDOT BAR TYPE","EA",4038,9,841.93,824.69]
[5,222.1,"FRAME AND GRATE - MASSDOT CASCADE TYPE","EA",1342,11,1019,999.7]
[5,222.2,"FRAME AND GRATE - MASSDOT DROP INLET","EA",72,2,840,780.61]
[5,222.3,"FRAME AND GRATE (OR COVER) MUNICIPAL STANDARD","EA",4111,6,950,950.48]
[5,223.1,"FRAME AND GRATE (OR COVER) REMOVED AND STACKED","EA",98,3,187.5,187.33]
[5,223.2,"FRAME AND GRATE (OR COVER) REMOVED AND DISCARDED","EA",3607,18,100,83.26]
[5,224.1,"10 INCH HOOD","EA",204,2,450,461.64]
[5,224.12,"12 INCH HOOD","EA",594,2,475,472.06]
[5,227.3,"REMOVAL OF DRAINAGE STRUCTURE SEDIMENT","CY",10454,18,250,253.27]
[5,227.31,"REMOVAL OF DRAINAGE PIPE SEDIMENT","FT",128258,16,8,7.64]
[5,227.4,"MASONRY PLUG","SF",1564,9,150,144.94]
[5,230.11199999999999,"12 INCH CORRUGATED METAL PIPE 16 GAGE","FT",2160,1,91.5,94]
[5,230.11500000000001,"15 INCH CORRUGATED METAL PIPE 16 GAGE","FT",320,1,118.1,119.28]
[5,230.11799999999999,"18 INCH CORRUGATED METAL PIPE 16 GAGE","FT",210,1,142.5,136.21]
[5,230.71199999999999,"12 INCH CORRUGATED METAL PIPE END SECTION","EA",42,1,737.5,769.91]
[5,230.715,"15 INCH CORRUGATED METAL PIPE END SECTION","EA",6,1,807.5,813.58]
[5,230.71799999999999,"18 INCH CORRUGATED METAL PIPE END SECTION","EA",6,1,835,865.16]
[5,234.12,"12 INCH DRAINAGE PIPE - OPTION","FT",16050,4,130.5,132.87]
[5,234.15,"15 INCH DRAINAGE PIPE - OPTION","FT",5710,3,137.5,148.33000000000001]
[5,234.18,"18 INCH DRAINAGE PIPE - OPTION","FT",1640,2,150,140]
[5,234.24,"24 INCH DRAINAGE PIPE - OPTION","FT",450,2,192.5,198.89]
[5,235.12,"12 INCH DRAINAGE PIPE FLARED END - OPTION","EA",35,2,1150,973.75]
[5,235.15,"15 INCH DRAINAGE PIPE FLARED END - OPTION","EA",15,1,1000,833.33]
[5,235.18,"18 INCH DRAINAGE PIPE FLARED END - OPTION","EA",3,1,1625,1750]
[5,235.24,"24 INCH DRAINAGE PIPE FLARED END - OPTION","EA",3,1,1700,1833.33]
[5,238.1,"10 INCH DUCTILE IRON PIPE","FT",14844,10,156.5,156.09]
[5,238.12,"12 INCH DUCTILE IRON PIPE","FT",10345,7,195,183.06]
[5,238.16,"16 INCH DUCTILE IRON PIPE","FT",192,1,280,267.5]
[5,238.24,"24 INCH DUCTILE IRON PIPE","FT",160,1,250,250.63]
[5,241.12,"12 INCH REINFORCED CONCRETE PIPE","FT",168645,9,125,115.21]
[5,241.15,"15 INCH REINFORCED CONCRETE PIPE","FT",54755,6,115,116.03]
[5,241.18,"18 INCH REINFORCED CONCRETE PIPE","FT",45880,7,133.5,133.41]
[5,241.24,"24 INCH REINFORCED CONCRETE PIPE","FT",24680,5,160,159.97]
[5,241.3,"30 INCH REINFORCED CONCRETE PIPE","FT",8160,1,185,189.38]
[5,241.36,"36 INCH REINFORCED CONCRETE PIPE","FT",75,1,289.44,257.77]
[5,241.48,"48 INCH REINFORCED CONCRETE PIPE","FT",1120,1,245,233.27]
[5,242.12,"12 INCH REINFORCED CONCRETE PIPE FLARED END","EA",215,3,1375,1384.87]
[5,242.15,"15 INCH REINFORCED CONCRETE PIPE FLARED END","EA",84,2,1500,1447.31]
[5,242.18,"18 INCH REINFORCED CONCRETE PIPE FLARED END","EA",58,2,1550,1506.65]
[5,242.24,"24 INCH REINFORCED CONCRETE PIPE FLARED END","EA",34,3,1885,1874.68]
[5,242.3,"30 INCH REINFORCED CONCRETE PIPE FLARED END","EA",15,2,2437.5,2317.4299999999998]
[5,243.12,"12 INCH REINFORCED CONCRETE PIPE CLASS IV","FT",34550,3,113.5,119.81]
[5,243.15,"15 INCH REINFORCED CONCRETE PIPE CLASS IV","FT",5720,2,107.5,102.98]
[5,243.18,"18 INCH REINFORCED CONCRETE PIPE CLASS IV","FT",744,1,138,137]
[5,243.24,"24 INCH REINFORCED CONCRETE PIPE CLASS IV","FT",1260,1,160,153.57]
[5,244.12,"12 INCH REINFORCED CONCRETE PIPE CLASS V","FT",38060,3,108,108.67]
[5,244.15,"15 INCH REINFORCED CONCRETE PIPE CLASS V","FT",1310,2,139,131.46]
[5,244.18,"18 INCH REINFORCED CONCRETE PIPE CLASS V","FT",7740,3,140,139.54]
[5,244.24,"24 INCH REINFORCED CONCRETE PIPE CLASS V","FT",5120,1,155,147.88]
[5,244.3,"30 INCH REINFORCED CONCRETE PIPE CLASS V","FT",2920,2,200,205.15]
[5,244.36,"36 INCH REINFORCED CONCRETE PIPE CLASS V","FT",5880,1,225,228.58]
[5,250.06,"6 INCH POLYVINYL CHLORIDE SANITARY SEWER PIPE","FT",1440,2,140,173.64]
[5,250.08,"8 INCH POLYVINYL CHLORIDE SANITARY SEWER PIPE","FT",210,1,205,223.33]
[5,258,"STONE FOR PIPE ENDS","SY",5523,6,85.5,84.11]
[5,259,"CRUSHED STONE FOR BLEEDERS","TON",300,1,175,176.46]
[5,269.06,"6 INCH SLOT-PERFORATED CORRUGATED PLASTIC PIPE (SUBDRAIN)","FT",720,1,77.5,80]
[5,269.08,"8 INCH SLOT-PERFORATED CORRUGATED PLASTIC PIPE (SUBDRAIN)","FT",42700,1,47.5,44.06]
[5,280,"HOT MIX ASPHALT WATERWAY","SY",566,5,122.5,131.02000000000001]
[5,280.10000000000002,"HOT MIX ASPHALT WATERWAY","TON",600,1,312.5,325]
[5,281,"CEMENT CONCRETE PAVING (WATERWAY)","SY",360,1,161.61000000000001,160.80000000000001]
[5,302.04000000000002,"4 INCH DUCTILE IRON WATER PIPE (RUBBER GASKET)","FT",220,1,200,180]
[5,302.06,"6 INCH DUCTILE IRON WATER PIPE (RUBBER GASKET)","FT",6040,3,134.5,136.30000000000001]
[5,302.08,"8 INCH DUCTILE IRON WATER PIPE (RUBBER GASKET)","FT",89440,2,137.5,134.97]
[5,302.12,"12 INCH DUCTILE IRON WATER PIPE (RUBBER GASKET)","FT",88174,3,171,163.91]
[5,303.04000000000002,"4 INCH DUCTILE IRON WATER PIPE (MECHANICAL JOINT)","FT",700,2,180,187.33]
[5,303.06,"6 INCH DUCTILE IRON WATER PIPE (MECHANICAL JOINT)","FT",7529,9,185,184.27]
[5,303.08,"8 INCH DUCTILE IRON WATER PIPE (MECHANICAL JOINT)","FT",3565,3,180,186.4]
[5,303.10000000000002,"10 INCH DUCTILE IRON WATER PIPE (MECHANICAL JOINT)","FT",140,1,250,233.57]
[5,303.12,"12 INCH DUCTILE IRON WATER PIPE (MECHANICAL JOINT)","FT",31052,5,200,202.26]
[5,303.16000000000003,"16 INCH DUCTILE IRON WATER PIPE (MECHANICAL JOINT)","FT",250,1,537.5,515.6]
[5,309,"DUCTILE IRON FITTINGS FOR WATER PIPE","LB",201604,12,8.6300000000000008,8.3699999999999992]
[5,315.04000000000002,"4 INCH WATER MAIN REMOVED AND STACKED","FT",80,1,31,33.75]
[5,315.06,"6 INCH WATER MAIN REMOVED AND STACKED","FT",1400,1,31,34.5]
[5,315.08,"8 INCH WATER MAIN REMOVED AND STACKED","FT",1680,1,31,33.75]
[5,315.12,"12 INCH WATER MAIN REMOVED AND STACKED","FT",2800,2,51,54.69]
[5,315.16000000000003,"16 INCH WATER MAIN REMOVED AND STACKED","FT",120,1,94.25,86.17]
[5,336.1,"1 INCH PLASTIC WATER PIPE","FT",5900,2,85,76.319999999999993]
[5,347.07499999999999,"3/4 INCH COPPER TUBING TYPE K","FT",1580,2,80,87.25]
[5,347.1,"1 INCH COPPER TUBING TYPE K","FT",25370,6,95.5,92.66]
[5,347.125,"1-1/4 INCH COPPER TUBING TYPE K","FT",1330,1,91,100.86]
[5,347.15,"1-1/2 INCH COPPER TUBING TYPE K","FT",840,1,107,107.17]
[5,347.2,"2 INCH COPPER TUBING TYPE K","FT",2094,6,130,124.48]
[5,350.04,"4 INCH GATE AND GATE BOX","EA",7,1,1775,1635.71]
[5,350.06,"6 INCH GATE AND GATE BOX","EA",414,7,2000,2030.32]
[5,350.08,"8 INCH GATE AND GATE BOX","EA",363,3,2550,2563.85]
[5,350.1,"10 INCH GATE AND GATE BOX","EA",8,1,3250,3125]
[5,350.12,"12 INCH GATE AND GATE BOX","EA",340,4,4005.5,4115.3]
[5,355.06,"6 INCH GATE AND GATE BOX REMOVED AND STACKED","EA",91,2,625,541.91999999999996]
[5,355.08,"8 INCH GATE AND GATE BOX REMOVED AND STACKED","EA",12,1,625,540.83000000000004]
[5,357.06,"6 INCH GATE BOX","EA",152,10,540,501.73]
[5,357.08,"8 INCH GATE BOX","EA",108,6,500,467.83]
[5,357.1,"10 INCH GATE BOX","EA",14,3,525,500.18]
[5,357.12,"12 INCH GATE BOX","EA",195,11,600,573.27]
[5,357.16,"16 INCH GATE BOX","EA",30,4,652,623.36]
[5,357.24,"24 INCH GATE BOX","EA",4,1,800,825]
[5,358,"GATE BOX ADJUSTED","EA",3703,14,250,259.13]
[5,358.1,"GATE BOX REMOVED AND STACKED","EA",37,2,152.5,150.63]
[5,363.07499999999999,"3/4 INCH CORPORATION COCK","EA",55,2,425,408.5]
[5,363.1,"1 INCH CORPORATION COCK","EA",902,4,632.5,623]
[5,363.125,"1-1/4 INCH CORPORATION COCK","EA",60,1,445,421.67]
[5,363.15,"1-1/2 INCH CORPORATION COCK","EA",210,2,700,768.75]
[5,363.17500000000001,"1-3/4 INCH CORPORATION COCK","EA",60,1,500,469.17]
[5,363.2,"2 INCH CORPORATION COCK","EA",78,4,1050,938.06]
[5,367.06,"6 INCH CAST IRON PLUG","EA",46,3,784.5,683.2]
[5,367.08,"8 INCH CAST IRON PLUG","EA",43,2,650,615.63]
[5,367.1,"10 INCH CAST IRON PLUG","EA",42,1,645,713.33]
[5,367.12,"12 INCH CAST IRON PLUG","EA",82,3,894,851.08]
[5,369.08,"8 X 8 INCH TAPPING SLEEVE, VALVE AND BOX","EA",24,1,8000,8049.17]
[5,369.12,"12 X 12 INCH TAPPING SLEEVE, VALVE AND BOX","EA",26,1,13500,13034.62]
[5,370.1,"8 X 6 INCH TAPPING SLEEVE, VALVE AND BOX","EA",8,1,10000,9993.75]
[5,370.2,"10 X 6 INCH TAPPING SLEEVE, VALVE AND BOX","EA",4,1,9800,10525]
[5,370.4,"12 X 6 INCH TAPPING SLEEVE, VALVE AND BOX","EA",68,5,10700,11357.53]
[5,370.5,"12 X 8 INCH TAPPING SLEEVE, VALVE AND BOX","EA",5,1,10950,12063.6]
[5,371.04,"4 INCH COUPLING","EA",50,1,430,427]
[5,371.06,"6 INCH COUPLING","EA",158,2,560,550.02]
[5,371.08,"8 INCH COUPLING","EA",120,1,847.5,761.25]
[5,371.1,"10 INCH COUPLING","EA",2,1,700,700]
[5,371.12,"12 INCH COUPLING","EA",208,2,1217.43,1208.45]
[5,373.04,"4 INCH WATER PIPE INSULATION","FT",8,1,83.5,81.75]
[5,373.06,"6 INCH WATER PIPE INSULATION","FT",525,1,58,55]
[5,373.08,"8 INCH WATER PIPE INSULATION","FT",210,1,66,64.430000000000007]
[5,373.12,"12 INCH WATER PIPE INSULATION","FT",595,1,82.5,79.709999999999994]
[5,376,"HYDRANT","EA",340,4,5550,5627.74]
[5,376.1,"HYDRANT - EXCLUDING COST OF HYDRANT","EA",68,4,4000,3799.56]
[5,376.2,"HYDRANT - REMOVED AND RESET","EA",185,10,3500,3409.71]
[5,376.3,"HYDRANT - REMOVED AND STACKED","EA",169,4,1100,1091.82]
[5,376.5,"HYDRANT - ADJUSTED","EA",34,4,1900,1809.82]
[5,381,"SERVICE BOX","EA",401,9,400,339.69]
[5,381.01,"SERVICE BOX (MUNICIPAL STANDARD)","EA",3,1,525,442.33]
[5,381.1,"SERVICE BOX REMOVED AND RESET","EA",263,3,350,333.24]
[5,381.3,"SERVICE BOX ADJUSTED","EA",1955,9,200,200.44]
[5,384,"CURB STOP","EA",169,7,600,585.97]
[5,384.2,"CURB STOP BOX ADJUSTED","EA",102,1,220,215]
[5,402,"DENSE GRADED CRUSHED STONE FOR SUB-BASE","CY",170275,14,75,75.38]
[5,402.1,"DENSE GRADED CRUSHED STONE FOR SUB-BASE","TON",200,1,85,86.25]
[5,402.11,"DENSE GRADED CRUSHED STONE FOR SHOULDERS","TON",550,3,100,99.88]
[5,402.13,"PAVEMENT MILLING MULCH FOR SHOULDERS","FT",359350,9,6,6.29]
[5,403.1,"CRUSHED STONE FOR BLENDING","TON",7200,1,26,25]
[5,415.1,"PAVEMENT STANDARD MILLING","SY",806500,4,5,5.21]
[5,415.2,"PAVEMENT FINE MILLING","SY",1268730,8,5.21,5]
[5,415.3,"PAVEMENT MICRO MILLING","SY",1768840,6,6.7,6.25]
[5,415.4,"BRIDGE PAVEMENT MILLING","SY",56535,7,16.75,15.63]
[5,430,"CEMENT CONCRETE BASE COURSE","SY",1200,1,76.75,75.13]
[5,431,"HIGH EARLY STRENGTH CEMENT CONCRETE BASE COURSE","SY",28294,9,50,51.58]
[5,440,"CALCIUM CHLORIDE FOR ROADWAY DUST CONTROL","LB",1652725,13,0.5,0.43]
[5,443,"WATER FOR ROADWAY DUST CONTROL","MGL",6607,9,99.5,83.51]
[5,450.22,"SUPERPAVE SURFACE COURSE â€“ 9.5 (SSC â€“ 9.5)","TON",49960,4,125,135.1]
[5,450.221,"SUPERPAVE SURFACE COURSE â€“ 9.5 POLYMER (SSC â€“ 9.5 - P)","TON",80800,1,112.11,111.78]
[5,450.23,"SUPERPAVE SURFACE COURSE - 12.5 (SSC - 12.5)","TON",60876,5,125,142.32]
[5,450.23099999999999,"SUPERPAVE SURFACE COURSE - 12.5 POLYMER (SSC - 12.5 - P)","TON",408870,12,125,126.42]
[5,450.31,"SUPERPAVE INTERMEDIATE COURSE - 12.5 (SIC -12.5)","TON",65975,6,135,153.78]
[5,450.32,"SUPERPAVE INTERMEDIATE COURSE - 19.0 (SIC - 19.0)","TON",191990,8,119.5,116.78]
[5,450.32100000000003,"SUPERPAVE INTERMEDIATE COURSE - 19.0 POLYMER (SIC - 19.0 - P)","TON",196320,2,107.91,113.9]
[5,450.41,"SUPERPAVE BASE COURSE - 25.0 (SBC - 25.0)","TON",480,1,130,133.27000000000001]
[5,450.42,"SUPERPAVE BASE COURSE - 37.5 (SBC - 37.5)","TON",498950,9,110,118.14]
[5,450.53,"SUPERPAVE LEVELING COURSE - 12.5 (SLC - 12.5)","TON",15,1,167.5,160]
[5,450.6,"SUPERPAVE BRIDGE SURFACE COURSE - 9.5 (SSC-B - 9.5)","TON",3230,5,288,304.69]
[5,450.601,"SUPERPAVE BRIDGE SURFACE COURSE - 9.5 POLYMER (SSC-B - 9.5 - P)","TON",2650,1,177.5,162.80000000000001]
[5,450.61,"SUPERPAVE BRIDGE SURFACE COURSE - 12.5 (SSC-B - 12.5)","TON",1600,1,215,220.5]
[5,450.7,"SUPERPAVE BRIDGE PROTECTIVE COURSE - 9.5 (SPC-B - 9.5)","TON",960,1,282.5,272.5]
[5,450.70100000000002,"SUPERPAVE BRIDGE PROTECTIVE COURSE - 9.5 POLYMER (SPC-B - 9.5 - P)","TON",1410,1,300,286.67]
[5,450.71100000000001,"SUPERPAVE BRIDGE PROTECTIVE COURSE â€“ 12.5POLYMER (SPC-B - 12.5 - P)","TON",4240,1,215,219.77]
[5,450.8,"ASPHALT RUBBER GAP GRADED - 12.5 (ARGG - 12.5)","TON",11520,1,150,165]
[5,451,"HMA FOR PATCHING","TON",69336,26,245,231.63]
[5,452,"ASPHALT EMULSION FOR TACK COAT","GAL",597080,27,8.8000000000000007,8.44]
[5,453,"HMA JOINT SEALANT","FT",2047418,21,1,0.94]
[5,457.1,"SUPERPAVE WATERPROOFING SURFACE COURSE - 9.5 (SSC-W-9.5)","TON",2160,4,550,520.47]
[5,470,"HOT MIX ASPHALT BERM","TON",16727,9,235,223.61]
[5,472,"TEMPORARY ASPHALT PATCHING","TON",141505,21,200,201.08]
[5,477,"MILLED RUMBLE STRIP (TYPE A)","FT",785540,6,0.62,1.72]
[5,477.2,"MILLED RUMBLE STRIP (TYPE C)","FT",23550,1,1.66,1.45]
[5,482,"HOT APPLIED ASPHALTIC CRACK FILLER","GAL",19500,2,15.17,15.34]
[5,482.15,"HOT APPLIED ASPHALTIC CRACK FILLER (POLYESTER FIBERS)","GAL",150,1,204.7,208.13]
[5,482.17,"HOT APPLIED RUBBERIZED ASPHALTIC CRACK FILLER","GAL",175,2,204.7,196.1]
[5,482.3,"SAWCUTTING ASPHALT PAVEMENT","FT",9800,2,2.46,2.25]
[5,482.31,"SAWING & SEALING JOINTS IN ASPHALT PAVEMENT AT BRIDGES","FT",11985,12,35,32.21]
[5,482.4,"SAWCUTTING PORTLAND CEMENT CONCRETE","FT",620,3,9.25,7.65]
[5,482.5,"SAWCUTTING ASPHALT PAVEMENT FOR BOX WIDENING","FT",416970,10,3,2.98]
[5,501,"GRANITE CURB TYPE VA1 - STRAIGHT","FT",800,1,70,69.38]
[5,502,"GRANITE CURB TYPE VA2 - STRAIGHT","FT",3600,1,60,58.44]
[5,502.1,"GRANITE CURB TYPE VA2 - CURVED","FT",360,1,70,67.83]
[5,503,"GRANITE CURB TYPE VA3 - STRAIGHT","FT",270,1,88.25,102.17]
[5,504,"GRANITE CURB TYPE VA4 - STRAIGHT","FT",1990,3,50,49.75]
[5,504.1,"GRANITE CURB TYPE VA4 - CURVED","FT",8320,3,52,55.87]
[5,504.2,"GRANITE CURB TYPE VA4 - SPLAYED END","EA",12,1,362.5,362.5]
[5,505,"GRANITE CURB TYPE VA5 - STRAIGHT","FT",1720,2,52.5,56.26]
[5,505.1,"GRANITE CURB TYPE VA5 - CURVED","FT",231,1,77.5,80.86]
[5,506,"GRANITE CURB TYPE VB - STRAIGHT","FT",348995,12,40,42.19]
[5,506.1,"GRANITE CURB TYPE VB - CURVED","FT",30125,12,50,51.42]
[5,509,"GRANITE TRANSITION CURB FOR PEDESTRIAN CURB RAMPS - STRAIGHT","FT",67045,15,48,48.33]
[5,509.1,"GRANITE TRANSITION CURB FOR PEDESTRIAN CURB RAMPS - CURVED","FT",21170,14,55,55.69]
[5,511.1,"GRANITE EDGING TYPE SB - STRAIGHT","FT",55185,8,30.75,32.17]
[5,512.1,"GRANITE EDGING TYPE SB (RADIUS 10 FEET OR LESS)","FT",2150,6,45.5,51.04]
[5,513,"GRANITE EDGING TYPE SC","FT",325,1,36,33.4]
[5,513.1,"GRANITE EDGING TYPE SC (RADIUS 10 FEET OR LESS)","FT",50,1,44.5,44.6]
[5,514,"GRANITE CURB INLET - STRAIGHT","EA",3201,16,422.5,422.77]
[5,515,"GRANITE CURB INLET - CURVED","EA",425,9,500,493.17]
[5,516,"GRANITE CURB CORNER TYPE A","EA",92,2,300,290]
[5,517,"GRANITE CURB CORNER TYPE B","EA",72,2,475,459.17]
[5,520,"CONCRETE CURB TYPE VA","FT",744,2,47.5,47.78]
[5,570.20000000000005,"HOT MIX ASPHALT CURB TYPE 2","FT",2715,2,15,14.4]
[5,570.29999999999995,"HOT MIX ASPHALT CURB TYPE 3","FT",1940,2,20,25.19]
[5,580,"CURB REMOVED AND RESET","FT",74925,14,27,27.26]
[5,581,"CURB INLET REMOVED AND RESET","EA",155,6,238.36,228.35]
[5,583,"EDGING REMOVED AND RESET","FT",173415,10,25.41,26.79]
[5,590,"CURB REMOVED AND STACKED","FT",11200,3,8,7.21]
[5,591,"CURB INLET REMOVED AND STACKED","EA",25,1,150,157.6]
[5,592,"CURB CORNER REMOVED AND STACKED","EA",306,2,70,90.93]
[5,593,"EDGING REMOVED AND STACKED","FT",500,1,5.25,4.41]
[5,594,"CURB REMOVED AND DISCARDED","FT",37090,10,6,5.67]
[5,595,"CURB INLET REMOVED AND DISCARDED","EA",110,9,75,73.819999999999993]
[5,596,"CURB CORNER REMOVED AND DISCARDED","EA",36,1,68.25,75.5]
[5,597,"EDGING REMOVED AND DISCARDED","FT",71460,12,6,6.02]
[5,620.12,"GUARDRAIL, TL-2 (SINGLE FACED)","FT",70190,8,30,31.87]
[5,620.13,"GUARDRAIL, TL-3 (SINGLE FACED)","FT",460935,9,31,31.49]
[5,620.13099999999997,"GUARDRAIL, DEEP POST (SINGLE FACED)","FT",630,1,29,30.33]
[5,620.32000000000005,"GUARDRAIL - CURVED, TL-2 (SINGLE FACED)","FT",2836,5,35.5,35.22]
[5,620.33000000000004,"GUARDRAIL - CURVED, TL-3 (SINGLE FACED)","FT",15000,2,30,30.37]
[5,621.13,"GUARDRAIL, TL-3 (DOUBLE FACED)","FT",5440,1,45.88,46.34]
[5,627.1,"TRAILING ANCHORAGE","EA",612,13,1900,1953.48]
[5,627.73,"GUARDRAIL END TREATMENT, TL-3 (DOUBLE FACED)","EA",8,1,13991.52,14385.38]
[5,627.82000000000005,"GUARDRAIL TANGENT END TREATMENT, TL-2","EA",152,6,4200,4358.79]
[5,627.83000000000004,"GUARDRAIL TANGENT END TREATMENT, TL-3","EA",610,9,4153.6099999999997,4294.5]
[5,627.92999999999995,"GUARDRAIL FLARED END TREATMENT, TL-3","EA",192,6,4200,4325.3900000000003]
[5,628.21,"TRANSITION TO NCHRP 350 GUARDRAIL","EA",97,6,1825.88,1875.06]
[5,628.22,"TRANSITION TO RIGID BARRIER (SINGLE FACED)","EA",165,3,4750,4786.1400000000003]
[5,628.23,"TRANSITION TO RIGID BARRIER (DOUBLE FACED)","EA",38,2,6150,7005.68]
[5,628.24,"TRANSITION TO BRIDGE RAIL","EA",201,6,4800,4875.25]
[5,628.25,"TRANSITION TO THRIE BEAM","EA",154,3,317.5,353.63]
[5,628.34,"IMPACT ATTENUATOR FOR MEDIAN, CAPABLE OF REDIRECTION","EA",33,2,39111,37397.67]
[5,629.1,"PRECAST CONCRETE BARRIER - SINGLE FACED","FT",22470,1,149,153.11000000000001]
[5,629.20000000000005,"PRECAST CONCRETE MEDIAN BARRIER - DOUBLE FACED","FT",118188,4,155,163.16]
[5,629.4,"CAST-IN-PLACE CONCRETE MEDIAN BARRIER - DOUBLE FACED","FT",780,2,850,854]
[5,630,"HIGHWAY GUARD REMOVED AND RESET","FT",6225,3,38.5,41.73]
[5,630.20000000000005,"HIGHWAY GUARD REMOVED AND DISCARDED","FT",685110,13,5.72,5.29]
[5,632,"GUARDRAIL POST - STEEL","EA",120,1,110,112.86]
[5,632.4,"INDIVIDUAL POST REMOVED AND DISCARDED","EA",1300,2,36,34.5]
[5,633,"GUARDRAIL OFFSET BLOCK - W BEAM","EA",60,1,17,16.78]
[5,633.1,"GUARDRAIL OFFSET BLOCK - THRIE BEAM","EA",60,1,27,26.97]
[5,634,"W BEAM GUARD PANEL","EA",30,1,242,242.01]
[5,634.1,"THRIE BEAM GUARD PANEL","EA",30,1,315,316.82]
[5,644.05999999999995,"60 INCH CHAIN LINK FENCE (SPRING TENSION WIRE) (LINE POST OPTION)","FT",1760,2,60.5,59.3]
[5,644.072,"72 INCH CHAIN LINK FENCE (SPRING TENSION WIRE) (LINE POST OPTION)","FT",42800,1,38,39.56]
[5,645.048,"48 INCH CHAIN LINK FENCE (PIPE TOP RAIL) (LINE POST OPTION)","FT",1640,2,81,77.06]
[5,645.096,"96 INCH CHAIN LINK FENCE (PIPE TOP RAIL) (LINE POST OPTION)","FT",440,1,103.5,101.75]
[5,645.17200000000003,"72 INCH CHAIN LINK FENCE (PIPE TOP RAIL) VINYL COATED (LINE POST OPTION)","FT",1440,1,50,52.56]
[5,647.072,"72 INCH CHAIN LINK FENCE (PIPE TOP RAIL) W/BARB (LINE POST OPTION)","FT",165,1,99.5,101.8]
[5,650.048,"48 INCH CHAIN LINK GATE WITH GATE POSTS","FT",12,1,39.5,39.5]
[5,650.072,"72 INCH CHAIN LINK GATE WITH GATE POSTS","FT",80,1,252,258.38]
[5,652.048,"48 INCH CHAIN LINK FENCE END POST","EA",50,2,205,183.79]
[5,652.072,"72 INCH CHAIN LINK FENCE END POST","EA",76,2,255,254.85]
[5,653.072,"72 INCH CHAIN LINK FENCE CORNER OR INTERMEDIATE BRACE POST","EA",42,2,345,361.71]
[5,653.096,"96 INCH CHAIN LINK FENCE CORNER OR INTERMEDIATE BRACE POST","EA",16,1,515,510]
[5,657,"TEMPORARY FENCE","FT",11184,3,21.5,21.07]
[5,657.5,"TEMPORARY FENCE REMOVED AND RESET","FT",644,1,13.75,13.79]
[5,665,"CHAIN LINK FENCE REMOVED AND STACKED","FT",960,1,6,5.56]
[5,666,"CHAIN LINK FENCE REMOVED AND RESET","FT",11320,5,42.5,36.18]
[5,669,"FENCE REMOVED AND STACKED","FT",2875,1,9.5,8.8000000000000007]
[5,670,"FENCE REMOVED AND RESET","FT",3530,3,46.5,42.06]
[5,681.36,"36 INCH ANTI-GLARE SCREEN (MODULAR UNITS) - PADDLE TYPE","FT",15000,1,30,32.270000000000003]
[5,685,"STONE MASONRY WALL IN CEMENT MORTAR","CY",4555,5,800,768.7]
[5,690,"STONE MASONRY WALL REMOVED AND REBUILT IN CEMENT MORTAR","CY",550,3,670,653.26]
[5,691,"BALANCE STONE WALL REMOVED AND REBUILT","FT",13445,4,200,218.62]
[5,697.1,"SILT SACK","EA",11120,17,200,194.4]
[5,697.2,"FLOATING SILT FENCE","FT",60,1,85,71.17]
[5,698.2,"GEOTEXTILE FABRIC FOR SUBSURFACE DRAINAGE","SY",1900,2,5,4.29]
[5,698.3,"GEOTEXTILE FABRIC FOR SEPARATION","SY",63135,9,7.5,7.64]
[5,698.4,"GEOTEXTILE FABRIC FOR PERMANENT EROSION CONTROL","SY",5455,4,7.75,7.81]
[5,701,"CEMENT CONCRETE SIDEWALK","SY",184570,10,55,54.02]
[5,701.1,"CEMENT CONCRETE SIDEWALK AT DRIVEWAYS","SY",67635,9,63.25,64.59]
[5,701.2,"CEMENT CONCRETE PEDESTRIAN CURB RAMP","SY",27845,15,90,87.63]
[5,702,"HOT MIX ASPHALT SIDEWALK OR DRIVEWAY","TON",56048,16,215,216.94]
[5,703.1,"CONCRETE WHEEL STOP","EA",320,2,225,250.63]
[5,705,"FLAGSTONE WALK","SY",56,1,470,463.13]
[5,705.1,"FLAGSTONE WALK REMOVED AND RESET","SY",122,2,300,326.88]
[5,706,"BRICK WALK","SY",40,1,387.5,389.38]
[5,706.1,"BRICK WALK REMOVED AND RELAID","SY",101,2,300,306.56]
[5,707.8,"STEEL BOLLARD","EA",10,1,2500,2620]
[5,710.3,"BOUND - LETTERED GRANITE","EA",129,2,587.5,580.02]
[5,710.4,"BOUND - PLAIN GRANITE","EA",1294,6,607.5,622.4]
[5,711,"BOUND REMOVED AND RESET","EA",309,6,500,490.22]
[5,715,"RURAL MAIL BOX REMOVED AND RESET","EA",1214,6,277.5,250.1]
[5,740,"ENGINEERS FIELD OFFICE AND EQUIPMENT (TYPE A)","MO",3923,27,3000,2990.47]
[5,741,"ENGINEERS FIELD OFFICE AND EQUIPMENT (TYPE B)","MO",21,1,2000,2133.33]
[5,747,"EQUIPMENT FOR ENGINEERS FIELD OFFICE","LS",10,7,8500,8450]
[5,748,"MOBILIZATION","LS",75,20,90000,77324.81]
[5,748.1,"EMERGENCY RESPONSE","EA",300,8,482.5,509.33]
[5,751,"LOAM BORROW","CY",112200,23,50,53.21]
[5,752,"TOPSOIL REHANDLED AND SPREAD","CY",41300,2,47.5,43.58]
[5,755.45,"WETLAND RESTORATION","SY",14700,1,22.5,21.7]
[5,755.75,"WETLAND SPECIALIST","HR",3470,2,142.5,153.71]
[5,755.76,"WETLANDS MONITORING REPORTS","LS",9,2,13500,10264.44]
[5,756,"NPDES STORMWATER POLLUTION PREVENTION PLAN","LS",42,13,6500,5691.2]
[5,765,"SEEDING","SY",1073420,19,2.38,2.33]
[5,767.12099999999998,"SEDIMENT CONTROL BARRIER","FT",378164,22,8,7.6]
[5,767.31,"STRAW MULCH","SY",8380,1,1.21,1.21]
[5,767.4,"WOOD CHIP MULCH","CY",80,1,85,86.25]
[5,767.6,"AGED PINE BARK MULCH","CY",1146,8,85,85.74]
[5,767.9,"JUTE MESH","SY",60,1,16,17]
[5,769,"PAVEMENT MILLING MULCH UNDER GUARD RAIL","FT",661556,13,7.5,7.3]
[5,773.22400000000005,"PINE - PITCH 4-5 FEET","EA",70,1,397.5,397.91]
[5,776.54300000000001,"MAPLE - RED - 'OCTOBER GLORY' 2-2.5 INCH CALIPER","EA",12,1,700,642.5]
[5,776.83600000000001,"MAPLE - SUGAR 2-2.5 INCHES CALIPER","EA",40,1,600,587]
[5,781.57299999999998,"LILAC TREE - JAPANESE CLUMP 8-10 FOOT CLUMP","EA",20,1,665,662]
[5,785.63300000000004,"INKBERRY 2-3 FEET","EA",27,1,117,125.89]
[5,786.08100000000002,"JUNIPER - BAR HARBOR 15-18 INCH","EA",102,1,83.5,77.209999999999994]
[5,796.423,"DWARF FOUNTAIN GRASS - 'HAMELN' 1 GALLON","EA",214,2,26,26.54]
[5,796.44899999999996,"MAIDEN GRASS 'MORNING LIGHT' 2 GALLON","EA",258,1,30,31]
[5,801.22,"2 INCH ELECTRICAL CONDUIT - TYPE NM (DOUBLE)","FT",5560,1,46,43]
[5,801.24,"2 INCH ELECTRICAL CONDUIT - TYPE NM (4 BANK)","FT",880,1,115,123.75]
[5,801.26,"2 INCH ELECTRICAL CONDUIT - TYPE NM (6 BANK)","FT",160,1,195,190]
[5,804.2,"2 INCH ELECTRICAL CONDUIT TYPE NM - PLASTIC (UL)","FT",10355,4,47,48.31]
[5,804.3,"3 INCH ELECTRICAL CONDUIT TYPE NM - PLASTIC -(UL)","FT",185220,9,55,54.53]
[5,804.4,"4 INCH ELECTRICAL CONDUIT TYPE NM - PLASTIC -(UL)","FT",2050,1,51.21,47.48]
[5,806.3,"3 INCH ELECTRICAL CONDUIT TYPE RM - GALVANIZED STEEL","FT",550,2,117,119.5]
[5,808.2,"2 INCH ELECTRICAL CONDUIT TY RM - STEEL - (PLASTIC COATED)","FT",790,1,94,94]
[5,811.22,"ELECTRIC HANDHOLE - SD2.022","EA",544,4,1500,1404.72]
[5,811.23,"ELECTRIC HANDHOLE - SD2.023","EA",362,4,1545,1590.1]
[5,811.24,"ELECTRIC HANDHOLE - SD2.024","EA",8,1,1849.92,1968.73]
[5,811.27,"ELECTRIC HANDHOLE - (MUNICIPAL STANDARD)","EA",174,1,1325,1325]
[5,811.3,"PULL BOX 8 X 23 INCHES - SD2.030","EA",30,1,1435,1276.67]
[5,811.31,"PULL BOX 12 X 12 INCHES - SD2.031","EA",951,9,1015,1012.9]
[5,811.35,"PULL BOX ADJUSTED","EA",40,2,300,296.5]
[5,811.39,"ELECTRIC HANDHOLE REMOVED AND STACKED","EA",14,1,550,512.86]
[5,811.71,"JUNCTION BOX 18 X 12 X 8 INCHES","EA",21,1,1430,1452.78]
[5,812.09,"LIGHT STANDARD FOUNDATION PRECAST","EA",125,1,1775,1620]
[5,812.13,"LIGHT STANDARD FOUNDATION SD3.013","EA",80,2,3250,3199.05]
[5,812.14,"LIGHT STANDARD FOUNDATION SD3.014","EA",136,1,4300,4376]
[5,812.2,"LIGHTING LOAD CENTER FOUNDATION","EA",3,1,6750,6166.67]
[5,813.4,"WIRE TYPE 8 NO. 10 DIRECT BURIAL","FT",9500,1,1.26,1.22]
[5,813.41,"WIRE TYPE 8 NO. 8 DIRECT BURIAL","FT",94000,1,1.35,1.45]
[5,813.42,"WIRE TYPE 8 NO. 6 DIRECT BURIAL","FT",316200,2,1.98,2.0299999999999998]
[5,813.43,"WIRE TYPE 8 NO. 4 DIRECT BURIAL","FT",13200,1,2.58,2.72]
[5,813.45,"WIRE TYPE 8 NO. 1 DIRECT BURIAL","FT",720,1,5.3,5.42]
[5,813.53,"WIRE TYPE 11 - LOOP DETECTOR LEAD IN","FT",100,1,7,7]
[5,813.6,"EQUIPMENT GROUNDING","LS",4,1,2150,1880]
[5,813.72,"GROUND ROD 10 FEET LONG","EA",20,1,135,135]
[5,813.79,"INTERCONNECT CABLE SYSTEM","LS",3,1,18250,16166.67]
[5,813.8,"SERVICE CONNECTION (OVERHEAD)","LS",4,1,5575,5362.5]
[5,815.1,"TRAFFIC CONTROL SIGNAL LOCATION NO. 1","LS",22,4,242965,231377.95]
[5,815.2,"TRAFFIC CONTROL SIGNAL LOCATION NO. 2","LS",13,2,221000,234692.31]
[5,815.3,"TRAFFIC CONTROL SIGNAL LOCATION NO. 3","LS",9,2,188500,171222.22]
[5,815.4,"TRAFFIC CONTROL SIGNAL LOCATION NO. 4","LS",4,1,119750,116600]
[5,816.01,"TRAFFIC SIGNAL RECONSTRUCTION LOCATION NO. 1","LS",19,5,159700,155696.38]
[5,816.02,"TRAFFIC SIGNAL RECONSTRUCTION LOCATION NO. 2","LS",14,3,211000,199678.57]
[5,816.03,"TRAFFIC SIGNAL RECONSTRUCTION LOCATION NO. 3","LS",10,2,237450,236890]
[5,816.4,"TRAFFIC CONTROL SIGNAL REMOVED AND RESET","LS",6,1,9750,8000]
[5,816.8,"TRAFFIC CONTROL SIGNAL REMOVED AND STACKED","LS",5,1,8000,8200]
[5,817.1,"SIGNAL POST AND BASE STANDARD - 8 FOOT","EA",22,1,2347.5,2347.5]
[5,817.2,"SIGNAL POST AND BASE PEDESTAL - 8 FOOT","EA",3,1,16000,13476.67]
[5,819.83100000000002,"WIRE LOOP INSTALLED IN ROADWAY","FT",18030,6,14,14.37]
[5,822.88,"HIGH MAST TOWER (100 FOOT MOUNTING HEIGHT)","EA",35,1,44754.91,47772.83]
[5,823.6,"HIGHWAY LIGHTING LOAD CENTER","LS",10,2,40100,40799.78]
[5,824.1,"FLASHING WARNING BEACON TYPE D","LS",3,1,50000,50000]
[5,824.2,"FLASHING WARNING BEACON TYPE A","LS",3,1,9575,9050]
[5,824.5,"FLASHING WARNING BEACON REMOVED AND RESET","LS",3,1,3950,3300]
[5,828.01,"OVERHEAD GUIDE SIGN REMOVED AND RESET","SF",2310,1,17.5,18.399999999999999]
[5,828.03,"OVERHEAD GUIDE SIGN REMOVED","EA",4,1,2000,2100]
[5,828.1,"OVERHEAD GUIDE SIGN - ALUMINUM PANEL (TYPE B)","SF",25080,2,22,22.56]
[5,829,"ROADSIDE GUIDE SIGN (G) - ALUMINUM PANEL (TYPE B)","SF",13570,3,22.86,22.78]
[5,831,"ROADSIDE GUIDE SIGN (D6/D8) - ALUMINUM PANEL (TYPE A)","SF",4780,3,25,25.66]
[5,832,"WARNING-REGULATORY AND ROUTE MARKER - ALUMINUM PANEL (TYPE A)","SF",41742,15,12,12.15]
[5,833.5,"DEMOUNTABLE REFLECTORIZED DELINEATOR - GUARD RAIL","EA",2112,4,6.65,6.77]
[5,833.7,"DELINEATION FOR GUARD RAIL TERMINI","EA",518,6,49,46.3]
[5,834.17,"REFLECTORIZED FLEXIBLE DELINEATOR POST (AMBER)","EA",3600,3,38,38.380000000000003]
[5,834.18,"REFLECTORIZED FLEXIBLE DELINEATOR POST (WHITE)","EA",3750,3,39,39.630000000000003]
[5,836.5,"DEMOUNTABLE REFLECTORIZED STATION MARKER","EA",30,1,55,57.21]
[5,840.101,"SUPPORTS FOR OVERHEAD GUIDE SIGN (OD-1) STEEL","LS",7,1,121125,119285.71]
[5,840.10199999999998,"SUPPORTS FOR OVERHEAD GUIDE SIGN (OD-2) STEEL","LS",7,1,157500,157892.85999999999]
[5,840.10400000000004,"SUPPORTS FOR OVERHEAD GUIDE SIGN (OD-4) STEEL","LS",7,1,69500,66928.570000000007]
[5,840.10500000000002,"SUPPORTS FOR OVERHEAD GUIDE SIGN (OD-5) STEEL","LS",7,1,158125,156464.29]
[5,840.10699999999997,"SUPPORTS FOR OVERHEAD GUIDE SIGN (OD-7) STEEL","LS",6,1,113000,114000]
[5,840.10799999999995,"SUPPORTS FOR OVERHEAD GUIDE SIGN (OD-8) STEEL","LS",7,1,41625,44485.71]
[5,840.10900000000004,"SUPPORTS FOR OVERHEAD GUIDE SIGN (OD-9) STEEL","LS",7,1,74125,70492.86]
[5,840.11,"SUPPORTS FOR OVERHEAD GUIDE SIGN (OD-10) STEEL","LS",7,1,46250,45600]
[5,841.1,"SUPPORTS FOR GUIDE SIGN (D6 W/ D8-5 INCH TUBULAR POST) STEEL","EA",32,3,1921.86,1724.42]
[5,841.2,"SUPPORTS FOR GUIDE SIGN (D6-5 INCH TUBULAR POST) STEEL","EA",18,2,1400,1458.33]
[5,841.6,"SUPPORTS FOR GUIDE SIGN (I-2A-5 INCH TUBULAR POST) STEEL","EA",9,1,1200,1150]
[5,841.8,"SUPPORTS FOR GUIDE SIGN (D6 - SPECIAL DESIGN) STEEL","EA",6,1,3950,3990.67]
[5,844.101,"SUPPORTS FOR GUIDE SIGN (G1) STEEL","LS",10,2,6625,7023.73]
[5,844.10199999999998,"SUPPORTS FOR GUIDE SIGN (G2) STEEL","LS",8,1,6350,6548.41]
[5,844.10299999999995,"SUPPORTS FOR GUIDE SIGN (G3) STEEL","LS",11,2,6625,6767.03]
[5,844.10400000000004,"SUPPORTS FOR GUIDE SIGN (G4) STEEL","LS",8,1,7090,7158.36]
[5,844.10500000000002,"SUPPORTS FOR GUIDE SIGN (G5) STEEL","LS",8,1,7090,7158.36]
[5,846.1,"SUPPORT FOR GUIDE SIGN (E5-1A) STEEL","EA",48,1,2415,2392.73]
[5,847.1,"SIGN SUP (N/GUIDE)+RTE MKR W/1 BRKWAY POST ASSEMBLY - STEEL","EA",5759,17,130,130.07]
[5,848.1,"SIGN SUP (N/GUIDE)+RTE MKR W/2 BRKWAY POST ASSEMBLIES-STEEL","EA",1045,5,250,253.12]
[5,850.41,"ROADWAY FLAGGER","HR",43590,24,60,62.64]
[5,851.1,"TRAFFIC CONES FOR TRAFFIC MANAGEMENT","DAY",5426,12,20,21.61]
[5,852,"SAFETY SIGNING FOR TRAFFIC MANAGEMENT","SF",142125,31,20,21.92]
[5,853.1,"PORTABLE BREAKAWAY BARRICADE TYPE III","EA",890,15,120,125.18]
[5,853.2,"TEMPORARY BARRIER (TL-2)","FT",5810,4,50,46.94]
[5,853.21,"TEMPORARY BARRIER REMOVED AND RESET","FT",357610,13,14,13.58]
[5,853.23,"TEMPORARY BARRIER (TL-3)","FT",16960,8,43,38.81]
[5,853.33,"TEMPORARY BARRIER - LIMITED DEFLECTION (TL-3)","FT",278550,6,90,78.75]
[5,853.40300000000002,"TRUCK MOUNTED ATTENUATOR","DAY",34110,25,100,103.97]
[5,853.41,"TEMPORARY IMPACT ATTENUATOR FOR SHLDR, INCAPABLE OF REDIRECTION","EA",162,2,5475,5960.24]
[5,853.41099999999994,"TEMPORARY IMPACT ATTENUATOR FOR SHOULDER, INCAPABLE OF REDIRECTION, REMOVED AND RESET","EA",322,2,1410,1374.44]
[5,853.43,"TEMPORARY IMPACT ATTENUATOR FOR MEDIAN, INCAPABLE OF REDIRECTION","EA",10,2,4656,4715.3999999999996]
[5,853.43100000000004,"TEMPORARY IMPACT ATTENUATOR FOR MEDIAN, INCAPABLE OF REDIRECTION, REMOVED AND RESET","EA",8,1,1786.5,1818.25]
[5,853.50099999999998,"TEMPORARY IMPACT ATTENUATOR REMOVED AND RESET","EA",104,9,1454.37,1425.4]
[5,853.52,"TEMPORARY IMPACT ATTENUATOR UNIDIRECTIONAL, NON-REDIRECTIVE (TL-2)","EA",10,1,4550,4690]
[5,853.53,"TEMPORARY IMPACT ATTENUATOR UNIDIRECTIONAL, NON-REDIRECTIVE (TL-3)","EA",16,1,6876.22,6726.55]
[5,853.62,"TEMPORARY IMPACT ATTENUATOR UNIDIRECTIONAL, REDIRECTIVE (TL-2)","EA",14,1,6000,6371.43]
[5,853.63,"TEMPORARY IMPACT ATTENUATOR UNIDIRECTIONAL, REDIRECTIVE (TL-3)","EA",75,8,5900,6311.8]
[5,853.8,"TEMPORARY ILLUMINATION FOR WORK ZONE","DAY",9391,20,100,97.88]
[5,853.83,"TEMPORARY IMPACT ATTENUATOR BI-DIRECTIONAL, REDIRECTIVE (TL-3)","EA",8,2,3000,3050]
[5,854.01599999999996,"TEMPORARY PAVING MARKINGS - 6 INCH (PAINTED)","FT",8828400,19,0.3,0.3]
[5,854.03599999999994,"TEMPORARY PAVING MARKINGS - 6 INCH (TAPE)","FT",929510,18,1.22,1.19]
[5,854.1,"PAVEMENT MARKING REMOVAL","SF",912586,7,2,1.76]
[5,854.5,"RAISED PAVEMENT MARKER REMOVAL","EA",8825,5,20,18.48]
[5,854.6,"TEMPORARY PORTABLE RUMBLE STRIP","DAY",28575,6,20,32.28]
[5,856,"ARROW BOARD","DAY",122006,36,9.6999999999999993,9.43]
[5,856.12,"PORTABLE CHANGEABLE MESSAGE SIGN","DAY",104741,30,25,24.11]
[5,859,"REFLECTORIZED DRUM","DAY",5532875,29,0.25,0.24]
[5,859.1,"REFLECTORIZED DRUMS WITH SEQUENTIAL FLASHING WARNING LIGHTS","DAY",256045,29,4,4.1399999999999997]
[5,860.10599999999999,"6 INCH REFLECTORIZED WHITE LINE (PAINTED)","FT",1527500,5,0.25,0.25]
[5,860.11199999999997,"12 INCH REFLECTORIZED WHITE LINE (PAINTED)","FT",124400,2,0.87,0.81]
[5,861.10599999999999,"6 INCH REFLECTORIZED YELLOW LINE (PAINTED)","FT",1222120,6,0.26,0.27]
[5,861.11199999999997,"12 INCH REFLECTORIZED YELLOW LINE (PAINTED)","FT",11000,1,0.93,0.76]
[5,864.02,"PAVEMENT ARROW AND LEGENDS - TAPE","SF",4242,5,44.5,42.32]
[5,864.04,"PAVEMENT ARROWS AND LEGENDS REFLECTORIZED WHITE (THERMOPLASTIC)","SF",51030,14,9,8.07]
[5,864.31,"SLOTTED PAVEMENT MARKER ONE-WAY WHITE","EA",9682,7,23.2,26.77]
[5,864.32,"SLOTTED PAVEMENT MARKER ONE-WAY YELLOW","EA",2936,6,25,26.63]
[5,864.33,"SLOTTED PAVEMENT MARKER TWO-WAY WHITE/RED","EA",10026,8,24,24.26]
[5,864.34,"SLOTTED PAVEMENT MARKER TWO-WAY YELLOW/RED","EA",5332,6,22.86,24.02]
[5,864.35,"SLOTTED PAVEMENT MARKER TWO-WAY YELLOW/YELLOW","EA",6799,7,25,25.36]
[5,866.10599999999999,"6 INCH REFLECTORIZED WHITE LINE (THERMOPLASTIC)","FT",1013160,12,1,1.01]
[5,866.11199999999997,"12 INCH REFLECTORIZED WHITE LINE (THERMOPLASTIC)","FT",316660,13,3.68,3.75]
[5,866.20600000000002,"6 INCH REFLECTORIZED WHITE LINE (POLYUREA) (RECESSED)","FT",928300,7,1.99,2.15]
[5,866.21199999999999,"12 INCH REFLECTORIZED WHITE LINE (POLYUREA) (RECESSED)","FT",57465,6,4.8499999999999996,5.0599999999999996]
[5,867.10599999999999,"6 INCH REFLECTORIZED YELLOW LINE (THERMOPLASTIC)","FT",964750,12,1,1.01]
[5,867.11199999999997,"12 INCH REFLECTORIZED YELLOW LINE (THERMOPLASTIC)","FT",23250,8,3.8,3.79]
[5,867.20600000000002,"6 INCH REFLECTORIZED YELLOW LINE (POLYUREA) (RECESSED)","FT",656100,5,1.92,1.79]
[5,867.21199999999999,"12 INCH REFLECTORIZED YELLOW LINE (POLYUREA) (RECESSED)","FT",3290,3,5,5.63]
[5,874,"STREET NAME SIGN","EA",1262,9,110,109.99]
[5,874.2,"TRAFFIC SIGN REMOVED AND RESET","EA",578,12,106,109.09]
[5,874.3,"TRAFFIC SIGNS REMOVED AND STACKED","LS",5,1,700,635.79999999999995]
[5,874.4,"TRAFFIC SIGN REMOVED AND STACKED","EA",12,1,25,23.75]
[2,701.2,"CEMENT CONCRETE PEDESTRIAN CURB RAMP","SY",32259,18,110,113.4]
[2,702,"HOT MIX ASPHALT SIDEWALK OR DRIVEWAY","TON",52525,18,190,190.05]
[2,705.1,"FLAGSTONE WALK REMOVED AND RESET","SY",10,1,555,555]
[2,706,"BRICK WALK","SY",550,1,242.5,243]
[2,706.1,"BRICK WALK REMOVED AND RELAID","SY",25,1,200,166]
[2,707.1,"PARK BENCH","EA",86,5,2500,2420]
[2,707.15,"PARK BENCH REMOVED AND RESET","EA",7,2,1000,1040]
[2,707.2,"TRASH RECEPTACLE","EA",4,1,2100,2187.5]
[2,707.8,"STEEL BOLLARD","EA",121,2,1177.5,1184.75]
[2,707.9,"BICYCLE RACK","EA",75,3,800,825]
[2,710.3,"BOUND - LETTERED GRANITE","EA",160,2,535,549.75]
[2,710.4,"BOUND - PLAIN GRANITE","EA",393,4,500,518.55999999999995]
[2,711,"BOUND REMOVED AND RESET","EA",44,4,525,492.81]
[2,715,"RURAL MAIL BOX REMOVED AND RESET","EA",373,8,150,160.83000000000001]
[2,715.1,"MAIL BOX REMOVED AND RESET","EA",12,2,200,210.56]
[2,718.1,"FLAGPOLE REMOVED AND RESET","LS",4,1,2750,2650]
[2,734,"SIGN REMOVED AND RESET","EA",5,1,500,525]
[2,740,"ENGINEERS FIELD OFFICE AND EQUIPMENT (TYPE A)","MO",3097,23,2750,2771.03]
[2,745,"PEDESTRIAN BUS SHELTER","EA",12,1,15200,14733.33]
[2,747,"EQUIPMENT FOR ENGINEERS FIELD OFFICE","LS",1,1,25000,25000]
[2,748,"MOBILIZATION","LS",87,23,70000,66391.14]
[2,748.1,"EMERGENCY RESPONSE","EA",78,10,500,442.97]
[2,751,"LOAM BORROW","CY",92334,27,60,56.78]
[2,752,"TOPSOIL REHANDLED AND SPREAD","CY",23500,2,25,25.6]
[2,755.35,"INLAND WETLAND REPLICATION AREA","LS",8,2,4000,3500]
[2,755.45,"WETLAND RESTORATION","SY",3030,2,47.5,37.04]
[2,755.75,"WETLAND SPECIALIST","HR",372,3,200,201.75]
[2,755.76,"WETLANDS MONITORING REPORTS","LS",13,2,5000,5068.46]
[2,756,"NPDES STORMWATER POLLUTION PREVENTION PLAN","LS",53,15,6000,5075.47]
[2,760,"IMPERVIOUS SOIL BORROW","CY",550,3,87.5,87.14]
[2,765,"SEEDING","SY",581680,22,1.83,1.59]
[2,765.2,"SEED FOR EROSION CONTROL","LB",825,2,26,27.5]
[2,767.12099999999998,"SEDIMENT CONTROL BARRIER","FT",475777,22,6,5.63]
[2,767.2,"HAY MULCH","SY",1905,2,2.5,2.38]
[2,767.31,"STRAW MULCH","SY",24900,2,2,1.61]
[2,767.4,"WOOD CHIP MULCH","CY",120,3,100,81.09]
[2,767.6,"AGED PINE BARK MULCH","CY",1370,4,62.5,64.87]
[2,767.8,"BALES OF HAY FOR EROSION CONTROL","EA",330,2,20,20.83]
[2,767.9,"JUTE MESH","SY",18960,3,6.05,6.27]
[2,769,"PAVEMENT MILLING MULCH UNDER GUARD RAIL","FT",441980,17,8,8.18]
[2,774.13599999999997,"SPRUCE - NORWAY 5-6 FEET","EA",20,1,388,413.6]
[2,774.23500000000001,"SPRUCE - SERBIAN 5-6 FEET","EA",52,1,335,358.75]
[2,775.14700000000005,"LINDEN - LITTLE LEAF 2-2.5 INCH CALIPER","EA",60,1,634,629.5]
[2,776.52300000000002,"MAPLE - RED - 'ARMSTRONG' 2-2.5 INCH CALIPER","EA",12,1,477.5,473.75]
[2,776.54300000000001,"MAPLE - RED - 'OCTOBER GLORY' 2-2.5 INCH CALIPER","EA",80,1,700,713]
[2,777.04200000000003,"OAK - NORTHERN RED 2.5-3 INCH CALIPER","EA",18,1,765,751.67]
[2,777.13800000000003,"OAK - PIN 2-2.5 INCH CALIPER","EA",152,5,675,676.36]
[2,777.54200000000003,"PLANETREE - LONDON 2-2.5 INCH CALIPER","EA",30,1,655,637.16999999999996]
[2,778.16499999999996,"BIRCH - RIVER 'HERITAGE' 12-14 FOOT CLUMP","EA",9,1,625,612.66999999999996]
[2,778.37300000000005,"CHERRY - SARGENT 1.5-2 INCH CALIPER","EA",8,1,528,521.5]
[2,778.41700000000003,"CRABAPPLE - 'CENTURION' 2.5-3 INCH CALIPER","EA",55,1,850,765]
[2,778.423,"CRABAPPLE - 'DONALD WYMAN' 1.5-2 INCH CALIPER","EA",45,1,625,605]
[2,778.47299999999996,"CRABAPPLE - 'ZUMI' 1.5-2 INCH CALIPER","EA",60,1,430,498.6]
[2,781.17100000000005,"HACKBERRY TREE 1.5-2 INCH CALIPER","EA",16,1,522,520.75]
[2,781.57899999999995,"LILAC TREE - JAPANESE 2-2.5 INCH CALIPER","EA",12,1,615,612.5]
[2,782.14499999999998,"MAIDENHAIR TREE 2-2.5 INCH CALIPER","EA",60,1,610,608.75]
[2,782.53700000000003,"REDBUD - EASTERN 1.5-2 INCH CALIPER","EA",35,1,655,611]
[2,782.63400000000001,"REDWOOD - DAWN 2-2.5 INCH CALIPER","EA",12,1,605,603.75]
[2,783.44200000000001,"TULIP TREE 2.5-3 INCH CALIPER","EA",12,1,721.5,717]
[2,783.46500000000003,"TUPELO 1.5-2 INCH CALIPER","EA",44,1,528,521.5]
[2,785.73099999999999,"INKBERRY - COMPACT 18-24 INCH","EA",18,1,90,85.5]
[2,786.10900000000004,"JUNIPER - 'BLUE RUG' 12-15 INCH","EA",44,1,23.5,23.75]
[2,786.471,"JUNIPER - 'SEA GREEN' 18-24 INCH","EA",20,1,54,53]
[2,788.01300000000003,"ALDER SHRUB - SPECKLED 2 GALLON","EA",40,2,45,45.38]
[2,789.63300000000004,"BLUEBERRY - HIGHBUSH 2-3 FEET","EA",20,1,35.5,36]
[2,790.71900000000005,"DOGWOOD - SILKY 2-3 FEET","EA",20,1,35.5,36]
[2,793.73099999999999,"SPIREA - 'ANTHONY WATERER' 2-3 FEET","EA",12,1,35.5,36]
[2,794.73099999999999,"SUMMERSWEET SHRUB 18-24 INCH","EA",301,1,60,63.29]
[2,794.73699999999997,"SUMMERSWEET SHRUB 3-4 FEET","EA",21,1,60,57.21]
[2,795.00900000000001,"VIBURNUM - ARROWWOOD 18-24 INCHES","EA",15,1,47.5,46.33]
[2,795.053,"VIBURNUM - HIGHBUSH CRANBERRY 3-4 FEET","EA",27,2,100,94.93]
[2,795.15099999999995,"WINTERBERRY - MALE 18-24 INCH","EA",91,1,55,58.29]
[2,795.15700000000004,"WINTERBERRY - FEMALE 24-30 INCH","EA",144,2,55,65.25]
[2,796.22500000000002,"ROSE - PINK MEIDILAND 2 GALLON","EA",20,1,29.5,29.25]
[2,796.41899999999998,"COMMON RUSH 1 GALLON","EA",125,1,25,21.72]
[2,796.423,"DWARF FOUNTAIN GRASS - 'HAMELN' 1 GALLON","EA",1112,2,24,21.66]
[2,801.32,"3 INCH ELECTRICAL CONDUIT - TYPE NM (DOUBLE)","FT",4825,2,40,40.72]
[2,801.34,"3 INCH ELECTRICAL CONDUIT - TYPE NM (4 BANK)","FT",625,1,57.5,54.25]
[2,801.42,"4 INCH ELECTRICAL CONDUIT - TYPE NM (DOUBLE)","FT",5500,3,51,47]
[2,801.44,"4 INCH ELECTRICAL CONDUIT - TYPE NM (4 BANK)","FT",8900,3,81,73.27]
[2,801.46,"4 INCH ELECTRICAL CONDUIT - TYPE NM (6 BANK)","FT",150,1,68,62.67]
[2,801.62,"6 INCH ELECTRICAL CONDUIT - TYPE NM (DOUBLE)","FT",1200,1,48,44]
[2,804.1,"1 INCH ELECTRICAL CONDUIT TYPE NM - PLASTIC -(UL)","FT",675,1,25,22]
[2,804.2,"2 INCH ELECTRICAL CONDUIT TYPE NM - PLASTIC (UL)","FT",4850,3,29,30.41]
[2,804.3,"3 INCH ELECTRICAL CONDUIT TYPE NM - PLASTIC -(UL)","FT",111325,11,32,29.52]
[2,806.6,"6 INCH ELECTRICAL CONDUIT TYPE RM - GALVANIZED STEEL","FT",4620,1,100,108.33]
[2,810.91,"MAINTENANCE OF TRAFFIC CONTROL SIGNAL SYSTEMS","LS",3,1,40000,37333.33]
[2,811.1,"ELECTRIC MANHOLE - SD2.010","EA",35,1,2275,2267]
[2,811.22,"ELECTRIC HANDHOLE - SD2.022","EA",57,4,1200,1189.57]
[2,811.27,"ELECTRIC HANDHOLE - (MUNICIPAL STANDARD)","EA",24,1,1700,1787.5]
[2,811.3,"PULL BOX 8 X 23 INCHES - SD2.030","EA",371,2,1125,1101.67]
[2,811.31,"PULL BOX 12 X 12 INCHES - SD2.031","EA",945,11,950,889.34]
[2,811.35,"PULL BOX ADJUSTED","EA",15,1,350,383.33]
[2,811.36,"ELECTRIC MANHOLE ADJUSTED","EA",4,1,645,622.5]
[2,811.37,"ELECTRIC HANDHOLE ADJUSTED","EA",35,2,250,221.43]
[2,812.09,"LIGHT STANDARD FOUNDATION PRECAST","EA",30,1,1850,1666.67]
[2,812.13,"LIGHT STANDARD FOUNDATION SD3.013","EA",396,1,3100,3066.67]
[2,812.3,"STANDARD SIGNAL POST FOUNDATION SD3.030","EA",2,1,1500,1500]
[2,813.3,"WIRE TYPE 7 NO. 10 GENERAL PURPOSE","FT",15700,1,1.8,1.8]
[2,813.31,"WIRE TYPE 7 NO. 8 GENERAL PURPOSE","FT",12520,1,2.1,2.14]
[2,813.32,"WIRE TYPE 7 NO. 6 GENERAL PURPOSE","FT",1200,1,2.85,3.08]
[2,813.36,"WIRE TYPE 7 NO. 1/0 GENERAL PURPOSE","FT",525,1,7.4,7.27]
[2,813.4,"WIRE TYPE 8 NO. 10 DIRECT BURIAL","FT",7920,1,2,1.98]
[2,813.43,"WIRE TYPE 8 NO. 4 DIRECT BURIAL","FT",556230,1,2.2000000000000002,2.09]
[2,813.52,"WIRE TYPE 10 - #8 GROUNDING AND BONDING","FT",3600,1,2.2999999999999998,2.4]
[2,813.79,"INTERCONNECT CABLE SYSTEM","LS",5,1,24000,25720]
[2,813.79100000000005,"INTERCONNECT CABLE SYSTEM","FT",4400,1,8,8.5]
[2,813.8,"SERVICE CONNECTION (OVERHEAD)","LS",3,1,4820,4380]
[2,813.81,"SERVICE CONNECTION (UNDERGROUND)","LS",5,1,4200,4120]
[2,815,"TRAFFIC CONTROL SIGNAL","LS",7,1,165000,168390]
[2,815.3,"TRAFFIC CONTROL SIGNAL LOCATION NO. 3","LS",11,2,121650,113231.45]
[2,815.98,"FOOTING COST ADJUSTMENT","FT",30,1,417.5,428.33]
[2,816,"TRAFFIC SIGNAL REMOVED AND RESET","LS",3,1,5500,4833.33]
[2,816.01,"TRAFFIC SIGNAL RECONSTRUCTION LOCATION NO. 1","LS",49,10,196955,199503.57]
[2,816.02,"TRAFFIC SIGNAL RECONSTRUCTION LOCATION NO. 2","LS",29,5,204320,206901.38]
[2,816.03,"TRAFFIC SIGNAL RECONSTRUCTION LOCATION NO. 3","LS",4,1,163000,166165]
[2,816.8,"TRAFFIC CONTROL SIGNAL REMOVED AND STACKED","LS",16,4,6000,5853.75]
[2,816.81,"TEMPORARY TRAFFIC CONTROL SIGNAL","LS",5,1,95000,97000]
[2,816.9,"TRAFFIC CONTROL SIGNAL REMOVED AND TRANSPORTED","LS",7,1,6000,5128.57]
[2,819.83100000000002,"WIRE LOOP INSTALLED IN ROADWAY","FT",1900,2,17.5,16.55]
[2,820.1,"HIGHWAY LIGHTING - ROADWAY","LS",5,1,55000,50000]
[2,820.11,"HIGHWAY LIGHTING - UNDERPASS","LS",3,1,50000,48333.33]
[2,823.6,"HIGHWAY LIGHTING LOAD CENTER","LS",4,1,18940,19970]
[2,823.7,"HIGHWAY LIGHTING POLE AND LUMINAIRE REMOVED AND RESET","EA",4,1,1200,1225]
[2,823.71,"HIGHWAY LIGHTING POLE AND LUMINAIRE REMOVED AND STACKED","EA",156,1,660,667.5]
[2,824.71,"HIGHWAY WARNING SIGN - ILLUMINATED REMOVED AND STACKED","LS",3,1,1320,1280]
[2,827.21,"24 INCH WARNING CLUSTER (H1-2) - ALUMINUM PANEL (TYPE A)","EA",12,1,175,172.25]
[2,827.33,"ABUTMENT WARNING SIGN (H1-3) - ALUMINUM PANEL (TYPE A)","EA",28,1,160,172.86]
[2,828.1,"OVERHEAD GUIDE SIGN - ALUMINUM PANEL (TYPE B)","SF",14226,1,22,22.45]
[2,829,"ROADSIDE GUIDE SIGN (G) - ALUMINUM PANEL (TYPE B)","SF",3348,1,21.5,22.3]
[2,831,"ROADSIDE GUIDE SIGN (D6/D8) - ALUMINUM PANEL (TYPE A)","SF",420,2,26,27.09]
[2,832,"WARNING-REGULATORY AND ROUTE MARKER - ALUMINUM PANEL (TYPE A)","SF",32412,24,13.37,13.5]
[2,833.5,"DEMOUNTABLE REFLECTORIZED DELINEATOR - GUARD RAIL","EA",8325,5,8,9.4700000000000006]
[2,833.7,"DELINEATION FOR GUARD RAIL TERMINI","EA",830,8,60,60]
[2,834.17,"REFLECTORIZED FLEXIBLE DELINEATOR POST (AMBER)","EA",24,2,125,141.66999999999999]
[2,834.18,"REFLECTORIZED FLEXIBLE DELINEATOR POST (WHITE)","EA",508,2,125,121.25]
[2,840.101,"SUPPORTS FOR OVERHEAD GUIDE SIGN (OD-1) STEEL","LS",6,1,35000,25716.67]
[2,840.10199999999998,"SUPPORTS FOR OVERHEAD GUIDE SIGN (OD-2) STEEL","LS",6,1,85000,85710]
[2,840.10299999999995,"SUPPORTS FOR OVERHEAD GUIDE SIGN (OD-3) STEEL","LS",6,1,80250,81290.83]
[2,840.10400000000004,"SUPPORTS FOR OVERHEAD GUIDE SIGN (OD-4) STEEL","LS",6,1,86000,85826.67]
[2,840.10500000000002,"SUPPORTS FOR OVERHEAD GUIDE SIGN (OD-5) STEEL","LS",6,1,82376,82467]
[2,841.1,"SUPPORTS FOR GUIDE SIGN (D6 W/ D8-5 INCH TUBULAR POST) STEEL","EA",63,1,1800,1857.14]
[2,841.8,"SUPPORTS FOR GUIDE SIGN (D6 - SPECIAL DESIGN) STEEL","EA",12,1,2640,2493.33]
[2,844.101,"SUPPORTS FOR GUIDE SIGN (G1) STEEL","LS",5,1,8650,7690]
[2,844.10199999999998,"SUPPORTS FOR GUIDE SIGN (G2) STEEL","LS",5,1,8900,7900]
[2,844.10299999999995,"SUPPORTS FOR GUIDE SIGN (G3) STEEL","LS",5,1,8900,7990]
[2,844.10400000000004,"SUPPORTS FOR GUIDE SIGN (G4) STEEL","LS",4,1,3900,3258.75]
[2,844.10500000000002,"SUPPORTS FOR GUIDE SIGN (G5) STEEL","LS",4,1,3900,3258.75]
[2,846.1,"SUPPORT FOR GUIDE SIGN (E5-1A) STEEL","EA",5,1,2850,2653]
[2,847.1,"SIGN SUP (N/GUIDE)+RTE MKR W/1 BRKWAY POST ASSEMBLY - STEEL","EA",4597,22,143,145.16]
[2,848.1,"SIGN SUP (N/GUIDE)+RTE MKR W/2 BRKWAY POST ASSEMBLIES-STEEL","EA",393,7,250,257.16000000000003]
[2,850.41,"ROADWAY FLAGGER","HR",44903,26,58.5,60.89]
[2,851.1,"TRAFFIC CONES FOR TRAFFIC MANAGEMENT","DAY",6901,19,100,88.61]
[2,852,"SAFETY SIGNING FOR TRAFFIC MANAGEMENT","SF",118014,39,24,23.97]
[2,853.1,"PORTABLE BREAKAWAY BARRICADE TYPE III","EA",824,23,150,146.68]
[2,853.2,"TEMPORARY BARRIER (TL-2)","FT",17400,6,49,46.37]
[2,853.21,"TEMPORARY BARRIER REMOVED AND RESET","FT",165300,17,15,14.78]
[2,853.23,"TEMPORARY BARRIER (TL-3)","FT",50005,9,55,53.56]
[2,853.3,"TEMPORARY RESTRAINED BARRIER","FT",2800,1,120,130]
[2,853.31,"TEMPORARY RESTRAINED BARRIER REMOVED AND RESET","FT",4000,1,14,11.63]
[2,853.33,"TEMPORARY BARRIER - LIMITED DEFLECTION (TL-3)","FT",8000,5,92,82.15]
[2,853.40300000000002,"TRUCK MOUNTED ATTENUATOR","DAY",15383,27,150,140.58000000000001]
[2,853.41,"TEMPORARY IMPACT ATTENUATOR FOR SHLDR, INCAPABLE OF REDIRECTION","EA",40,3,4175,4665.83]
[2,853.41099999999994,"TEMPORARY IMPACT ATTENUATOR FOR SHOULDER, INCAPABLE OF REDIRECTION, REMOVED AND RESET","EA",18,2,1600,1605.56]
[2,853.42,"TEMPORARY IMPACT ATTENUATOR FOR SHOULDER, CAPABLE OF REDIRECTION","EA",6,1,6550,6866.67]
[2,853.42100000000005,"TEMPORARY IMPACT ATTENUATOR FOR SHOULDER, CAPABLE OF REDIRECTION, REMOVED AND RESET","EA",8,1,2250,2237.5]
[2,853.50099999999998,"TEMPORARY IMPACT ATTENUATOR REMOVED AND RESET","EA",180,12,1500,1537.17]
[2,853.52,"TEMPORARY IMPACT ATTENUATOR UNIDIRECTIONAL, NON-REDIRECTIVE (TL-2)","EA",34,3,4200,3677.5]
[2,853.53,"TEMPORARY IMPACT ATTENUATOR UNIDIRECTIONAL, NON-REDIRECTIVE (TL-3)","EA",22,3,4500,4563.6400000000003]
[2,853.63,"TEMPORARY IMPACT ATTENUATOR UNIDIRECTIONAL, REDIRECTIVE (TL-3)","EA",82,4,6000,5671.88]
[2,853.8,"TEMPORARY ILLUMINATION FOR WORK ZONE","DAY",4352,22,100,101.41]
[2,853.83,"TEMPORARY IMPACT ATTENUATOR BI-DIRECTIONAL, REDIRECTIVE (TL-3)","EA",22,2,6000,6090.91]
[2,854.01599999999996,"TEMPORARY PAVING MARKINGS - 6 INCH (PAINTED)","FT",3249970,18,0.4,0.37]
[2,854.03599999999994,"TEMPORARY PAVING MARKINGS - 6 INCH (TAPE)","FT",281760,22,1.95,1.75]
[2,854.1,"PAVEMENT MARKING REMOVAL","SF",233643,19,2,2]
[2,854.6,"TEMPORARY PORTABLE RUMBLE STRIP","DAY",4430,10,25,19.55]
[2,856,"ARROW BOARD","DAY",35718,34,11,10.4]
[2,856.12,"PORTABLE CHANGEABLE MESSAGE SIGN","DAY",88942,36,25,24.6]
[2,859,"REFLECTORIZED DRUM","DAY",3259164,37,0.3,0.3]
[2,859.1,"REFLECTORIZED DRUMS WITH SEQUENTIAL FLASHING WARNING LIGHTS","DAY",32469,26,6,5.36]
[2,860.10599999999999,"6 INCH REFLECTORIZED WHITE LINE (PAINTED)","FT",900000,1,0.2,0.18]
[2,860.11199999999997,"12 INCH REFLECTORIZED WHITE LINE (PAINTED)","FT",120,1,6,4.99]
[2,861.10599999999999,"6 INCH REFLECTORIZED YELLOW LINE (PAINTED)","FT",600000,1,0.2,0.18]
[2,864.01,"PAVEMENT ARROW AND LEGENDS REFLECTORIZED WHITE - INLAY TAPE","SF",27060,3,49,47.86]
[2,864.02,"PAVEMENT ARROW AND LEGENDS - TAPE","SF",3470,2,50,49.08]
[2,864.04,"PAVEMENT ARROWS AND LEGENDS REFLECTORIZED WHITE (THERMOPLASTIC)","SF",53050,16,10,9.19]
[2,864.31,"SLOTTED PAVEMENT MARKER ONE-WAY WHITE","EA",5006,8,28,27.34]
[2,864.32,"SLOTTED PAVEMENT MARKER ONE-WAY YELLOW","EA",5777,5,27,27.68]
[2,864.33,"SLOTTED PAVEMENT MARKER TWO-WAY WHITE/RED","EA",2203,6,29,28.66]
[2,864.34,"SLOTTED PAVEMENT MARKER TWO-WAY YELLOW/RED","EA",2444,5,28,27.71]
[2,864.35,"SLOTTED PAVEMENT MARKER TWO-WAY YELLOW/YELLOW","EA",20355,6,25,25.74]
[2,866.10599999999999,"6 INCH REFLECTORIZED WHITE LINE (THERMOPLASTIC)","FT",360315,8,1.1000000000000001,1.07]
[2,866.11199999999997,"12 INCH REFLECTORIZED WHITE LINE (THERMOPLASTIC)","FT",68850,9,4.5,4.3499999999999996]
[2,866.20600000000002,"6 INCH REFLECTORIZED WHITE LINE (POLYUREA) (RECESSED)","FT",1157509,11,2.25,2.2599999999999998]
[2,866.21199999999999,"12 INCH REFLECTORIZED WHITE LINE (POLYUREA) (RECESSED)","FT",133957,9,7.75,7.47]
[2,867.10599999999999,"6 INCH REFLECTORIZED YELLOW LINE (THERMOPLASTIC)","FT",355200,8,1.1000000000000001,1.07]
[2,867.11199999999997,"12 INCH REFLECTORIZED YELLOW LINE (THERMOPLASTIC)","FT",8020,4,5,4.37]
[2,867.20600000000002,"6 INCH REFLECTORIZED YELLOW LINE (POLYUREA) (RECESSED)","FT",808981,10,2.25,2.09]
[2,867.21199999999999,"12 INCH REFLECTORIZED YELLOW LINE (POLYUREA) (RECESSED)","FT",16452,5,8,7.53]
[2,874,"STREET NAME SIGN","EA",1061,10,150,157.29]
[2,874.1,"STREET SIGN REMOVED AND RESET","EA",81,3,125,130.59]
[2,874.2,"TRAFFIC SIGN REMOVED AND RESET","EA",918,14,110,113.63]
[2,874.3,"TRAFFIC SIGNS REMOVED AND STACKED","LS",3,1,1750,1566.67]
[2,874.4,"TRAFFIC SIGN REMOVED AND STACKED","EA",1485,10,30,31.89]
[2,874.7,"MISCELLANEOUS SIGNS REMOVED AND STACKED","EA",14,2,100,155.83000000000001]
[2,877.1,"SIGN POST REMOVED AND DISCARDED","EA",10,1,100,112.5]
[2,877.2,"SIGN POST REMOVED AND STACKED","EA",8,1,40,37.5]
[2,901,"4000 PSI, 1.5 INCH, 565 CEMENT CONCRETE","CY",4800,8,900,932.41]
[2,901.3,"4000 PSI, 1.5 INCH, 565 CEMENT CONCRETE FOR POST FOUNDATION","CY",238,3,500,442.08]
[2,903,"3000 PSI, 1.5 INCH, 470 CEMENT CONCRETE","CY",810,6,300,376.88]
[2,904,"4000 PSI, 3/4 INCH, 610 CEMENT CONCRETE","CY",194,4,1500,1460.89]
[2,904.3,"5000 PSI, 3/4 INCH, 685 HP CEMENT CONCRETE","CY",360,1,1500,1266.67]
[2,905,"4000 PSI, 3/8 INCH, 660 CEMENT CONCRETE","CY",1050,12,3750,4192.7700000000004]
[2,905.2,"5000 PSI, 3/8 INCH, 710 HP CEMENT CONCRETE","CY",405,1,2402.5,2601.67]
[2,909.2,"CEMENTITIOUS MORTAR FOR PATCHING","SF",4025,4,93.5,108.9]
[2,910,"STEEL REINFORCEMENT FOR STRUCTURES","LB",138995,7,3.25,3.29]
[2,910.1,"STEEL REINFORCEMENT FOR STRUCTURES - EPOXY COATED","LB",150808,17,4,3.73]
[2,910.4,"MECHANICAL REINFORCING BAR SPLICER","EA",105,3,65,66.5]
[2,912,"DRILLING AND GROUTING DOWELS","EA",484,3,58.5,53.14]
[2,950.1,"TEMPORARY SHORING","LS",6,2,775000,817500]
[2,960.1,"STRUCTURAL STEEL - COATED STEEL","LB",9146,1,7.68,7.68]
[2,961.20100000000002,"CLEAN (FULL REMOVAL) AND PAINT STEEL BRIDGE NO. ________","LS",6,1,238000,202700]
[2,961.202,"CLEAN (FULL REMOVAL) AND PAINT STEEL BRIDGE NO. ________","LS",6,1,207500,198866.67]
[2,961.20299999999997,"CLEAN (FULL REMOVAL) AND PAINT STEEL BRIDGE NO. _______","LS",6,1,222500,212343.33]
[2,961.20399999999995,"CLEAN (FULL REMOVAL) AND PAINT STEEL BRIDGE NO. ________","LS",6,1,222500,211526.67]
[2,964.1,"EPOXY BONDING COMPOUND","SF",12800,3,2,2.08]
[2,964.7,"EPOXY MORTAR FOR PATCHING","SF",250,2,32.5,37.5]
[2,965,"MEMBRANE WATERPROOFING FOR BRIDGE DECKS","SF",408000,1,6.92,7.52]
[2,966,"MEMBRANE WATERPROOFING FOR BRIDGE DECK REPAIRS","SF",26540,4,5,4.55]
[2,970,"BITUMINOUS DAMP-PROOFING","SY",1680,1,20,20]
[2,972,"STRIP SEAL BRIDGE JOINT SYSTEM","FT",1330,2,555,512.83000000000004]
[2,983,"DUMPED RIPRAP","TON",13850,3,60.5,64.91]
[2,983.01,"DUMPED RIPRAP","CY",1050,1,100,93]
[2,983.1,"RIPRAP","TON",8290,3,80,73.92]
[2,983.11,"MODIFIED RIPRAP","TON",2000,1,85.17,72.59]
[2,986,"MODIFIED ROCKFILL","TON",16190,7,72,71.260000000000005]
[2,986.2,"MODIFIED ROCKFILL","CY",3724,2,100,119.92]
[2,987.02,"SPECIAL SLOPE PAVING UNDER BRIDGE REMOVED AND RESET","SY",150,1,42.5,41]
[2,987.3,"SPECIAL SLOPE PAVING UNDER BRIDGE - CEMENT CONCRETE","SY",5665,4,150,198.42]
[2,991.1,"CONTROL OF WATER - STRUCTURE NO. ______","LS",17,5,65000,54358.82]
[2,991.2,"CONTROL OF WATER - STRUCTURE NO. ______","LS",5,1,30000,29000]
[2,992.1,"ALTERATION TO BRIDGE STRUCTURE NO. ______","LS",3,1,6500000,6463333.3300000001]
[2,992.3,"TEMPORARY SUPPORTS FOR BRIDGE STRUCTURE","LS",12,2,131000,115459]
[2,993.1,"TEMPORARY BRIDGE NO. ______","LS",7,1,4000000,3921541.05]
[2,994.01,"TEMPORARY PROTECTIVE SHIELDING BRIDGE NO. _______________","LS",3,1,1000000,983333.33]
[2,994.1,"TEMPORARY PROTECTIVE SHIELDING","SF",30727,9,10,9.14]
[2,995.01,"BRIDGE STRUCTURE, BRIDGE NO. ______","LS",18,3,1141500,920955.47]
[2,995.02,"BRIDGE STRUCTURE, BRIDGE NO. _______","LS",7,1,8057243,8528891.8599999994]
[2,995.03,"BRIDGE STRUCTURE, BRIDGE NO. _______","LS",7,1,1900000,1891257.43]
[2,996.02,"WALL STRUCTURE, WALL NO. ________________","LS",4,1,68000,56050]
[3,100,"SCHEDULE OF OPERATIONS - FIXED PRICE $__________","LS",70,10,35500,33135.71]
[3,100.001,"ELECTRICIAN","HR",14000,2,121,120.18]
[3,100.002,"LABORER","HR",2160,3,81,80.7]
[3,100.1,"BASE LABOR RATE","HR",46344,7,111.5,113.64]
[3,100.5,"ELECTRICAL WORK","LS",4,1,40660,40660]
[3,100.61,"HVAC WORK","LS",4,1,62040,67270]
[3,100.75,"PAINTING","LS",4,1,86737,83115.25]
[3,101,"CLEARING AND GRUBBING","A",44.95,15,40000,41036.61]
[3,101.1,"CLEARING","A",61,2,19000,32359.38]
[3,102,"SELECTIVE CLEARING AND THINNING","A",1,1,35000,35769.599999999999]
[3,102.01,"SELECTIVE CLEARING AND GRUBBING","LS",6,1,45000,40833.33]
[3,102.1,"TREE TRIMMING","FT",34815,12,15,15.16]
[3,102.12,"TREE TRIMMING","EA",40,1,500,380]
[3,102.3,"HERBICIDE TREATMENT FOR INVASIVE PLANTS","HR",1613,6,405,433.7]
[3,102.33,"INVASIVE PLANT MANAGEMENT STRATEGY","HR",804,6,265,244.53]
[3,102.511,"TREE PROTECTION â€“ ARMORING & PRUNING","EA",1358,15,350,334.29]
[3,102.521,"TREE AND PLANT PROTECTION FENCE","FT",57370,17,8,8.2799999999999994]
[3,102.55,"ARBORIST","HR",1352,5,150,149.04]
[3,103,"TREE REMOVED - DIAMETER UNDER 24 INCHES","EA",869,14,1500,1383.98]
[3,104,"TREE REMOVED - DIAMETER 24 INCHES AND OVER","EA",293,10,2500,2494.23]
[3,105,"STUMP REMOVED","EA",150,5,500,536.57000000000005]
[3,106.88,"JACKING AND SHORING","EA",80,3,5675,7638.64]
[3,107.855,"PRESSURE INJECTION OF CRACKS","FT",180,1,415,390]
[3,107.97,"STRUCTURAL STEEL REPAIRS","LB",66860,4,28,28.57]
[3,114.1,"DEMOLITION OF SUPERSTRUCTURE OF BRIDGE NO. _____","LS",20,6,325000,325300]
[3,114.2,"DEMOLITION OF SUPERSTRUCTURE OF BRIDGE NO. _____","LS",2,1,300000,245000]
[3,114.3,"DEMOLITION OF SUPERSTRUCTURE OF BRIDGE NO. _____","LS",2,1,300000,225000]
[3,115.1,"DEMOLITION OF BRIDGE NO. _____","LS",7,1,100000,81428.570000000007]
[3,115.2,"DEMOLITION OF BRIDGE NO. _____","LS",2,1,300000,240000]
[3,120,"EARTH EXCAVATION","CY",316359,13,37,35.61]
[3,120.1,"UNCLASSIFIED EXCAVATION","CY",410724,18,45,43.9]
[3,121,"CLASS A ROCK EXCAVATION","CY",8130,10,145,129.72999999999999]
[3,123,"MUCK EXCAVATION","CY",4725,3,50,51.29]
[3,125,"TOPSOIL EXCAVATED AND STACKED","CY",2100,1,25,24.7]
[3,127,"CONCRETE EXCAVATION","CY",7850,3,150,147.96]
[3,127.1,"REINFORCED CONCRETE EXCAVATION","CY",9159,10,850,1128.7]
[3,127.4,"REINFORCED CONCRETE DECK EXCAVATION (FULL DEPTH)","SY",7637,7,750,638.36]
[3,127.41,"REINFORCED CONCRETE DECK EXCAVATION (PARTIAL DEPTH)","CY",2046,8,2992.5,2891.04]
[3,129.6,"BRIDGE PAVEMENT EXCAVATION","SY",77844,9,20,19.21]
[3,140,"BRIDGE EXCAVATION","CY",61922,9,40,39.450000000000003]
[3,141,"CLASS A TRENCH EXCAVATION","CY",37789,15,42,41.12]
[3,141.1,"TEST PIT FOR EXPLORATION","CY",13194,21,110,112.96]
[3,142,"CLASS B TRENCH EXCAVATION","CY",23891,20,30,32.85]
[3,143,"CHANNEL EXCAVATION","CY",7074,3,65,63.53]
[3,144,"CLASS B ROCK EXCAVATION","CY",11348,19,150,152.22999999999999]
[3,145,"DRAINAGE STRUCTURE ABANDONED","EA",47,3,650,609.64]
[3,146,"DRAINAGE STRUCTURE REMOVED","EA",1661,16,750,693.5]
[3,149.19999999999999,"PUBLIC OUTREACH","LS",7,1,250000,280714.28999999998]
[3,150,"ORDINARY BORROW","CY",18309,11,38,36.5]
[3,150.1,"SPECIAL BORROW","CY",24680,6,44,43.37]
[3,151,"GRAVEL BORROW","CY",343707,28,45,44.86]
[3,151.01,"GRAVEL BORROW - TYPE C","CY",25990,7,40,40.83]
[3,151.1,"GRAVEL BORROW FOR BRIDGE FOUNDATION","CY",11050,4,55,52.42]
[3,151.19999999999999,"GRAVEL BORROW FOR BACKFILLING STRUCTURES AND PIPES","CY",89287,12,50,49.54]
[3,153,"CONTROLLED DENSITY FILL - EXCAVATABLE","CY",3888,10,160,169.02]
[3,153.1,"CONTROLLED DENSITY FILL - NON-EXCAVATABLE","CY",289,4,225,215.89]
[3,154,"SAND BORROW","CY",226,2,71.5,72]
[3,156,"CRUSHED STONE","TON",47109,19,45,47.37]
[3,156.1,"CRUSHED STONE FOR BRIDGE FOUNDATIONS","TON",5624,4,50,53.67]
[3,156.19999999999999,"CRUSHED STONE FOR SLOPE TREATMENT","TON",2874,2,50,45.54]
[3,156.5,"CRUSHED STONE FOR FILTER BLANKET","CY",855,1,71,68.89]
[3,170,"FINE GRADING AND COMPACTING - SUBGRADE AREA","SY",924355,19,6,5.63]
[3,180.01,"ENVIRONMENTAL HEALTH AND SAFETY PROGRAM","LS",47,10,10000,8323.7000000000007]
[3,180.02,"PERSONAL PROTECTION LEVEL C UPGRADE","HR",2050,9,10,8.4700000000000006]
[3,180.03,"LICENSED SITE PROFESSIONAL SERVICES","HR",8330,9,115,117.26]
[3,181.11,"DISPOSAL OF UNREGULATED SOIL","TON",27731,9,45,43.64]
[3,181.12,"DISPOSAL OF REGULATED SOIL - IN-STATE FACILITY","TON",39765,9,65,65.27]
[3,181.13,"DISPOSAL OF REGULATED SOIL - OUT-OF-STATE FACILITY","TON",31819,9,120,114.99]
[3,181.14,"DISPOSAL OF HAZARDOUS WASTE","TON",3302,9,397.5,402.18]
[3,182.1,"INSPECTION AND TESTING FOR ASBESTOS","LS",32,7,2500,2324.4]
[3,182.2,"REMOVAL OF ASBESTOS","FT",6030,7,80,76.680000000000007]
[3,183.1,"TREATMENT OF CONTAMINATED GROUNDWATER","GAL",125250,5,10,7.83]
[3,183.2,"DISPOSAL OF GRANULAR ACTIVATED CARBON","LB",7760,7,10,8.76]
[3,184.1,"DISPOSAL OF TREATED WOOD PRODUCTS","TON",498,8,300,286.24]
[3,188.3,"DISPOSAL OF MERCURY CONTAINING LAMPS","EA",186,1,27.5,28]
[3,191,"DRIVE SAMPLE BORING","FT",36,1,65,61]
[3,191.1,"HOLLOW STEM AUGER BORINGS","FT",898,2,75,102.18]
[3,191.11,"CORE BORING","FT",15,1,80,76.67]
[3,193,"MOBILIZATION AND DISMANTLING OF BORING EQUIPMENT","LS",3,1,2600,2366.67]
[3,201,"CATCH BASIN","EA",1794,10,4725,4559.9799999999996]
[3,201.3,"SPECIAL CATCH BASIN","EA",1094,5,5000,5180.2700000000004]
[3,202,"MANHOLE","EA",2141,16,4500,4610.54]
[3,202.2,"MANHOLE (9 TO 14 FOOT DEPTH)","EA",50,2,6000,6561.81]
[3,203,"SPECIAL MANHOLE","EA",78,2,6000,5987.5]
[3,204,"GUTTER INLET","EA",370,6,2400,2274.19]
[3,204.11,"GUTTER INLET - SPECIAL","EA",216,2,2500,2439.58]
[3,205,"LEACHING BASIN","EA",89,3,7000,7831.52]
[3,206.1,"DROP INLET, TYPE AF","EA",30,1,3600,3233.33]
[3,208,"DROP INLET, TYPE C","EA",5,1,3100,3240]
[3,209.1,"DROP INLET, TYPE DF","EA",14,1,3150,3292.86]
[3,209.2,"SPECIAL DROP INLET","EA",36,2,5000,4850]
[3,209.3,"DROP INLET CHANGE IN TYPE","EA",45,2,1900,1903.33]
[3,210,"SANITARY SEWER MANHOLE","EA",5,1,7125,7625]
[3,210.02,"SANITARY SEWER MANHOLE REMOVED","EA",20,1,1950,2125]
[3,210.2,"SANITARY SEWER MANHOLE (9 TO 14 FOOT DEPTH)","EA",28,1,10000,10442.86]
[3,220,"DRAINAGE STRUCTURE ADJUSTED","EA",10984,19,400,398.13]
[3,220.2,"DRAINAGE STRUCTURE REBUILT","FT",4719,11,400,419.46]
[3,220.3,"DRAINAGE STRUCTURE CHANGE IN TYPE","EA",305,11,1000,1067.03]
[3,220.5,"DRAINAGE STRUCTURE REMODELED","EA",587,11,800,761.01]
[3,220.6,"SANITARY STRUCTURE REBUILT","FT",35,1,435,460]
[3,220.7,"SANITARY STRUCTURE ADJUSTED","EA",2187,14,407.5,417.41]
[3,220.8,"SANITARY STRUCTURE REMODELED","EA",178,4,900,868.7]
[3,221,"FRAME AND COVER","EA",2166,11,860,833.13]
[3,221.1,"FRAME AND COVER - SECURED","EA",1308,10,612.5,691.15]
[3,222,"FRAME AND GRATE - MASSDOT BAR TYPE","EA",1571,7,627.23,593.59]
[3,222.1,"FRAME AND GRATE - MASSDOT CASCADE TYPE","EA",4082,12,952.5,933.45]
[3,222.2,"FRAME AND GRATE - MASSDOT DROP INLET","EA",89,4,850,855.8]
[3,222.3,"FRAME AND GRATE (OR COVER) MUNICIPAL STANDARD","EA",3556,6,850,861.86]
[3,222.4,"LARGE HOOK LOCK BAR GRATE â€“ FURNISHED AND INSTALLED","EA",1558,7,1500,1633.34]
[3,223.1,"FRAME AND GRATE (OR COVER) REMOVED AND STACKED","EA",274,4,90,73.61]
[3,223.2,"FRAME AND GRATE (OR COVER) REMOVED AND DISCARDED","EA",4034,16,75,73.56]
[3,224.1,"10 INCH HOOD","EA",9,1,500,456.67]
[3,224.12,"12 INCH HOOD","EA",2573,7,450,453.24]
[3,224.15,"15 INCH HOOD","EA",30,1,687.5,729.17]
[3,224.18,"18 INCH HOOD","EA",12,1,1050,1009.33]
[3,227.3,"REMOVAL OF DRAINAGE STRUCTURE SEDIMENT","CY",9971,21,250,242.18]
[3,227.31,"REMOVAL OF DRAINAGE PIPE SEDIMENT","FT",671851,18,6.5,6.48]
[3,227.4,"MASONRY PLUG","SF",717,9,100,88.56]
[3,230.11199999999999,"12 INCH CORRUGATED METAL PIPE 16 GAGE","FT",1575,1,62,59.14]
[3,232.4,"43 X 27 INCH ACCM PIPE-ARCH 12 GAGE","FT",350,1,425,359.29]
[3,232.5,"50 X 31 INCH ACCM PIPE-ARCH 12 GAGE","FT",246,1,392.5,372.5]
[3,234.12,"12 INCH DRAINAGE PIPE - OPTION","FT",36300,5,100,106.58]
[3,234.15,"15 INCH DRAINAGE PIPE - OPTION","FT",2880,4,110,105.68]
[3,234.18,"18 INCH DRAINAGE PIPE - OPTION","FT",3860,3,115,113.45]
[3,234.24,"24 INCH DRAINAGE PIPE - OPTION","FT",1260,2,133,135.66999999999999]
[3,234.3,"30 INCH DRAINAGE PIPE - OPTION","FT",460,1,156.5,153.25]
[3,234.36,"36 INCH DRAINAGE PIPE - OPTION","FT",700,1,160,160]
[3,235.12,"12 INCH DRAINAGE PIPE FLARED END - OPTION","EA",53,2,1225,1131.25]
[3,235.15,"15 INCH DRAINAGE PIPE FLARED END - OPTION","EA",31,3,1250,1299.83]
[3,235.18,"18 INCH DRAINAGE PIPE FLARED END - OPTION","EA",35,3,1325,1516.18]
[3,235.24,"24 INCH DRAINAGE PIPE FLARED END - OPTION","EA",18,2,1762.5,1691.67]
[3,235.3,"30 INCH DRAINAGE PIPE FLARED END - OPTION","EA",12,1,1350,1166.67]
[3,235.36,"36 INCH DRAINAGE PIPE FLARED END - OPTION","EA",9,1,1500,1333.33]
[3,238.1,"10 INCH DUCTILE IRON PIPE","FT",7250,7,140,138.34]
[3,238.12,"12 INCH DUCTILE IRON PIPE","FT",14420,6,150,151.38]
[3,238.16,"16 INCH DUCTILE IRON PIPE","FT",755,2,250,237.55]
[3,238.24,"24 INCH DUCTILE IRON PIPE","FT",1040,1,246,251.13]
[3,241.12,"12 INCH REINFORCED CONCRETE PIPE","FT",64107,10,106.5,107.21]
[3,241.15,"15 INCH REINFORCED CONCRETE PIPE","FT",13700,6,117.5,111.26]
[3,241.18,"18 INCH REINFORCED CONCRETE PIPE","FT",22089,6,110,107.5]
[3,241.24,"24 INCH REINFORCED CONCRETE PIPE","FT",8700,3,156,151.25]
[3,241.48,"48 INCH REINFORCED CONCRETE PIPE","FT",240,1,222.5,218.75]
[3,242.12,"12 INCH REINFORCED CONCRETE PIPE FLARED END","EA",57,4,1300,1271.2]
[3,242.15,"15 INCH REINFORCED CONCRETE PIPE FLARED END","EA",21,1,1150,1085.8599999999999]
[3,242.18,"18 INCH REINFORCED CONCRETE PIPE FLARED END","EA",34,2,1400,1308.6500000000001]
[3,242.48,"48 INCH REINFORCED CONCRETE PIPE FLARED END","EA",12,1,2100,2075]
[3,243.12,"12 INCH REINFORCED CONCRETE PIPE CLASS IV","FT",18960,2,115,121.42]
[3,244.12,"12 INCH REINFORCED CONCRETE PIPE CLASS V","FT",31512,5,104.5,110.56]
[3,244.15,"15 INCH REINFORCED CONCRETE PIPE CLASS V","FT",3860,2,112,110.31]
[3,244.18,"18 INCH REINFORCED CONCRETE PIPE CLASS V","FT",25690,3,115,128]
[3,244.24,"24 INCH REINFORCED CONCRETE PIPE CLASS V","FT",15220,3,130,140.16999999999999]
[3,250.06,"6 INCH POLYVINYL CHLORIDE SANITARY SEWER PIPE","FT",300,1,150,141.33000000000001]
[3,250.08,"8 INCH POLYVINYL CHLORIDE SANITARY SEWER PIPE","FT",820,3,152,157.22999999999999]
[3,252.11199999999999,"12 INCH CORRUGATED PLASTIC PIPE FLARED END","EA",22,2,900,847.55]
[3,252.11500000000001,"15 INCH CORRUGATED PLASTIC PIPE FLARED END","EA",12,1,1200,1291.67]
[3,252.12,"12 INCH CORRUGATED PLASTIC PIPE","FT",670,2,85.5,86.99]
[3,252.15,"15 INCH CORRUGATED PLASTIC PIPE","FT",225,1,100,101.67]
[3,252.3,"30 INCH CORRUGATED PLASTIC PIPE","FT",225,1,180,185]
[3,252.36,"36 INCH CORRUGATED PLASTIC PIPE","FT",180,1,292.5,280.83]
[3,252.48,"48 INCH CORRUGATED PLASTIC PIPE","FT",168,1,435.5,464.43]
[3,258,"STONE FOR PIPE ENDS","SY",7008,14,92,88.34]
[3,261.12,"12 INCH PERFORATED CORRUGATED METAL PIPE-16 GAGE (SUBDRAIN)","FT",1350,1,72,71.78]
[3,265.08,"8 INCH PIPE SUBDRAIN - OPTION","FT",660,1,50,51.17]
[3,269.08,"8 INCH SLOT-PERFORATED CORRUGATED PLASTIC PIPE (SUBDRAIN)","FT",2270,2,55,53.89]
[3,280,"HOT MIX ASPHALT WATERWAY","SY",970,3,125,164.51]
[3,281,"CEMENT CONCRETE PAVING (WATERWAY)","SY",225,1,146,134.4]
[3,281.2,"JUTE MESH (WATERWAYS)","SY",320,1,10,8.3800000000000008]
[3,302.06,"6 INCH DUCTILE IRON WATER PIPE (RUBBER GASKET)","FT",140,1,150,138.57]
[3,302.08,"8 INCH DUCTILE IRON WATER PIPE (RUBBER GASKET)","FT",160,1,145,151.25]
[3,302.12,"12 INCH DUCTILE IRON WATER PIPE (RUBBER GASKET)","FT",1400,1,155,164.29]
[3,303.06,"6 INCH DUCTILE IRON WATER PIPE (MECHANICAL JOINT)","FT",4950,5,150,145.86000000000001]
[3,303.08,"8 INCH DUCTILE IRON WATER PIPE (MECHANICAL JOINT)","FT",5540,4,152.5,162.44999999999999]
[3,303.12,"12 INCH DUCTILE IRON WATER PIPE (MECHANICAL JOINT)","FT",4740,2,190,186.56]
[3,309,"DUCTILE IRON FITTINGS FOR WATER PIPE","LB",68500,9,6,6.48]
[3,325.2,"20 INCH STEEL PIPE CASING FOR WATER PIPE","FT",96,1,400,366.67]
[3,347.07499999999999,"3/4 INCH COPPER TUBING TYPE K","FT",490,1,89.5,87.71]
[3,347.1,"1 INCH COPPER TUBING TYPE K","FT",1270,5,92.5,96.86]
[3,347.125,"1-1/4 INCH COPPER TUBING TYPE K","FT",420,1,90.5,85.17]
[3,347.15,"1-1/2 INCH COPPER TUBING TYPE K","FT",420,1,94,86.67]
[3,347.2,"2 INCH COPPER TUBING TYPE K","FT",420,1,105,92.83]
[3,349.06,"6 INCH GATE VALVE","EA",24,1,1975,1858.33]
[3,349.12,"12 INCH GATE VALVE","EA",7,1,3900,3785.71]
[3,350.06,"6 INCH GATE AND GATE BOX","EA",85,4,2000,1948.62]
[3,350.08,"8 INCH GATE AND GATE BOX","EA",36,3,2850,2777.1]
[3,350.12,"12 INCH GATE AND GATE BOX","EA",24,2,3500,3345]
[3,357.06,"6 INCH GATE BOX","EA",165,4,500,382.95]
[3,357.08,"8 INCH GATE BOX","EA",50,1,375,344]
[3,357.1,"10 INCH GATE BOX","EA",50,1,400,358]
[3,357.12,"12 INCH GATE BOX","EA",116,2,440,421.54]
[3,358,"GATE BOX ADJUSTED","EA",3011,13,250,245.85]
[3,358.1,"GATE BOX REMOVED AND STACKED","EA",6,1,200,199.17]
[3,363.07499999999999,"3/4 INCH CORPORATION COCK","EA",15,1,625,708.33]
[3,363.1,"1 INCH CORPORATION COCK","EA",45,4,500,469.59]
[3,363.125,"1-1/4 INCH CORPORATION COCK","EA",20,1,825,950]
[3,363.15,"1-1/2 INCH CORPORATION COCK","EA",20,1,850,975]
[3,363.17500000000001,"1-3/4 INCH CORPORATION COCK","EA",20,1,1050,1125]
[3,363.2,"2 INCH CORPORATION COCK","EA",15,1,1062.5,1141.67]
[3,367.12,"12 INCH CAST IRON PLUG","EA",12,1,1437.5,1320.83]
[3,369.06,"6 X 6 INCH TAPPING SLEEVE, VALVE AND BOX","EA",6,1,7250,6866.67]
[3,369.08,"8 X 8 INCH TAPPING SLEEVE, VALVE AND BOX","EA",6,1,8750,8058.33]
[3,370.4,"12 X 6 INCH TAPPING SLEEVE, VALVE AND BOX","EA",14,1,10000,9950]
[3,371.06,"6 INCH COUPLING","EA",144,1,675,700]
[3,371.08,"8 INCH COUPLING","EA",18,1,975,900]
[3,371.12,"12 INCH COUPLING","EA",49,1,1100,1074.29]
[3,373.08,"8 INCH WATER PIPE INSULATION","FT",1688,2,90,99.38]
[3,375.06,"6 INCH INSERTION VALVE AND BOX","EA",54,2,10000,11767.86]
[3,375.08,"8 INCH INSERTION VALVE AND BOX","EA",7,1,12500,12428.57]
[3,375.12,"12 INCH INSERTION VALVE AND BOX","EA",16,1,19500,18589.5]
[3,376.1,"HYDRANT - EXCLUDING COST OF HYDRANT","EA",45,2,2800,2666.67]
[3,376.2,"HYDRANT - REMOVED AND RESET","EA",244,7,3000,2745.1]
[3,376.3,"HYDRANT - REMOVED AND STACKED","EA",3,1,1500,1533.33]
[3,376.5,"HYDRANT - ADJUSTED","EA",66,5,1500,1440]
[3,381,"SERVICE BOX","EA",176,7,322.5,375.03]
[3,381.01,"SERVICE BOX (MUNICIPAL STANDARD)","EA",40,1,350,327.5]
[3,381.3,"SERVICE BOX ADJUSTED","EA",1251,6,160,162.69]
[3,384,"CURB STOP","EA",38,3,500,442.35]
[3,384.2,"CURB STOP BOX ADJUSTED","EA",180,1,162.5,141.66999999999999]
[3,402,"DENSE GRADED CRUSHED STONE FOR SUB-BASE","CY",92482,14,72,71.27]
[3,402.1,"DENSE GRADED CRUSHED STONE FOR SUB-BASE","TON",580,2,57.5,52.5]
[3,402.13,"PAVEMENT MILLING MULCH FOR SHOULDERS","FT",62230,4,6,6.92]
[3,403,"RECLAIMED PAVEMENT FOR BASE COURSE AND/OR SUB-BASE","SY",263300,4,5.75,5.47]
[3,403.1,"CRUSHED STONE FOR BLENDING","TON",3010,4,30,33.03]
[3,415.1,"PAVEMENT STANDARD MILLING","SY",1117670,7,7,6.09]
[3,415.2,"PAVEMENT FINE MILLING","SY",3290868,11,4.08,4.28]
[3,415.3,"PAVEMENT MICRO MILLING","SY",2363530,9,8,7.45]
[3,415.4,"BRIDGE PAVEMENT MILLING","SY",39500,1,12,11.8]
[3,431,"HIGH EARLY STRENGTH CEMENT CONCRETE BASE COURSE","SY",17720,8,55,58.16]
[3,440,"CALCIUM CHLORIDE FOR ROADWAY DUST CONTROL","LB",3202805,16,0.36,0.38]
[3,443,"WATER FOR ROADWAY DUST CONTROL","MGL",2608,14,60,58.6]
[3,450.22,"SUPERPAVE SURFACE COURSE â€“ 9.5 (SSC â€“ 9.5)","TON",4940,2,110,119.96]
[3,450.221,"SUPERPAVE SURFACE COURSE â€“ 9.5 POLYMER (SSC â€“ 9.5 - P)","TON",26110,4,125,125.66]
[3,450.23,"SUPERPAVE SURFACE COURSE - 12.5 (SSC - 12.5)","TON",169545,10,105,103.87]
[3,450.23099999999999,"SUPERPAVE SURFACE COURSE - 12.5 POLYMER (SSC - 12.5 - P)","TON",490455,9,115,116.43]
[3,450.24,"SUPERPAVE SURFACE COURSE â€“ 19.0 (SSC â€“ 19.0)","TON",480,1,133.5,145.88]
[3,450.31,"SUPERPAVE INTERMEDIATE COURSE - 12.5 (SIC -12.5)","TON",30590,5,112,118.91]
[3,450.31099999999998,"SUPERPAVE INTERMEDIATE COURSE - 12.5 POLYMER (SIC -12.5 - P)","TON",70,1,113,115.86]
[3,450.32,"SUPERPAVE INTERMEDIATE COURSE - 19.0 (SIC - 19.0)","TON",190117,14,120,120.74]
[3,450.32100000000003,"SUPERPAVE INTERMEDIATE COURSE - 19.0 POLYMER (SIC - 19.0 - P)","TON",47260,3,115,111.09]
[3,450.42,"SUPERPAVE BASE COURSE - 37.5 (SBC - 37.5)","TON",236838,15,110,114.42]
[3,450.52,"SUPERPAVE LEVELING COURSE - 9.5 (SLC - 9.5)","TON",38250,2,95,94.8]
[3,450.6,"SUPERPAVE BRIDGE SURFACE COURSE - 9.5 (SSC-B - 9.5)","TON",5387,5,160,172.34]
[3,450.601,"SUPERPAVE BRIDGE SURFACE COURSE - 9.5 POLYMER (SSC-B - 9.5 - P)","TON",14060,6,240,236.18]
[3,450.61099999999999,"SUPERPAVE BRIDGE SURFACE COURSE - 12.5 POLYMER (SSC-B - 12.5 - P)","TON",102,1,180,170.83]
[3,450.7,"SUPERPAVE BRIDGE PROTECTIVE COURSE - 9.5 (SPC-B - 9.5)","TON",1857,5,190,180.28]
[3,450.70100000000002,"SUPERPAVE BRIDGE PROTECTIVE COURSE - 9.5 POLYMER (SPC-B - 9.5 - P)","TON",4200,3,272.5,259.89999999999998]
[3,450.71,"SUPERPAVE BRIDGE PROTECTIVE COURSE â€“ 12.5 (SPC-B - 12.5)","TON",1125,3,200,213.19]
[3,450.71100000000001,"SUPERPAVE BRIDGE PROTECTIVE COURSE â€“ 12.5POLYMER (SPC-B - 12.5 - P)","TON",600,1,317.5,317.5]
[3,451,"HMA FOR PATCHING","TON",30947,29,220,209.11]
[3,452,"ASPHALT EMULSION FOR TACK COAT","GAL",408215,25,7,7.17]
[3,453,"HMA JOINT SEALANT","FT",1498330,24,1,0.87]
[3,457.1,"SUPERPAVE WATERPROOFING SURFACE COURSE - 9.5 (SSC-W-9.5)","TON",10130,3,350,330.73]
[3,457.2,"SUPERPAVE WATERPROOFING SURFACE COURSE - 12.5 (SSC-W-12.5)","TON",9777,1,235,223.33]
[3,458.7,"LIGHTWEIGHT AGGREGATE","CY",9040,1,120,122.75]
[3,466,"STRESS ABSORBING MEMBRANE INTERLAYER","SY",150,1,360,402]
[3,470,"HOT MIX ASPHALT BERM","TON",378,4,263.25,267.17]
[3,472,"TEMPORARY ASPHALT PATCHING","TON",70628,26,200,204.83]
[3,476,"CEMENT CONCRETE PAVEMENT","SY",720,1,85,80]
[3,476.32,"POLYMER MODIFIED CONCRETE OVERLAYMENT","SY",9900,1,218,194.33]
[3,477,"MILLED RUMBLE STRIP (TYPE A)","FT",1710622,8,2.15,1.66]
[3,477.1,"MILLED RUMBLE STRIP (TYPE B)","FT",400,1,5.5,5.5]
[3,482.17,"HOT APPLIED RUBBERIZED ASPHALTIC CRACK FILLER","GAL",18790,1,25.1,25.1]
[3,482.3,"SAWCUTTING ASPHALT PAVEMENT","FT",68484,6,3,3.13]
[3,482.31,"SAWING & SEALING JOINTS IN ASPHALT PAVEMENT AT BRIDGES","FT",12635,9,35,34.700000000000003]
[3,482.32,"SAWING AND SEALING JOINTS IN ASPHALT PAVEMENT","FT",2000,1,10,10]
[3,482.4,"SAWCUTTING PORTLAND CEMENT CONCRETE","FT",2350,4,6,10.210000000000001]
[3,482.5,"SAWCUTTING ASPHALT PAVEMENT FOR BOX WIDENING","FT",80335,6,3,2.69]
[3,503,"GRANITE CURB TYPE VA3 - STRAIGHT","FT",7580,6,51.5,54.4]
[3,503.1,"GRANITE CURB TYPE VA3 - CURVED","FT",655,3,59.75,61.69]
[3,504.2,"GRANITE CURB TYPE VA4 - SPLAYED END","EA",36,1,415,416.33]
[3,505,"GRANITE CURB TYPE VA5 - STRAIGHT","FT",8320,9,56.5,57.58]
[3,506,"GRANITE CURB TYPE VB - STRAIGHT","FT",409225,16,42,42.46]
[3,506.1,"GRANITE CURB TYPE VB - CURVED","FT",42020,12,51,52.49]
[3,509,"GRANITE TRANSITION CURB FOR PEDESTRIAN CURB RAMPS - STRAIGHT","FT",65831,16,50,52.02]
[3,509.1,"GRANITE TRANSITION CURB FOR PEDESTRIAN CURB RAMPS - CURVED","FT",26184,15,55,58.88]
[3,511.1,"GRANITE EDGING TYPE SB - STRAIGHT","FT",25612,9,40,38.700000000000003]
[3,512.1,"GRANITE EDGING TYPE SB (RADIUS 10 FEET OR LESS)","FT",950,4,43,43.7]
[3,514,"GRANITE CURB INLET - STRAIGHT","EA",2561,14,440,434.5]
[3,515,"GRANITE CURB INLET - CURVED","EA",251,5,510,512.73]
[3,516,"GRANITE CURB CORNER TYPE A","EA",897,5,300,290.5]
[3,517,"GRANITE CURB CORNER TYPE B","EA",56,2,450,413.33]
[3,520,"CONCRETE CURB TYPE VA","FT",240,1,45,45.08]
[3,570,"HOT MIX ASPHALT CURB - OPTION","FT",11170,3,22.5,18.79]
[3,570.20000000000005,"HOT MIX ASPHALT CURB TYPE 2","FT",28710,4,14.5,11.98]
[3,570.29999999999995,"HOT MIX ASPHALT CURB TYPE 3","FT",9518,4,9,10.18]
[3,580,"CURB REMOVED AND RESET","FT",131885,16,26,26.95]
[3,580.1,"CURB REMOVED, RELOCATED AND RESET","FT",12000,1,28.5,28.63]
[3,581,"CURB INLET REMOVED AND RESET","EA",827,5,225,231.26]
[3,582,"CURB CORNER REMOVED AND RESET","EA",196,1,125,111.29]
[3,583,"EDGING REMOVED AND RESET","FT",33850,12,30,29.23]
[3,594,"CURB REMOVED AND DISCARDED","FT",120240,10,6.5,6.18]
[3,595,"CURB INLET REMOVED AND DISCARDED","EA",220,5,80,74.930000000000007]
[3,596,"CURB CORNER REMOVED AND DISCARDED","EA",97,3,50,61.63]
[3,597,"EDGING REMOVED AND DISCARDED","FT",26100,9,6.35,5.97]
[3,620.12,"GUARDRAIL, TL-2 (SINGLE FACED)","FT",73332,12,30,30.96]
[3,620.13,"GUARDRAIL, TL-3 (SINGLE FACED)","FT",443386,13,30.45,30.76]
[3,620.32000000000005,"GUARDRAIL - CURVED, TL-2 (SINGLE FACED)","FT",4820,7,35,37.770000000000003]
[3,620.33000000000004,"GUARDRAIL - CURVED, TL-3 (SINGLE FACED)","FT",4664,2,35,34.590000000000003]
[3,621.13,"GUARDRAIL, TL-3 (DOUBLE FACED)","FT",2810,2,50,49.9]
[3,627.1,"TRAILING ANCHORAGE","EA",816,19,1850,1886.9]
[3,627.73,"GUARDRAIL END TREATMENT, TL-3 (DOUBLE FACED)","EA",19,2,11000,11793.18]
[3,627.82000000000005,"GUARDRAIL TANGENT END TREATMENT, TL-2","EA",357,10,4200,4271.5200000000004]
[3,627.83000000000004,"GUARDRAIL TANGENT END TREATMENT, TL-3","EA",462,12,4200,4314.04]
[3,627.91999999999996,"GUARDRAIL FLARED END TREATMENT, TL-2","EA",27,2,4000,4072.89]
[3,627.92999999999995,"GUARDRAIL FLARED END TREATMENT, TL-3","EA",40,4,4200,4361]
[3,628.21,"TRANSITION TO NCHRP 350 GUARDRAIL","EA",218,11,1800,1820.1]
[3,628.22,"TRANSITION TO RIGID BARRIER (SINGLE FACED)","EA",117,5,5000,4958.91]
[3,628.23,"TRANSITION TO RIGID BARRIER (DOUBLE FACED)","EA",18,1,7000,7361.11]
[3,628.24,"TRANSITION TO BRIDGE RAIL","EA",533,12,4500,4528.46]
[3,628.25,"TRANSITION TO THRIE BEAM","EA",49,3,600,621.71]
[3,628.32000000000005,"IMPACT ATTENUATOR FOR SHOULDER, CAPABLE OF REDIRECTION","EA",24,1,29000,24825]
[3,628.34,"IMPACT ATTENUATOR FOR MEDIAN, CAPABLE OF REDIRECTION","EA",18,1,45000,44677.78]
[3,629.1,"PRECAST CONCRETE BARRIER - SINGLE FACED","FT",3360,3,135,136.29]
[3,629.20000000000005,"PRECAST CONCRETE MEDIAN BARRIER - DOUBLE FACED","FT",9285,3,138,144.08000000000001]
[3,629.4,"CAST-IN-PLACE CONCRETE MEDIAN BARRIER - DOUBLE FACED","FT",390,2,712.5,708.33]
[3,629.5,"CAST-IN-PLACE MEDIAN BARRIER CAP","CY",56,1,900,848.13]
[3,630,"HIGHWAY GUARD REMOVED AND RESET","FT",36110,11,23,23.01]
[3,630.1,"HIGHWAY GUARD REMOVED AND STACKED","FT",720,1,9.35,8.92]
[3,630.20000000000005,"HIGHWAY GUARD REMOVED AND DISCARDED","FT",582589,21,6,5.85]
[3,632,"GUARDRAIL POST - STEEL","EA",1400,5,130,126.07]
[3,632.20000000000005,"INDIVIDUAL POST REMOVED AND RESET","EA",180,1,72.5,69.17]
[3,632.4,"INDIVIDUAL POST REMOVED AND DISCARDED","EA",650,2,26.5,29.67]
[3,633,"GUARDRAIL OFFSET BLOCK - W BEAM","EA",470,2,24,23.57]
[3,633.1,"GUARDRAIL OFFSET BLOCK - THRIE BEAM","EA",700,2,40,36.57]
[3,634,"W BEAM GUARD PANEL","EA",550,4,232.5,228.55]
[3,634.1,"THRIE BEAM GUARD PANEL","EA",700,2,350,333.41]
[3,638.1,"PROTECTIVE SCREEN (CHAIN LINK)","FT",2460,1,130,135.33000000000001]
[3,644.048,"48 INCH CHAIN LINK FENCE (SPRING TENSION WIRE) (LINE POST OPTION)","FT",2000,1,43.13,46.56]
[3,644.072,"72 INCH CHAIN LINK FENCE (SPRING TENSION WIRE) (LINE POST OPTION)","FT",480,1,40.950000000000003,41.24]
[3,644.14800000000002,"48 INCH CHAIN LINK FENCE (SPRING TENSION WIRE) VINYL COATED (LINE POST OPTION)","FT",1680,2,50,53.12]
[3,644.16,"60 INCH CHAIN LINK FENCE (SPRING TENSION WIRE) VINYL COATED (LINE POST OPTION)","FT",1150,1,47.25,52.45]
[3,645.14800000000002,"48 INCH CHAIN LINK FENCE (PIPE TOP RAIL) VINYL COATED (LINE POST OPTION)","FT",1000,1,50.5,50.13]
[3,650.072,"72 INCH CHAIN LINK GATE WITH GATE POSTS","FT",120,1,200,233.33]
[3,652.048,"48 INCH CHAIN LINK FENCE END POST","EA",40,2,250,347.27]
[3,652.072,"72 INCH CHAIN LINK FENCE END POST","EA",36,1,237.5,233.33]
[3,653.048,"48 INCH CHAIN LINK FENCE CORNER OR INTERMEDIATE BRACE POST","EA",36,1,432.5,382.5]
[3,654.14400000000001,"144 INCH CHAIN LINK FENCE FABRIC","FT",100,1,200,186.25]
[3,657,"TEMPORARY FENCE","FT",86945,10,19,18.239999999999998]
[3,657.5,"TEMPORARY FENCE REMOVED AND RESET","FT",44320,6,12,13.01]
[3,660,"METAL PIPE RAIL","FT",370,2,300,325.5]
[3,666,"CHAIN LINK FENCE REMOVED AND RESET","FT",2980,4,49,49.25]
[3,669,"FENCE REMOVED AND STACKED","FT",8970,4,12,13.86]
[3,670,"FENCE REMOVED AND RESET","FT",7790,6,54,50.85]
[3,672,"FENCE GATE AND GATE POSTS REMOVED AND RESET","EA",10,1,2500,2625]
[3,685,"STONE MASONRY WALL IN CEMENT MORTAR","CY",4375,3,800,780]
[3,690,"STONE MASONRY WALL REMOVED AND REBUILT IN CEMENT MORTAR","CY",794,2,850,842.33]
[3,690.1,"STONE MASONRY WALL REMOVED AND REBUILT DRY","CY",183,2,700,705.47]
[3,697,"SEDIMENTATION FENCE","FT",963,2,8,8.0299999999999994]
[3,697.1,"SILT SACK","EA",6180,20,190,185.42]
[3,697.2,"FLOATING SILT FENCE","FT",3600,1,28,26.03]
[3,698.1,"GEOTEXTILE FABRIC FOR STABILIZATION","SY",2450,3,6,5.56]
[3,698.2,"GEOTEXTILE FABRIC FOR SUBSURFACE DRAINAGE","SY",180,1,10,9]
[3,698.3,"GEOTEXTILE FABRIC FOR SEPARATION","SY",44935,8,6,6.26]
[3,698.4,"GEOTEXTILE FABRIC FOR PERMANENT EROSION CONTROL","SY",18285,8,6,5.59]
[3,701,"CEMENT CONCRETE SIDEWALK","SY",287009,19,56.13,59.24]
[3,701.1,"CEMENT CONCRETE SIDEWALK AT DRIVEWAYS","SY",89130,13,70,67.34]
[3,701.2,"CEMENT CONCRETE PEDESTRIAN CURB RAMP","SY",33939,18,95,93.23]
[3,702,"HOT MIX ASPHALT SIDEWALK OR DRIVEWAY","TON",37028,17,200,207.63]
[3,704.1,"STONE DUST FOR DRIVEWAYS","TON",90,1,65,58.33]
[3,705.1,"FLAGSTONE WALK REMOVED AND RESET","SY",45,3,325,314.70999999999998]
[3,706,"BRICK WALK","SY",79,2,275,271.14999999999998]
[3,706.1,"BRICK WALK REMOVED AND RELAID","SY",405,4,250,262.27]
[3,706.6,"GRANITE SLAB WALK REMOVED AND RESET","SY",140,1,250,240]
[3,707.1,"PARK BENCH","EA",198,2,2300,2400.89]
[3,707.15,"PARK BENCH REMOVED AND RESET","EA",35,1,750,758]
[3,707.2,"TRASH RECEPTACLE","EA",22,2,2325,2126]
[3,707.8,"STEEL BOLLARD","EA",146,3,1233.75,1151.71]
[3,707.9,"BICYCLE RACK","EA",84,2,1012.5,960.71]
[3,710.3,"BOUND - LETTERED GRANITE","EA",43,2,600,576.55999999999995]
[3,710.4,"BOUND - PLAIN GRANITE","EA",503,2,600,636.76]
[3,711,"BOUND REMOVED AND RESET","EA",271,5,525,511.94]
[3,712,"BOUND REMOVED AND STACKED","EA",52,3,237.5,240.17]
[3,714,"MONUMENT REMOVED AND RESET","EA",4,1,4600,4500]
[3,715,"RURAL MAIL BOX REMOVED AND RESET","EA",419,10,200,205.22]
[3,715.1,"MAIL BOX REMOVED AND RESET","EA",190,2,217.5,162]
[3,718,"FLAGPOLE","EA",24,1,5000,4696.88]
[3,740,"ENGINEERS FIELD OFFICE AND EQUIPMENT (TYPE A)","MO",3947,28,3000,2969.44]
[3,748,"MOBILIZATION","LS",107,26,100000,94833.07]
[3,748.1,"EMERGENCY RESPONSE","EA",77,6,500,578.87]
[3,751,"LOAM BORROW","CY",104992,24,55,55.96]
[3,751.7,"COMPOST TOPDRESSING","SY",5850,2,10,8.52]
[3,752,"TOPSOIL REHANDLED AND SPREAD","CY",2940,1,30,29.71]
[3,755.35,"INLAND WETLAND REPLICATION AREA","LS",7,1,47500,40142.86]
[3,755.75,"WETLAND SPECIALIST","HR",240,1,330,341.33]
[3,755.76,"WETLANDS MONITORING REPORTS","LS",6,1,9250,9083.33]
[3,756,"NPDES STORMWATER POLLUTION PREVENTION PLAN","LS",68,15,6000,4968.1499999999996]
[3,760,"IMPERVIOUS SOIL BORROW","CY",30,1,110,123.33]
[3,765,"SEEDING","SY",538603,23,2,1.89]
[3,765.2,"SEED FOR EROSION CONTROL","LB",272,2,72.5,63.14]
[3,767.12099999999998,"SEDIMENT CONTROL BARRIER","FT",717265,25,6,6.37]
[3,767.2,"HAY MULCH","SY",3750,1,1.7,1.47]
[3,767.31,"STRAW MULCH","SY",135870,3,2,1.64]
[3,767.4,"WOOD CHIP MULCH","CY",18,1,90,90]
[3,767.6,"AGED PINE BARK MULCH","CY",1175,6,70,69.41]
[3,767.8,"BALES OF HAY FOR EROSION CONTROL","EA",1050,1,7.5,7.5]
[3,767.9,"JUTE MESH","SY",31610,2,6,5.68]
[3,769,"PAVEMENT MILLING MULCH UNDER GUARD RAIL","FT",625767.17000000004,19,7.5,7.86]
[3,773.22400000000005,"PINE - PITCH 4-5 FEET","EA",16,1,392.5,359.88]
[3,773.43600000000004,"PINE - WHITE 5-6 FEET","EA",74,2,400,390.25]
[3,774.04100000000005,"SPRUCE - COLORADO GREEN 8-10 FEET","EA",9,1,850,841.06]
[3,775.03499999999997,"HOPHORNBEAM - AMERICAN 2-2.5 INCH CALIPER","EA",24,1,737.5,735.63]
[3,775.14,"LINDEN - AMERICAN 2-2.5 INCH CALIPER","EA",8,1,770,735]
[3,775.43100000000004,"LOCUST - HONEY - 'SHADEMASTER' 2-2.5 INCH CALIPER","EA",80,1,645,651.25]
[3,775.43399999999997,"LOCUST - HONEY - 'SHADEMASTER' 3-3.5 INCH CALIPER","EA",22,1,1000,1031.3599999999999]
[3,776.52300000000002,"MAPLE - RED - 'ARMSTRONG' 2-2.5 INCH CALIPER","EA",40,1,645,667.75]
[3,776.54300000000001,"MAPLE - RED - 'OCTOBER GLORY' 2-2.5 INCH CALIPER","EA",70,2,695,720.26]
[3,776.83600000000001,"MAPLE - SUGAR 2-2.5 INCHES CALIPER","EA",33,1,725,747.27]
[3,776.851,"MAPLE - SUGAR - 'LEGACY' 2-2.5 INCH CALIPER","EA",40,1,656.25,685.25]
[3,777.03599999999994,"OAK - NORTHERN RED 2-2.5 INCH CALIPER","EA",36,2,700,699.61]
[3,777.13800000000003,"OAK - PIN 2-2.5 INCH CALIPER","EA",27,1,700,689.44]
[3,777.26099999999997,"OAK - SWAMP WHITE 1.5-2 INCH CALIPER","EA",72,1,525,472.63]
[3,777.673,"SWEETGUM 2-2.5 INCH CALIPER","EA",163,2,650,657.27]
[3,778.37300000000005,"CHERRY - SARGENT 1.5-2 INCH CALIPER","EA",20,1,420,474.6]
[3,778.37699999999995,"CHERRY - SARGENT 2.5-3 INCH CALIPER","EA",14,1,825,774.29]
[3,778.47299999999996,"CRABAPPLE - 'ZUMI' 1.5-2 INCH CALIPER","EA",24,1,367.5,368.13]
[3,781.17100000000005,"HACKBERRY TREE 1.5-2 INCH CALIPER","EA",8,1,487.5,447]
[3,781.26700000000005,"HAWTHORN - 'WINTER KING' 2.5-3 INCH CALIPER","EA",40,1,750,736.75]
[3,782.423,"PEAR - CALLERY - 'CHANTICLEER' 2-2.5 INCH CALIPER","EA",72,1,532.5,544.38]
[3,783.04499999999996,"SHAD TREE - DOWNY 6-8 FEET","EA",119,1,472.5,429.86]
[3,783.04899999999998,"SHAD TREE - DOWNY 2-2.5 INCH CALIPER","EA",85,1,682.5,706.5]
[3,783.64700000000005,"ZELKOVA - 'VILLAGE GREEN' 2.5-3 INCH CALIPER","EA",72,1,750,741.06]
[3,785.58699999999999,"HOLLY - JAPANESE - 'HETZ' 24-30 INCH","EA",32,1,107.5,107.5]
[3,785.73299999999995,"INKBERRY - COMPACT 24-30 INCH","EA",48,1,70,71]
[3,786.03099999999995,"JUNIPER - ANDORRA 18-24 INCH","EA",496,1,64.5,67]
[3,794.80499999999995,"SWEETFERN 2 GALLON","EA",264,1,27.5,29.06]
[3,796.423,"DWARF FOUNTAIN GRASS - 'HAMELN' 1 GALLON","EA",5580,1,19,19.53]
[3,796.42700000000002,"FEATHER REED GRASS 2 GALLON","EA",180,1,30,30.44]
[3,796.76300000000003,"DAYLILY - 'STELLA D'ORO' 1 GALLON","EA",4320,1,19,18.54]
[3,801.42,"4 INCH ELECTRICAL CONDUIT - TYPE NM (DOUBLE)","FT",21000,1,105,108.14]
[3,801.44,"4 INCH ELECTRICAL CONDUIT - TYPE NM (4 BANK)","FT",5600,1,130,126.14]
[3,801.46,"4 INCH ELECTRICAL CONDUIT - TYPE NM (6 BANK)","FT",27000,1,145,139.88999999999999]
[3,804.1,"1 INCH ELECTRICAL CONDUIT TYPE NM - PLASTIC -(UL)","FT",1750,1,40,37.43]
[3,804.2,"2 INCH ELECTRICAL CONDUIT TYPE NM - PLASTIC (UL)","FT",10525,5,37,37.770000000000003]
[3,804.3,"3 INCH ELECTRICAL CONDUIT TYPE NM - PLASTIC -(UL)","FT",260650,10,38,36.03]
[3,804.4,"4 INCH ELECTRICAL CONDUIT TYPE NM - PLASTIC -(UL)","FT",50950,3,38,40.630000000000003]
[3,806.3,"3 INCH ELECTRICAL CONDUIT TYPE RM - GALVANIZED STEEL","FT",2500,2,65,83.81]
[3,806.4,"4 INCH ELECTRICAL CONDUIT TYPE RM - GALVANIZED STEEL","FT",3600,1,82,83.25]
[3,810,"CONDUIT ENCASED IN CONCRETE - SD 4.041","FT",2400,1,65,67.38]
[3,811.1,"ELECTRIC MANHOLE - SD2.010","EA",54,1,2850,2827.78]
[3,811.21,"ELECTRIC HANDHOLE - SD2.021","EA",14,1,1100,1250]
[3,811.22,"ELECTRIC HANDHOLE - SD2.022","EA",405,5,1200,1216.6199999999999]
[3,811.24,"ELECTRIC HANDHOLE - SD2.024","EA",88,1,1650,1693.75]
[3,811.27,"ELECTRIC HANDHOLE - (MUNICIPAL STANDARD)","EA",1520,3,1400,1287.73]
[3,811.31,"PULL BOX 12 X 12 INCHES - SD2.031","EA",1044,8,950,911.67]
[3,811.35,"PULL BOX ADJUSTED","EA",54,2,228.89,216.88]
[3,811.36,"ELECTRIC MANHOLE ADJUSTED","EA",42,2,600,561]
[3,811.37,"ELECTRIC HANDHOLE ADJUSTED","EA",96,4,350,351.79]
[3,811.39,"ELECTRIC HANDHOLE REMOVED AND STACKED","EA",30,1,260,235]
[3,812.09,"LIGHT STANDARD FOUNDATION PRECAST","EA",733,3,1800,1864.23]
[3,812.13,"LIGHT STANDARD FOUNDATION SD3.013","EA",334,2,2950,2818.06]
[3,812.2,"LIGHTING LOAD CENTER FOUNDATION","EA",17,2,5500,5078.6400000000003]
[3,812.4,"SIGNAL MAST ARM FOUNDATION","EA",18,1,12000,12366.67]
[3,813.3,"WIRE TYPE 7 NO. 10 GENERAL PURPOSE","FT",400000,2,1.2,1.1599999999999999]
[3,813.32,"WIRE TYPE 7 NO. 6 GENERAL PURPOSE","FT",228890,2,1.91,1.93]
[3,813.33,"WIRE TYPE 7 NO. 4 GENERAL PURPOSE","FT",389390,2,2,2]
[3,813.34,"WIRE TYPE 7 NO. 2 GENERAL PURPOSE","FT",695200,1,2.56,2.5]
[3,813.35,"WIRE TYPE 7 NO. 1 GENERAL PURPOSE","FT",13800,2,4.5,4.43]
[3,813.4,"WIRE TYPE 8 NO. 10 DIRECT BURIAL","FT",93500,1,1.65,1.69]
[3,813.42,"WIRE TYPE 8 NO. 6 DIRECT BURIAL","FT",116550,1,2.1,2.0299999999999998]
[3,813.43,"WIRE TYPE 8 NO. 4 DIRECT BURIAL","FT",1082000,2,2.82,2.69]
[3,813.52,"WIRE TYPE 10 - #8 GROUNDING AND BONDING","FT",20000,1,2,1.88]
[3,813.53,"WIRE TYPE 11 - LOOP DETECTOR LEAD IN","FT",20000,1,2,2.13]
[3,813.6,"EQUIPMENT GROUNDING","LS",4,1,2000,1525]
[3,813.72,"GROUND ROD 10 FEET LONG","EA",347,2,150,168.53]
[3,813.79,"INTERCONNECT CABLE SYSTEM","LS",9,1,13975,14370.17]
[3,813.81,"SERVICE CONNECTION (UNDERGROUND)","LS",9,2,8000,7144.44]
[3,815.1,"TRAFFIC CONTROL SIGNAL LOCATION NO. 1","LS",8,1,267500,272125]
[3,815.2,"TRAFFIC CONTROL SIGNAL LOCATION NO. 2","LS",8,1,216500,235565]
[3,815.3,"TRAFFIC CONTROL SIGNAL LOCATION NO. 3","LS",8,1,187500,194125]
[3,815.98,"FOOTING COST ADJUSTMENT","FT",200,1,10,7]
[3,816.01,"TRAFFIC SIGNAL RECONSTRUCTION LOCATION NO. 1","LS",34,4,184500,182579.49]
[3,816.02,"TRAFFIC SIGNAL RECONSTRUCTION LOCATION NO. 2","LS",18,3,255000,275051.11]
[3,816.03,"TRAFFIC SIGNAL RECONSTRUCTION LOCATION NO. 3","LS",8,1,60000,59835.94]
[3,816.8,"TRAFFIC CONTROL SIGNAL REMOVED AND STACKED","LS",13,3,6250,5614.23]
[3,816.81,"TEMPORARY TRAFFIC CONTROL SIGNAL","LS",17,2,60000,57332.15]
[3,817.11,"SIGNAL POST AND BASE STANDARD - 10 FOOT","EA",60,1,625,615]
[3,817.61,"SIGNAL MAST ARM 25 FEET - STEEL","EA",2,1,4450,4450]
[3,817.62,"SIGNAL MAST ARM 30 FEET - STEEL","EA",20,2,12250,12923]
[3,817.63,"SIGNAL MAST ARM 35 FEET - STEEL","EA",4,1,6600,6600]
[3,817.64,"SIGNAL MAST ARM 40 FEET - STEEL","EA",8,1,7300,7300]
[3,817.65,"SIGNAL MAST ARM 45 FEET - STEEL","EA",8,1,7900,7900]
[3,817.66,"SIGNAL MAST ARM 50 FEET - STEEL","EA",4,1,8650,8650]
[3,817.67,"SIGNAL MAST ARM 55 FEET - STEEL","EA",2,1,10250,10250]
[3,817.68,"SIGNAL MAST ARM 60 FEET - STEEL","EA",2,1,11000,11000]
[3,818.11,"SIGNAL HEAD 1 WAY, ONE SECTION 12 INCH LENS","EA",40,1,292.5,277.5]
[3,818.13,"SIGNAL HEAD 1 WAY, THREE SECTION 12 INCH LENS","EA",160,1,837.5,797.5]
[3,818.14,"SIGNAL HEAD 1 WAY, FOUR SECTION 12 INCH LENS","EA",48,1,912.5,875]
[3,818.15,"SIGNAL HEAD 1 WAY, FIVE SECTION 12 INCH LENS","EA",40,1,937.5,925]
[3,819.83100000000002,"WIRE LOOP INSTALLED IN ROADWAY","FT",113800,5,11.87,12.52]
[3,821.12,"HIGHWAY LIGHTING POLE (ANCHOR BASE) 8 FOOT BRACKET","EA",108,1,6000,5756]
[3,823.6,"HIGHWAY LIGHTING LOAD CENTER","LS",7,1,23000,22317.14]
[3,823.61,"HIGHWAY LIGHTING LOAD CENTER NO.1","LS",15,2,18000,17889.330000000002]
[3,823.62,"HIGHWAY LIGHTING LOAD CENTER NO.2","LS",7,1,18750,18928.57]
[3,823.7,"HIGHWAY LIGHTING POLE AND LUMINAIRE REMOVED AND RESET","EA",7,1,2225,2396.4299999999998]
[3,823.71,"HIGHWAY LIGHTING POLE AND LUMINAIRE REMOVED AND STACKED","EA",272,2,700,661.67]
[3,827.21,"24 INCH WARNING CLUSTER (H1-2) - ALUMINUM PANEL (TYPE A)","EA",20,2,140,142]
[3,827.33,"ABUTMENT WARNING SIGN (H1-3) - ALUMINUM PANEL (TYPE A)","EA",18,1,160,158.33000000000001]
[3,828.02,"OVERHEAD GUIDE SIGN REMOVED AND STACKED","EA",8,1,1337.5,1337.5]
[3,828.1,"OVERHEAD GUIDE SIGN - ALUMINUM PANEL (TYPE B)","SF",904,2,30,28.5]
[3,829,"ROADSIDE GUIDE SIGN (G) - ALUMINUM PANEL (TYPE B)","SF",10371.5,5,25,25.74]
[3,831,"ROADSIDE GUIDE SIGN (D6/D8) - ALUMINUM PANEL (TYPE A)","SF",3200,2,24,23.58]
[3,832,"WARNING-REGULATORY AND ROUTE MARKER - ALUMINUM PANEL (TYPE A)","SF",39367,21,14,13.75]
[3,833.5,"DEMOUNTABLE REFLECTORIZED DELINEATOR - GUARD RAIL","EA",1887,6,7,7.11]
[3,833.7,"DELINEATION FOR GUARD RAIL TERMINI","EA",851,9,50,46.72]
[3,834,"DEMOUNTABLE REFLECTORIZED REFERENCE LOCATION SIGN","EA",686,6,155,159.22999999999999]
[3,834.17,"REFLECTORIZED FLEXIBLE DELINEATOR POST (AMBER)","EA",2894,6,40,41.46]
[3,834.18,"REFLECTORIZED FLEXIBLE DELINEATOR POST (WHITE)","EA",2866,4,39,41.38]
[3,836.5,"DEMOUNTABLE REFLECTORIZED STATION MARKER","EA",2214,5,45,45.04]
[3,841.1,"SUPPORTS FOR GUIDE SIGN (D6 W/ D8-5 INCH TUBULAR POST) STEEL","EA",82,2,1500,1549.31]
[3,841.2,"SUPPORTS FOR GUIDE SIGN (D6-5 INCH TUBULAR POST) STEEL","EA",8,1,1150,1150]
[3,841.6,"SUPPORTS FOR GUIDE SIGN (I-2A-5 INCH TUBULAR POST) STEEL","EA",8,1,1150,1150]
[3,844.101,"SUPPORTS FOR GUIDE SIGN (G1) STEEL","LS",6,1,4180,3746.67]
[3,844.10199999999998,"SUPPORTS FOR GUIDE SIGN (G2) STEEL","LS",6,1,4180,3746.67]
[3,844.10299999999995,"SUPPORTS FOR GUIDE SIGN (G3) STEEL","LS",6,1,4180,3746.67]
[3,844.10400000000004,"SUPPORTS FOR GUIDE SIGN (G4) STEEL","LS",6,1,4180,3746.67]
[3,844.10500000000002,"SUPPORTS FOR GUIDE SIGN (G5) STEEL","LS",6,1,4180,3746.67]
[3,846.1,"SUPPORT FOR GUIDE SIGN (E5-1A) STEEL","EA",12,1,4600,4116.67]
[3,847.1,"SIGN SUP (N/GUIDE)+RTE MKR W/1 BRKWAY POST ASSEMBLY - STEEL","EA",4810,20,145,146.21]
[3,848.1,"SIGN SUP (N/GUIDE)+RTE MKR W/2 BRKWAY POST ASSEMBLIES-STEEL","EA",485,5,260,261.05]
[3,850.41,"ROADWAY FLAGGER","HR",61404,22,50,58.91]
[3,851.1,"TRAFFIC CONES FOR TRAFFIC MANAGEMENT","DAY",5937,16,100,155.5]
[3,852,"SAFETY SIGNING FOR TRAFFIC MANAGEMENT","SF",164036,40,20,21.65]
[3,853.1,"PORTABLE BREAKAWAY BARRICADE TYPE III","EA",1279,18,125,119.6]
[3,853.2,"TEMPORARY BARRIER (TL-2)","FT",17570,6,47.75,46.26]
[3,853.21,"TEMPORARY BARRIER REMOVED AND RESET","FT",51870,14,15,14.72]
[3,853.23,"TEMPORARY BARRIER (TL-3)","FT",35510,8,54,52.07]
[3,853.33,"TEMPORARY BARRIER - LIMITED DEFLECTION (TL-3)","FT",54995,8,90,88.12]
[3,853.40300000000002,"TRUCK MOUNTED ATTENUATOR","DAY",24600,24,110,104.79]
[3,853.42,"TEMPORARY IMPACT ATTENUATOR FOR SHOULDER, CAPABLE OF REDIRECTION","EA",24,1,6000,6537.5]
[3,853.43,"TEMPORARY IMPACT ATTENUATOR FOR MEDIAN, INCAPABLE OF REDIRECTION","EA",16,1,6000,6025]
[3,853.50099999999998,"TEMPORARY IMPACT ATTENUATOR REMOVED AND RESET","EA",396,15,1500,1481.38]
[3,853.53,"TEMPORARY IMPACT ATTENUATOR UNIDIRECTIONAL, NON-REDIRECTIVE (TL-3)","EA",72,4,6350,6534.03]
[3,853.63,"TEMPORARY IMPACT ATTENUATOR UNIDIRECTIONAL, REDIRECTIVE (TL-3)","EA",157,5,5800,6098.06]
[3,853.72,"TEMPORARY IMPACT ATTENUATOR BI-DIRECTIONAL, NON-REDIRECTIVE (TL-2)","EA",18,1,4000,3811.11]
[3,853.73,"TEMPORARY IMPACT ATTENUATOR BI-DIRECTIONAL, NON-REDIRECTIVE (TL-3)","EA",33,4,6000,5869.22]
[3,853.8,"TEMPORARY ILLUMINATION FOR WORK ZONE","DAY",14978,27,80,119.25]
[3,854.01599999999996,"TEMPORARY PAVING MARKINGS - 6 INCH (PAINTED)","FT",6545352,21,0.37,0.34]
[3,854.03599999999994,"TEMPORARY PAVING MARKINGS - 6 INCH (TAPE)","FT",555202,17,1.25,1.4]
[3,854.1,"PAVEMENT MARKING REMOVAL","SF",271484,10,2,1.62]
[3,854.5,"RAISED PAVEMENT MARKER REMOVAL","EA",560,1,11.13,11.04]
[3,854.6,"TEMPORARY PORTABLE RUMBLE STRIP","DAY",3536,6,60,50.79]
[3,856,"ARROW BOARD","DAY",84291,34,10,9.51]
[3,856.12,"PORTABLE CHANGEABLE MESSAGE SIGN","DAY",255438,37,20,21.22]
[3,859,"REFLECTORIZED DRUM","DAY",4476883,36,0.25,0.23]
[3,859.1,"REFLECTORIZED DRUMS WITH SEQUENTIAL FLASHING WARNING LIGHTS","DAY",120296,27,4,4.08]
[3,860.10599999999999,"6 INCH REFLECTORIZED WHITE LINE (PAINTED)","FT",280400,3,0.75,0.6]
[3,861.10599999999999,"6 INCH REFLECTORIZED YELLOW LINE (PAINTED)","FT",200800,3,0.75,0.6]
[3,864.04,"PAVEMENT ARROWS AND LEGENDS REFLECTORIZED WHITE (THERMOPLASTIC)","SF",89555,13,10,8.42]
[3,864.31,"SLOTTED PAVEMENT MARKER ONE-WAY WHITE","EA",5260,3,25,25.24]
[3,864.32,"SLOTTED PAVEMENT MARKER ONE-WAY YELLOW","EA",4360,2,24.32,24.02]
[3,864.33,"SLOTTED PAVEMENT MARKER TWO-WAY WHITE/RED","EA",8430,4,26,26.22]
[3,864.34,"SLOTTED PAVEMENT MARKER TWO-WAY YELLOW/RED","EA",6834,3,24.89,25.12]
[3,864.35,"SLOTTED PAVEMENT MARKER TWO-WAY YELLOW/YELLOW","EA",3870,3,30,28.41]
[3,866.10599999999999,"6 INCH REFLECTORIZED WHITE LINE (THERMOPLASTIC)","FT",1657225,11,1,1.01]
[3,866.11199999999997,"12 INCH REFLECTORIZED WHITE LINE (THERMOPLASTIC)","FT",267570,12,4.75,4.3499999999999996]
[3,866.20600000000002,"6 INCH REFLECTORIZED WHITE LINE (POLYUREA) (RECESSED)","FT",1211233,8,2,2.06]
[3,866.21199999999999,"12 INCH REFLECTORIZED WHITE LINE (POLYUREA) (RECESSED)","FT",48415,8,7,6.8]
[3,867.10599999999999,"6 INCH REFLECTORIZED YELLOW LINE (THERMOPLASTIC)","FT",1656260,11,1,1.01]
[3,867.11199999999997,"12 INCH REFLECTORIZED YELLOW LINE (THERMOPLASTIC)","FT",40650,10,4.75,4.28]
[3,867.20600000000002,"6 INCH REFLECTORIZED YELLOW LINE (POLYUREA) (RECESSED)","FT",1096977,8,2,2.09]
[3,867.21199999999999,"12 INCH REFLECTORIZED YELLOW LINE (POLYUREA) (RECESSED)","FT",450,1,3.7,3.76]
[3,874,"STREET NAME SIGN","EA",1090,11,100,91.62]
[3,874.1,"STREET SIGN REMOVED AND RESET","EA",59,3,150,148.53]
[3,874.2,"TRAFFIC SIGN REMOVED AND RESET","EA",1433,24,125,118.5]
[3,874.4,"TRAFFIC SIGN REMOVED AND STACKED","EA",1687,12,37.75,35.54]
[3,874.7,"MISCELLANEOUS SIGNS REMOVED AND STACKED","EA",6,1,600,500]
[3,877.1,"SIGN POST REMOVED AND DISCARDED","EA",60,1,17.5,17.5]
[3,877.2,"SIGN POST REMOVED AND STACKED","EA",6,1,40,40]
[3,901,"4000 PSI, 1.5 INCH, 565 CEMENT CONCRETE","CY",1305,5,1250,1195.17]
[3,903,"3000 PSI, 1.5 INCH, 470 CEMENT CONCRETE","CY",231,4,500,473.77]
[3,904,"4000 PSI, 3/4 INCH, 610 CEMENT CONCRETE","CY",249.5,5,1550,1523.08]
[3,904.3,"5000 PSI, 3/4 INCH, 685 HP CEMENT CONCRETE","CY",109,2,789,716]
[3,905,"4000 PSI, 3/8 INCH, 660 CEMENT CONCRETE","CY",3461,11,4537.5,4572.68]
[3,905.2,"5000 PSI, 3/8 INCH, 710 HP CEMENT CONCRETE","CY",22,2,5262.86,5127.1400000000003]
[3,907,"SAWCUT GROOVES IN CONCRETE BRIDGE DECK","SY",9900,1,15,16]
[3,909.2,"CEMENTITIOUS MORTAR FOR PATCHING","SF",12887,10,87.5,80.680000000000007]
[3,909.99,"RAPID SET CEMENT","BAG",30,1,100,86.67]
[3,910,"STEEL REINFORCEMENT FOR STRUCTURES","LB",38870,4,3.25,3.73]
[3,910.1,"STEEL REINFORCEMENT FOR STRUCTURES - EPOXY COATED","LB",281110,14,3,2.74]
[3,912,"DRILLING AND GROUTING DOWELS","EA",870,4,57.5,53.54]
[3,912.5,"DRILLED AND GROUTED #5 DOWELS","EA",7680,3,50,57.67]
[3,912.6,"DRILLED AND GROUTED #6 DOWELS","EA",1080,1,56.38,54.75]
[3,913.2,"CORING AND GROUTING ANCHOR BOLTS","EA",1344,1,155,158.57]
[3,942.10199999999998,"STEEL PILE HP 10 X 57","FT",4140,1,150,158.78]
[3,942.12400000000002,"STEEL PILE HP 12 X 84","FT",3150,1,215,200.5]
[3,944.12400000000002,"STEEL PILE SPLICE HP 12 X 84","EA",21,1,500,525]
[3,945.10199999999998,"DRILLED SHAFT EXCAVATION 3.5 FOOT DIAMETER","FT",165,1,582.5,503.67]
[3,945.202,"ROCK SOCKET EXCAVATION 3.5 FOOT DIAMETER","FT",75,1,3125,3266]
[3,945.50199999999995,"DRILLED SHAFT 3.5 FOOT DIAMETER","FT",360,1,750,822.67]
[3,948.41,"DYNAMIC LOAD TEST BY CONTRACTOR","EA",28,2,6000,5931.43]
[3,948.5,"PILE SHOES","EA",154,2,200,177.92]
[3,950.1,"TEMPORARY SHORING","LS",8,1,192500,167062.5]
[3,961.101,"CLEAN AND PAINT (OVERCOAT) STEEL BRIDGE NO. _______________","LS",5,1,535000,496921.4]
[3,961.20100000000002,"CLEAN (FULL REMOVAL) AND PAINT STEEL BRIDGE NO. ________","LS",13,3,790000,838305.77]
[3,961.202,"CLEAN (FULL REMOVAL) AND PAINT STEEL BRIDGE NO. ________","LS",8,2,780000,778692.94]
[3,961.20299999999997,"CLEAN (FULL REMOVAL) AND PAINT STEEL BRIDGE NO. _______","LS",5,1,620675,609422]
[3,961.20399999999995,"CLEAN (FULL REMOVAL) AND PAINT STEEL BRIDGE NO. ________","LS",5,1,487400,492825]
[3,961.20500000000004,"CLEAN (FULL REMOVAL) AND PAINT STEEL BRIDGE NO. _____","LS",5,1,275000,275068]
[3,964.1,"EPOXY BONDING COMPOUND","SF",91060,12,4,3.96]
[3,966,"MEMBRANE WATERPROOFING FOR BRIDGE DECK REPAIRS","SF",341794,5,3.55,3.66]
[3,974.1,"METAL BRIDGE RAILING REMOVED AND RESET","FT",300,1,149,132.6]
[3,983,"DUMPED RIPRAP","TON",25080,5,69,67.459999999999994]
[3,983.1,"RIPRAP","TON",300,1,50,50]
[3,983.3,"RIPRAP REMOVED AND RELAID","CY",375,1,94,71.599999999999994]
[3,984.601,"DUMPED STONE FOR EROSION CONTROL","TON",60,1,90,90]
[3,986,"MODIFIED ROCKFILL","TON",8756,4,73.5,74.31]
[3,986.1,"MODIFIED ROCKFILL","SY",8010,2,55,54.57]
[3,986.2,"MODIFIED ROCKFILL","CY",210,1,100,101.33]
[3,987,"SPECIAL SLOPE PAVING UNDER BRIDGE - OPTION","SY",720,2,120,112.33]
[3,987.3,"SPECIAL SLOPE PAVING UNDER BRIDGE - CEMENT CONCRETE","SY",7860,3,125,127.75]
[3,991.1,"CONTROL OF WATER - STRUCTURE NO. ______","LS",10,3,102000,99750]
[3,992.1,"ALTERATION TO BRIDGE STRUCTURE NO. ______","LS",14,2,504750,500441.21]
[3,992.3,"TEMPORARY SUPPORTS FOR BRIDGE STRUCTURE","LS",6,1,42000,40666.67]
[3,992.32,"TEMPORARY SUPPORTS FOR PIPING","LS",7,1,800000,778571.43]
[3,994.01,"TEMPORARY PROTECTIVE SHIELDING BRIDGE NO. _______________","LS",8,3,90000,72500.03]
[3,994.1,"TEMPORARY PROTECTIVE SHIELDING","SF",166804,9,11,11.3]
[3,995,"BRIDGE SUPERSTRUCTURE, BRIDGE NO._______","LS",29,3,3492000,3429692.49]
[3,995.01,"BRIDGE STRUCTURE, BRIDGE NO. ______","LS",19,2,895500,826393.3]
[3,995.01099999999997,"CULVERT STRUCTURE, CULVERT NO. _______","LS",8,1,869000,829362.27]
[3,995.02,"BRIDGE STRUCTURE, BRIDGE NO. _______","LS",3,1,3500000,3741666.67]
[3,996.01,"WALL STRUCTURE, WALL NO. ________________","LS",11,2,430000,409727.27]
[3,996.31,"MECHANICALLY STABILIZED EARTH WALL","SY",954,1,785,760]
[4,100,"SCHEDULE OF OPERATIONS - FIXED PRICE $__________","LS",50,7,12500,9100]
[4,100.001,"ELECTRICIAN","HR",4245,1,135,133]
[4,100.002,"LABORER","HR",1280,2,67,71.599999999999994]
[4,100.1,"BASE LABOR RATE","HR",46140,2,124.5,125.42]
[4,101,"CLEARING AND GRUBBING","A",25.46,8,40000,40654]
[4,101.1,"CLEARING","A",30.5,2,7607.5,7603.75]
[4,102,"SELECTIVE CLEARING AND THINNING","A",2,2,32500,36000]
[4,102.1,"TREE TRIMMING","FT",29820,10,15.5,14.8]
[4,102.12,"TREE TRIMMING","EA",40,2,100,163.33000000000001]
[4,102.3,"HERBICIDE TREATMENT FOR INVASIVE PLANTS","HR",501,4,620,638.82000000000005]
[4,102.33,"INVASIVE PLANT MANAGEMENT STRATEGY","HR",206,3,300,284.69]
[4,102.511,"TREE PROTECTION â€“ ARMORING & PRUNING","EA",488,9,392.5,381.57]
[4,102.521,"TREE AND PLANT PROTECTION FENCE","FT",7055,8,10,10.09]
[4,102.55,"ARBORIST","HR",160,3,200,203.79]
[4,103,"TREE REMOVED - DIAMETER UNDER 24 INCHES","EA",196,7,1800,1797.55]
[4,104,"TREE REMOVED - DIAMETER 24 INCHES AND OVER","EA",18,2,2500,2625]
[4,106.15,"BLEEDER (BRIDGE DECK) PVC","EA",4,1,1007.82,1003.91]
[4,106.9,"JOINT FILLER COMPOUND","FT",320,1,60,60]
[4,107.48,"PREFORMED JOINT FILLER","FT",1520,1,16,14.25]
[4,112.1,"DEMOLITION OF BUILDING NO. _____","LS",4,1,125000,115325.36]
[4,115.1,"DEMOLITION OF BRIDGE NO. _____","LS",4,1,2000000,2005978.8]
[4,115.2,"DEMOLITION OF BRIDGE NO. _____","LS",5,1,1100000,1163371.5900000001]
[4,119,"RODENT CONTROL","LS",8,2,5377.01,5644.25]
[4,120,"EARTH EXCAVATION","CY",98945,12,50,49.32]
[4,120.1,"UNCLASSIFIED EXCAVATION","CY",90485,10,64,61.64]
[4,121,"CLASS A ROCK EXCAVATION","CY",1302,8,125,122.71]
[4,123,"MUCK EXCAVATION","CY",2364,2,80,73.709999999999994]
[4,127,"CONCRETE EXCAVATION","CY",3235,4,120,112.62]
[4,127.1,"REINFORCED CONCRETE EXCAVATION","CY",2060,4,1325,1404.54]
[4,127.4,"REINFORCED CONCRETE DECK EXCAVATION (FULL DEPTH)","SY",2260,1,825,825]
[4,127.41,"REINFORCED CONCRETE DECK EXCAVATION (PARTIAL DEPTH)","CY",70,1,4000,4000]
[4,129.5,"TRACK EXCAVATION","FT",8640,1,42,41.26]
[4,140,"BRIDGE EXCAVATION","CY",11776,3,50,47.62]
[4,141,"CLASS A TRENCH EXCAVATION","CY",1414,10,50,50.76]
[4,141.1,"TEST PIT FOR EXPLORATION","CY",4522,15,125,133.91999999999999]
[4,142,"CLASS B TRENCH EXCAVATION","CY",3258,13,50,50.62]
[4,144,"CLASS B ROCK EXCAVATION","CY",1127,18,162.96,160.62]
[4,145,"DRAINAGE STRUCTURE ABANDONED","EA",38,2,750,720.54]
[4,146,"DRAINAGE STRUCTURE REMOVED","EA",240,10,886.09,854.44]
[4,148,"DREDGING AND DISPOSING OF MATERIAL","CY",3240,1,285,281.25]
[4,148.4,"DREDGING, MOBILIZATION AND DEMOBILIZATION","LS",3,1,75000.320000000007,66494.679999999993]
[4,150,"ORDINARY BORROW","CY",472,6,47.05,47.8]
[4,150.1,"SPECIAL BORROW","CY",3050,1,60,61.51]
[4,151,"GRAVEL BORROW","CY",113894,17,55,56.57]
[4,151.01,"GRAVEL BORROW - TYPE C","CY",2315,5,68,68.94]
[4,151.1,"GRAVEL BORROW FOR BRIDGE FOUNDATION","CY",14,1,212.17,206.09]
[4,151.19999999999999,"GRAVEL BORROW FOR BACKFILLING STRUCTURES AND PIPES","CY",6305,4,61.5,60.89]
[4,152.69999999999999,"PEASTONE","TON",18,1,75,73]
[4,153,"CONTROLLED DENSITY FILL - EXCAVATABLE","CY",1160,12,165,170.73]
[4,153.1,"CONTROLLED DENSITY FILL - NON-EXCAVATABLE","CY",80,2,250,232.48]
[4,154,"SAND BORROW","CY",90,1,89.99,85]
[4,156,"CRUSHED STONE","TON",5439,15,60,57.53]
[4,156.1,"CRUSHED STONE FOR BRIDGE FOUNDATIONS","TON",900,1,72,69]
[4,170,"FINE GRADING AND COMPACTING - SUBGRADE AREA","SY",251205,17,12,11.15]
[4,180.01,"ENVIRONMENTAL HEALTH AND SAFETY PROGRAM","LS",32,9,5800,4967.18]
[4,180.02,"PERSONAL PROTECTION LEVEL C UPGRADE","HR",7759,9,10,8.48]
[4,180.03,"LICENSED SITE PROFESSIONAL SERVICES","HR",17854,10,127.5,133.15]
[4,181.11,"DISPOSAL OF UNREGULATED SOIL","TON",50727,10,40,39.5]
[4,181.12,"DISPOSAL OF REGULATED SOIL - IN-STATE FACILITY","TON",25641,10,69,69.89]
[4,181.13,"DISPOSAL OF REGULATED SOIL - OUT-OF-STATE FACILITY","TON",69969,10,113.5,114.87]
[4,181.14,"DISPOSAL OF HAZARDOUS WASTE","TON",11445,9,402.49,427.83]
[4,182.1,"INSPECTION AND TESTING FOR ASBESTOS","LS",14,4,2805.58,2543.65]
[4,182.2,"REMOVAL OF ASBESTOS","FT",510,3,150,151.38999999999999]
[4,183.1,"TREATMENT OF CONTAMINATED GROUNDWATER","GAL",82020,4,4,6.26]
[4,183.2,"DISPOSAL OF GRANULAR ACTIVATED CARBON","LB",25340,5,6.75,6.9]
[4,184.1,"DISPOSAL OF TREATED WOOD PRODUCTS","TON",2356,6,336,319.25]
[4,188.1,"TESTING OF PCB BALLASTS","LS",1,1,1,1]
[4,188.2,"DISPOSAL OF PCB BALLASTS","LS",1,1,1500,1500]
[4,188.3,"DISPOSAL OF MERCURY CONTAINING LAMPS","EA",40,1,5,5]
[4,191,"DRIVE SAMPLE BORING","FT",3998,4,120,124.36]
[4,191.1,"HOLLOW STEM AUGER BORINGS","FT",1226,3,112.5,102]
[4,191.11,"CORE BORING","FT",290,3,5,12]
[4,192.1,"GROUND WATER OBSERVATION WELLPOINT TYPE II","FT",1,1,1060.78,1060.78]
[4,201,"CATCH BASIN","EA",513,14,5925,5640.81]
[4,201.3,"SPECIAL CATCH BASIN","EA",3,1,6500,6566.67]
[4,201.5,"CATCH BASIN - MUNICIPAL STANDARD","EA",24,1,6975,6616.67]
[4,202,"MANHOLE","EA",231,9,6500,6228.48]
[4,202.2,"MANHOLE (9 TO 14 FOOT DEPTH)","EA",5,1,7000,7229.66]
[4,203,"SPECIAL MANHOLE","EA",12,1,6200,6028.78]
[4,204,"GUTTER INLET","EA",97,7,2500,2467.5300000000002]
[4,205,"LEACHING BASIN","EA",33,4,6000,5361.21]
[4,209.1,"DROP INLET, TYPE DF","EA",2,1,4500,4500]
[4,210,"SANITARY SEWER MANHOLE","EA",16,1,8000,7746.07]
[4,220,"DRAINAGE STRUCTURE ADJUSTED","EA",8292,16,432.05,438.58]
[4,220.2,"DRAINAGE STRUCTURE REBUILT","FT",8113,14,500,490.35]
[4,220.3,"DRAINAGE STRUCTURE CHANGE IN TYPE","EA",64,6,1100,1096.28]
[4,220.5,"DRAINAGE STRUCTURE REMODELED","EA",136,9,850,821.22]
[4,220.6,"SANITARY STRUCTURE REBUILT","FT",658,8,450,444.72]
[4,220.7,"SANITARY STRUCTURE ADJUSTED","EA",1208,15,475,463.15]
[4,220.8,"SANITARY STRUCTURE REMODELED","EA",53,4,1000,963.22]
[4,221,"FRAME AND COVER","EA",602,12,991,937.29]
[4,221.1,"FRAME AND COVER - SECURED","EA",575,8,617.32000000000005,765.26]
[4,222,"FRAME AND GRATE - MASSDOT BAR TYPE","EA",3679,6,567.32000000000005,742.22]
[4,222.1,"FRAME AND GRATE - MASSDOT CASCADE TYPE","EA",2463,14,1000,941.55]
[4,222.3,"FRAME AND GRATE (OR COVER) MUNICIPAL STANDARD","EA",473,6,1000,954.14]
[4,223.1,"FRAME AND GRATE (OR COVER) REMOVED AND STACKED","EA",51,3,106,100.61]
[4,223.2,"FRAME AND GRATE (OR COVER) REMOVED AND DISCARDED","EA",3982,10,52.22,88.29]
[4,224.12,"12 INCH HOOD","EA",48,2,575,561.21]
[4,227.1,"TIDE GATE","EA",8,1,5720.16,5560.08]
[4,227.3,"REMOVAL OF DRAINAGE STRUCTURE SEDIMENT","CY",5872,18,250,239.33]
[4,227.31,"REMOVAL OF DRAINAGE PIPE SEDIMENT","FT",12680,16,15,14.08]
[4,227.4,"MASONRY PLUG","SF",83,5,124.01,125.16]
[4,234.12,"12 INCH DRAINAGE PIPE - OPTION","FT",17065,12,145,130.33000000000001]
[4,234.15,"15 INCH DRAINAGE PIPE - OPTION","FT",2125,2,105,99.54]
[4,234.18,"18 INCH DRAINAGE PIPE - OPTION","FT",3100,2,105,109.55]
[4,234.24,"24 INCH DRAINAGE PIPE - OPTION","FT",624,2,120,103.94]
[4,234.36,"36 INCH DRAINAGE PIPE - OPTION","FT",100,1,200,167.5]
[4,235.12,"12 INCH DRAINAGE PIPE FLARED END - OPTION","EA",36,3,1350,1266.98]
[4,235.18,"18 INCH DRAINAGE PIPE FLARED END - OPTION","EA",4,1,1100,1050]
[4,238.1,"10 INCH DUCTILE IRON PIPE","FT",30,1,200,216.67]
[4,238.12,"12 INCH DUCTILE IRON PIPE","FT",653,3,195,181.82]
[4,241.12,"12 INCH REINFORCED CONCRETE PIPE","FT",2378,4,140,129.65]
[4,241.15,"15 INCH REINFORCED CONCRETE PIPE","FT",750,1,125,117.29]
[4,241.18,"18 INCH REINFORCED CONCRETE PIPE","FT",2300,1,175,159]
[4,241.24,"24 INCH REINFORCED CONCRETE PIPE","FT",1032,1,200,184.37]
[4,243.12,"12 INCH REINFORCED CONCRETE PIPE CLASS IV","FT",1000,1,141.56,136.41]
[4,250.06,"6 INCH POLYVINYL CHLORIDE SANITARY SEWER PIPE","FT",200,1,163.5,161.75]
[4,250.08,"8 INCH POLYVINYL CHLORIDE SANITARY SEWER PIPE","FT",1440,1,149,135.51]
[4,252.12,"12 INCH CORRUGATED PLASTIC PIPE","FT",1400,1,122.5,125]
[4,258,"STONE FOR PIPE ENDS","SY",162,4,110,106.57]
[4,302.06,"6 INCH DUCTILE IRON WATER PIPE (RUBBER GASKET)","FT",400,1,160.83000000000001,148.33000000000001]
[4,302.08,"8 INCH DUCTILE IRON WATER PIPE (RUBBER GASKET)","FT",540,2,202,208.38]
[4,302.12,"12 INCH DUCTILE IRON WATER PIPE (RUBBER GASKET)","FT",2060,2,220,192.8]
[4,303.06,"6 INCH DUCTILE IRON WATER PIPE (MECHANICAL JOINT)","FT",90,2,160,144]
[4,309,"DUCTILE IRON FITTINGS FOR WATER PIPE","LB",46635,3,7,6.58]
[4,347.1,"1 INCH COPPER TUBING TYPE K","FT",1300,2,95,97.46]
[4,349.16,"16 INCH GATE VALVE","EA",10,1,8800,8997.67]
[4,350.06,"6 INCH GATE AND GATE BOX","EA",39,4,2050,2047.46]
[4,350.08,"8 INCH GATE AND GATE BOX","EA",32,1,3150,3110.44]
[4,350.12,"12 INCH GATE AND GATE BOX","EA",20,1,4664.58,4761.72]
[4,357.06,"6 INCH GATE BOX","EA",47,3,450,525]
[4,357.08,"8 INCH GATE BOX","EA",6,2,450,450]
[4,357.12,"12 INCH GATE BOX","EA",8,2,525,572.13]
[4,358,"GATE BOX ADJUSTED","EA",1762,15,300,294.52]
[4,358.1,"GATE BOX REMOVED AND STACKED","EA",6,2,100,112.5]
[4,371.06,"6 INCH COUPLING","EA",8,2,550,504.17]
[4,373.12,"12 INCH WATER PIPE INSULATION","FT",1110,1,64,63.4]
[4,376,"HYDRANT","EA",20,1,5500,5307.86]
[4,376.1,"HYDRANT - EXCLUDING COST OF HYDRANT","EA",18,3,4200,3952.25]
[4,376.2,"HYDRANT - REMOVED AND RESET","EA",18,3,4000,3927.77]
[4,376.5,"HYDRANT - ADJUSTED","EA",23,5,2294.4499999999998,1913.04]
[4,381,"SERVICE BOX","EA",34,5,375,399.71]
[4,381.2,"SERVICE BOX REMOVED AND STACKED","EA",2,1,50,37.5]
[4,381.3,"SERVICE BOX ADJUSTED","EA",149,5,250,260.14999999999998]
[4,387,"BLOW-OFF CHAMBER","EA",4,1,22000,20248.259999999998]
[4,388,"AIR VALVE CHAMBER","EA",8,1,5803.81,5500.95]
[4,402,"DENSE GRADED CRUSHED STONE FOR SUB-BASE","CY",13130,7,75,76.959999999999994]
[4,402.12,"DENSE GRADED CRUSHED STONE FOR SHOULDERS","CY",600,1,65,66.67]
[4,402.13,"PAVEMENT MILLING MULCH FOR SHOULDERS","FT",30900,1,5.36,5.62]
[4,403.1,"CRUSHED STONE FOR BLENDING","TON",550,1,23,23]
[4,404.5,"RECLAIMED PAVEMENT BORROW MATERIAL","CY",1200,1,35,38.75]
[4,415.1,"PAVEMENT STANDARD MILLING","SY",36500,1,5,5.07]
[4,415.2,"PAVEMENT FINE MILLING","SY",3093210,6,2.8,3.04]
[4,415.3,"PAVEMENT MICRO MILLING","SY",153120,8,7.08,7.26]
[4,415.4,"BRIDGE PAVEMENT MILLING","SY",85770,4,20,21.18]
[4,431,"HIGH EARLY STRENGTH CEMENT CONCRETE BASE COURSE","SY",12465,10,61.5,60.29]
[4,440,"CALCIUM CHLORIDE FOR ROADWAY DUST CONTROL","LB",103150,8,0.46,0.46]
[4,443,"WATER FOR ROADWAY DUST CONTROL","MGL",2822.5,10,57.5,61.35]
[4,450.22,"SUPERPAVE SURFACE COURSE â€“ 9.5 (SSC â€“ 9.5)","TON",63040,3,170,161.62]
[4,450.23,"SUPERPAVE SURFACE COURSE - 12.5 (SSC - 12.5)","TON",6405,2,155,149.66999999999999]
[4,450.23099999999999,"SUPERPAVE SURFACE COURSE - 12.5 POLYMER (SSC - 12.5 - P)","TON",184520,10,130,132.03]
[4,450.31,"SUPERPAVE INTERMEDIATE COURSE - 12.5 (SIC -12.5)","TON",500,1,175,168.4]
[4,450.31099999999998,"SUPERPAVE INTERMEDIATE COURSE - 12.5 POLYMER (SIC -12.5 - P)","TON",13900,2,135,138.71]
[4,450.32,"SUPERPAVE INTERMEDIATE COURSE - 19.0 (SIC - 19.0)","TON",22310,3,132.5,132.38]
[4,450.32100000000003,"SUPERPAVE INTERMEDIATE COURSE - 19.0 POLYMER (SIC - 19.0 - P)","TON",10900,1,120,110.91]
[4,450.42,"SUPERPAVE BASE COURSE - 37.5 (SBC - 37.5)","TON",34960,6,149.5,151.94]
[4,450.52,"SUPERPAVE LEVELING COURSE - 9.5 (SLC - 9.5)","TON",3120,1,157.5,154.16999999999999]
[4,450.53,"SUPERPAVE LEVELING COURSE - 12.5 (SLC - 12.5)","TON",440,1,160,161]
[4,450.61099999999999,"SUPERPAVE BRIDGE SURFACE COURSE - 12.5 POLYMER (SSC-B - 12.5 - P)","TON",372,1,200,185]
[4,450.7,"SUPERPAVE BRIDGE PROTECTIVE COURSE - 9.5 (SPC-B - 9.5)","TON",30,1,662.33,706.17]
[4,450.71100000000001,"SUPERPAVE BRIDGE PROTECTIVE COURSE â€“ 12.5POLYMER (SPC-B - 12.5 - P)","TON",372,1,200,185]
[4,451,"HMA FOR PATCHING","TON",32852,20,227,234.39]
[4,452,"ASPHALT EMULSION FOR TACK COAT","GAL",330970,21,8,8.08]
[4,453,"HMA JOINT SEALANT","FT",2221145,17,1,0.97]
[4,457.2,"SUPERPAVE WATERPROOFING SURFACE COURSE - 12.5 (SSC-W-12.5)","TON",20870,5,375,387.98]
[4,458.2,"SUPERPAVE HIGH PERFORMANCE (HP-12.5)","TON",60000,1,122,119.75]
[4,470,"HOT MIX ASPHALT BERM","TON",33,2,500,437.91]
[4,472,"TEMPORARY ASPHALT PATCHING","TON",13974,20,227.61,231.54]
[4,477,"MILLED RUMBLE STRIP (TYPE A)","FT",438800,3,2.96,1.95]
[4,477.1,"MILLED RUMBLE STRIP (TYPE B)","FT",112800,1,0.61,0.55000000000000004]
[4,482.17,"HOT APPLIED RUBBERIZED ASPHALTIC CRACK FILLER","GAL",2000,1,16.87,16.87]
[4,482.3,"SAWCUTTING ASPHALT PAVEMENT","FT",360,1,6.75,6.31]
[4,482.31,"SAWING & SEALING JOINTS IN ASPHALT PAVEMENT AT BRIDGES","FT",7085,3,27.5,28.93]
[4,482.4,"SAWCUTTING PORTLAND CEMENT CONCRETE","FT",790,3,6.25,5.44]
[4,482.5,"SAWCUTTING ASPHALT PAVEMENT FOR BOX WIDENING","FT",27910,7,3,2.99]
[4,504,"GRANITE CURB TYPE VA4 - STRAIGHT","FT",52540,13,50,53.56]
[4,504.1,"GRANITE CURB TYPE VA4 - CURVED","FT",10640,12,61,61]
[4,504.2,"GRANITE CURB TYPE VA4 - SPLAYED END","EA",532,6,450,456.54]
[4,506,"GRANITE CURB TYPE VB - STRAIGHT","FT",28270,4,48.5,49.57]
[4,506.1,"GRANITE CURB TYPE VB - CURVED","FT",2880,3,55.79,59.13]
[4,509,"GRANITE TRANSITION CURB FOR PEDESTRIAN CURB RAMPS - STRAIGHT","FT",22989,16,55,56.87]
[4,509.1,"GRANITE TRANSITION CURB FOR PEDESTRIAN CURB RAMPS - CURVED","FT",11930,16,61.78,62.45]
[4,510,"GRANITE EDGING TYPE SA","FT",9010,4,36,36.04]
[4,510.1,"GRANITE EDGING TYPE SA (RADIUS 10 FEET OR LESS)","FT",210,2,48,44.93]
[4,511.1,"GRANITE EDGING TYPE SB - STRAIGHT","FT",254,3,45,43.9]
[4,513,"GRANITE EDGING TYPE SC","FT",14880,1,28,24.84]
[4,514,"GRANITE CURB INLET - STRAIGHT","EA",549,15,450,472.07]
[4,515,"GRANITE CURB INLET - CURVED","EA",39,6,520,543.36]
[4,516,"GRANITE CURB CORNER TYPE A","EA",195,5,325,320.99]
[4,517,"GRANITE CURB CORNER TYPE B","EA",20,3,510,499.5]
[4,570,"HOT MIX ASPHALT CURB - OPTION","FT",500,1,18,21.5]
[4,570.20000000000005,"HOT MIX ASPHALT CURB TYPE 2","FT",1410,2,15,14]
[4,572.1,"HOT MIX ASPHALT CURB TYPE 1","TON",360,1,200,194.1]
[4,580,"CURB REMOVED AND RESET","FT",63015,14,30,28.56]
[4,581,"CURB INLET REMOVED AND RESET","EA",51,4,150,142.94]
[4,582,"CURB CORNER REMOVED AND RESET","EA",131,3,115,125.69]
[4,583,"EDGING REMOVED AND RESET","FT",17540,3,35,30.49]
[4,594,"CURB REMOVED AND DISCARDED","FT",56000,14,6,6.53]
[4,595,"CURB INLET REMOVED AND DISCARDED","EA",92,6,35,32.78]
[4,596,"CURB CORNER REMOVED AND DISCARDED","EA",67,2,30.78,34.14]
[4,597,"EDGING REMOVED AND DISCARDED","FT",15206,6,6.5,7.12]
[4,620.12,"GUARDRAIL, TL-2 (SINGLE FACED)","FT",5325,3,30,31.3]
[4,620.13,"GUARDRAIL, TL-3 (SINGLE FACED)","FT",459129,7,33,32.619999999999997]
[4,620.13099999999997,"GUARDRAIL, DEEP POST (SINGLE FACED)","FT",400,1,42.5,42.5]
[4,620.32000000000005,"GUARDRAIL - CURVED, TL-2 (SINGLE FACED)","FT",300,1,46,49.25]
[4,620.33000000000004,"GUARDRAIL - CURVED, TL-3 (SINGLE FACED)","FT",400,1,36.53,36.53]
[4,621.12,"GUARDRAIL, TL-2 (DOUBLE FACED)","FT",655,2,40.32,43.26]
[4,621.13,"GUARDRAIL, TL-3 (DOUBLE FACED)","FT",500,1,53,53]
[4,627.1,"TRAILING ANCHORAGE","EA",575,10,2000,2045.4]
[4,627.72,"GUARDRAIL END TREATMENT, TL-2 (DOUBLE FACED)","EA",27,3,25500,23359.11]
[4,627.73,"GUARDRAIL END TREATMENT, TL-3 (DOUBLE FACED)","EA",12,1,20000,19176.53]
[4,627.82000000000005,"GUARDRAIL TANGENT END TREATMENT, TL-2","EA",52,3,4300,4362.2299999999996]
[4,627.83000000000004,"GUARDRAIL TANGENT END TREATMENT, TL-3","EA",787,8,4600,4574.04]
[4,627.92999999999995,"GUARDRAIL FLARED END TREATMENT, TL-3","EA",15,2,4000,4311.1000000000004]
[4,628.21,"TRANSITION TO NCHRP 350 GUARDRAIL","EA",818,9,1800,1893.81]
[4,628.22,"TRANSITION TO RIGID BARRIER (SINGLE FACED)","EA",32,3,6500,6144.79]
[4,628.23,"TRANSITION TO RIGID BARRIER (DOUBLE FACED)","EA",2,1,7925,7925]
[4,628.24,"TRANSITION TO BRIDGE RAIL","EA",116,4,4468.87,4519.13]
[4,628.25,"TRANSITION TO THRIE BEAM","EA",23,2,875,866]
[4,628.30999999999995,"IMPACT ATTENUATOR FOR SHOULDER, INCAPABLE OF REDIRECTION","EA",4,2,17500,13750]
[4,628.32000000000005,"IMPACT ATTENUATOR FOR SHOULDER, CAPABLE OF REDIRECTION","EA",4,1,45000,40733.78]
[4,628.33000000000004,"IMPACT ATTENUATOR FOR MEDIAN, INCAPABLE OF REDIRECTION","EA",6,2,46000,44668.53]
[4,629.1,"PRECAST CONCRETE BARRIER - SINGLE FACED","FT",1260,1,248.5,248.5]
[4,630,"HIGHWAY GUARD REMOVED AND RESET","FT",17870,8,27.3,26.66]
[4,630.20000000000005,"HIGHWAY GUARD REMOVED AND DISCARDED","FT",426720,11,6,5.97]
[4,631,"SPECIAL BASE ANCHOR FOR GUARDRAIL POST","EA",48,1,600,600]
[4,632,"GUARDRAIL POST - STEEL","EA",355,2,175,165.71]
[4,632.20000000000005,"INDIVIDUAL POST REMOVED AND RESET","EA",40,1,125,112.5]
[4,633,"GUARDRAIL OFFSET BLOCK - W BEAM","EA",264,2,20,20.04]
[4,633.1,"GUARDRAIL OFFSET BLOCK - THRIE BEAM","EA",120,1,30.5,30.5]
[4,634,"W BEAM GUARD PANEL","EA",600,1,254.83,254.83]
[4,634.1,"THRIE BEAM GUARD PANEL","EA",504,2,600,503]
[4,645.096,"96 INCH CHAIN LINK FENCE (PIPE TOP RAIL) (LINE POST OPTION)","FT",1450,1,86.73,85.55]
[4,645.17200000000003,"72 INCH CHAIN LINK FENCE (PIPE TOP RAIL) VINYL COATED (LINE POST OPTION)","FT",3770,1,74.92,72.3]
[4,650.072,"72 INCH CHAIN LINK GATE WITH GATE POSTS","FT",240,1,250,253.2]
[4,650.096,"96 INCH CHAIN LINK GATE WITH GATE POSTS","FT",150,1,300,283.44]
[4,652.072,"72 INCH CHAIN LINK FENCE END POST","EA",24,1,622.21,656.9]
[4,653.072,"72 INCH CHAIN LINK FENCE CORNER OR INTERMEDIATE BRACE POST","EA",16,1,749.2,769.9]
[4,653.096,"96 INCH CHAIN LINK FENCE CORNER OR INTERMEDIATE BRACE POST","EA",12,1,487.87,379.29]
[4,657,"TEMPORARY FENCE","FT",10750,2,23,23.19]
[4,657.5,"TEMPORARY FENCE REMOVED AND RESET","FT",3575,2,18,17.39]
[4,660,"METAL PIPE RAIL","FT",260,1,420,409.76]
[4,665,"CHAIN LINK FENCE REMOVED AND STACKED","FT",5120,1,10,10.75]
[4,666,"CHAIN LINK FENCE REMOVED AND RESET","FT",3445,4,66.25,73.75]
[4,669,"FENCE REMOVED AND STACKED","FT",305,2,20,19.2]
[4,670,"FENCE REMOVED AND RESET","FT",2450,2,50,50.71]
[4,672,"FENCE GATE AND GATE POSTS REMOVED AND RESET","EA",4,1,1350,1096.25]
[4,690,"STONE MASONRY WALL REMOVED AND REBUILT IN CEMENT MORTAR","CY",7,1,1683.35,1541.67]
[4,691,"BALANCE STONE WALL REMOVED AND REBUILT","FT",312,1,275,255.25]
[4,697.1,"SILT SACK","EA",3987,20,150,183.26]
[4,698.1,"GEOTEXTILE FABRIC FOR STABILIZATION","SY",2810,3,6,5.09]
[4,698.2,"GEOTEXTILE FABRIC FOR SUBSURFACE DRAINAGE","SY",1290,1,6.75,7.09]
[4,698.3,"GEOTEXTILE FABRIC FOR SEPARATION","SY",440,2,7.5,7.17]
[4,698.4,"GEOTEXTILE FABRIC FOR PERMANENT EROSION CONTROL","SY",4470,1,6.5,6.82]
[4,701,"CEMENT CONCRETE SIDEWALK","SY",34675,12,85,83.41]
[4,701.1,"CEMENT CONCRETE SIDEWALK AT DRIVEWAYS","SY",9555,10,83,80.73]
[4,701.2,"CEMENT CONCRETE PEDESTRIAN CURB RAMP","SY",15945,15,100,103.83]
[4,702,"HOT MIX ASPHALT SIDEWALK OR DRIVEWAY","TON",18257,15,225,228.49]
[4,705.1,"FLAGSTONE WALK REMOVED AND RESET","SY",15,1,400,430]
[4,706.1,"BRICK WALK REMOVED AND RELAID","SY",9,2,500,461.4]
[4,707.1,"PARK BENCH","EA",36,1,2800,2908.01]
[4,707.2,"TRASH RECEPTACLE","EA",9,1,2400,1988.9]
[4,707.8,"STEEL BOLLARD","EA",60,1,1250,1280.4100000000001]
[4,707.9,"BICYCLE RACK","EA",30,1,1000,889.84]
[4,710.4,"BOUND - PLAIN GRANITE","EA",52,2,690.67,662.08]
[4,711,"BOUND REMOVED AND RESET","EA",38,3,575,571.41]
[4,715,"RURAL MAIL BOX REMOVED AND RESET","EA",105,3,237.5,236.19]
[4,718.1,"FLAGPOLE REMOVED AND RESET","LS",3,1,1643.71,1379.14]
[4,740,"ENGINEERS FIELD OFFICE AND EQUIPMENT (TYPE A)","MO",2454,23,3500,3429.23]
[4,747,"EQUIPMENT FOR ENGINEERS FIELD OFFICE","LS",8,6,3500,3346.26]
[4,748,"MOBILIZATION","LS",57,12,55000,51602.8]
[4,748.1,"EMERGENCY RESPONSE","EA",119,11,1350,2121.14]
[4,751,"LOAM BORROW","CY",28360,21,65,61.38]
[4,752,"TOPSOIL REHANDLED AND SPREAD","CY",150,1,42,48.5]
[4,755.45,"WETLAND RESTORATION","SY",460,1,57.5,70]
[4,755.75,"WETLAND SPECIALIST","HR",240,1,153,140.27000000000001]
[4,755.76,"WETLANDS MONITORING REPORTS","LS",4,1,15250,12750]
[4,756,"NPDES STORMWATER POLLUTION PREVENTION PLAN","LS",37,8,7422.56,7193.83]
[4,765,"SEEDING","SY",202580,18,2.79,2.61]
[4,767.12099999999998,"SEDIMENT CONTROL BARRIER","FT",439635,17,7.5,7.67]
[4,767.31,"STRAW MULCH","SY",270,1,5.75,5.5]
[4,767.4,"WOOD CHIP MULCH","CY",20,1,100,100.46]
[4,767.6,"AGED PINE BARK MULCH","CY",303,5,82.5,84.74]
[4,767.8,"BALES OF HAY FOR EROSION CONTROL","EA",380,2,23.5,24.57]
[4,767.9,"JUTE MESH","SY",150,1,10,9]
[4,769,"PAVEMENT MILLING MULCH UNDER GUARD RAIL","FT",703397,7,8.25,7.8]
[4,775.14700000000005,"LINDEN - LITTLE LEAF 2-2.5 INCH CALIPER","EA",9,1,761.44,738.1]
[4,776.52300000000002,"MAPLE - RED - 'ARMSTRONG' 2-2.5 INCH CALIPER","EA",60,1,1067.5,980.83]
[4,776.54300000000001,"MAPLE - RED - 'OCTOBER GLORY' 2-2.5 INCH CALIPER","EA",22,2,759.87,722.99]
[4,776.55100000000004,"MAPLE - RED - 'OCTOBER GLORY' 3-3.5 INCH CALIPER","EA",3,1,1000,1050]
[4,778.16099999999994,"BIRCH - RIVER 'HERITAGE' 8-10 FOOT CLUMP","EA",77,1,480,450.05]
[4,781.57500000000005,"LILAC TREE - JAPANESE CLUMP 10-12 FOOT CLUMP","EA",12,1,1100,1150]
[4,785.63099999999997,"INKBERRY 18-24 INCH","EA",32,1,90,86.25]
[4,787.26300000000003,"YEW - SPREADING ENGLISH 24-30 INCH SPREAD","EA",24,1,200,214.14]
[4,789.33100000000002,"BAYBERRY SHRUB - NORTHERN 18-24 INCH","EA",56,1,80,70.75]
[4,790.53099999999995,"DOGWOOD - GRAY TWIG 18-24 INCH","EA",270,1,40,37.700000000000003]
[4,790.63099999999997,"DOGWOOD - REDOSIER 18-24 INCH","EA",48,1,35,39]
[4,790.71900000000005,"DOGWOOD - SILKY 2-3 FEET","EA",25,1,60,60]
[4,791.31299999999999,"FOTHERGILLA - DWARF 18-24 INCH SPREAD","EA",516,1,90.53,87.46]
[4,794.63300000000004,"SUMAC SHRUB - STAGHORN 2-3 FEET","EA",15,1,45,47.1]
[4,795.15099999999995,"WINTERBERRY - MALE 18-24 INCH","EA",4,1,40,40]
[4,795.15499999999997,"WINTERBERRY - FEMALE 18-24 INCH","EA",48,1,40,39.25]
[4,796.76300000000003,"DAYLILY - 'STELLA D'ORO' 1 GALLON","EA",350,1,28,28.6]
[4,796.84100000000001,"SEDUM 'AUTUMN JOY' 2 QUART","EA",160,1,28,27]
[4,801.32,"3 INCH ELECTRICAL CONDUIT - TYPE NM (DOUBLE)","FT",40000,2,45.5,45.57]
[4,801.42,"4 INCH ELECTRICAL CONDUIT - TYPE NM (DOUBLE)","FT",80,1,100,98.75]
[4,804.1,"1 INCH ELECTRICAL CONDUIT TYPE NM - PLASTIC -(UL)","FT",770,1,40.590000000000003,42.92]
[4,804.15,"1-1/2 INCH ELECTRICAL CONDUIT TYPE NM - PLASTIC -(UL)","FT",120,1,54.5,54.5]
[4,804.2,"2 INCH ELECTRICAL CONDUIT TYPE NM - PLASTIC (UL)","FT",4740,2,42,52.26]
[4,804.3,"3 INCH ELECTRICAL CONDUIT TYPE NM - PLASTIC -(UL)","FT",17610,8,65,62.32]
[4,804.4,"4 INCH ELECTRICAL CONDUIT TYPE NM - PLASTIC -(UL)","FT",1120,1,54.15,55.18]
[4,806.1,"1 INCH ELECTRICAL CONDUIT TYPE RM - GALVANIZED STEEL","FT",960,1,35,34.5]
[4,806.15,"1-1/2 INCH ELECTRICAL CONDUIT TYPE RM - GALVANIZED STEEL","FT",656,1,37.5,38.75]
[4,806.2,"2 INCH ELECTRICAL CONDUIT TYPE RM - GALVANIZED STEEL","FT",320,1,47.5,47.75]
[4,811.22,"ELECTRIC HANDHOLE - SD2.022","EA",225,6,1500,1514.48]
[4,811.23,"ELECTRIC HANDHOLE - SD2.023","EA",196,3,1764.5,1775.44]
[4,811.27,"ELECTRIC HANDHOLE - (MUNICIPAL STANDARD)","EA",243,2,1500,1380.82]
[4,811.31,"PULL BOX 12 X 12 INCHES - SD2.031","EA",172,8,1260,1212.8499999999999]
[4,811.35,"PULL BOX ADJUSTED","EA",4,1,350,365]
[4,811.36,"ELECTRIC MANHOLE ADJUSTED","EA",10,1,600,600]
[4,811.37,"ELECTRIC HANDHOLE ADJUSTED","EA",261,6,350,363.31]
[4,811.39,"ELECTRIC HANDHOLE REMOVED AND STACKED","EA",1,1,250,250]
[4,811.71,"JUNCTION BOX 18 X 12 X 8 INCHES","EA",18,1,1190,1263.33]
[4,812.13,"LIGHT STANDARD FOUNDATION SD3.013","EA",102,1,3500,3880]
[4,812.14,"LIGHT STANDARD FOUNDATION SD3.014","EA",21,1,6000,5633]
[4,813.3,"WIRE TYPE 7 NO. 10 GENERAL PURPOSE","FT",4600,2,1.92,1.69]
[4,813.31,"WIRE TYPE 7 NO. 8 GENERAL PURPOSE","FT",11800,1,2.44,2.2400000000000002]
[4,813.32,"WIRE TYPE 7 NO. 6 GENERAL PURPOSE","FT",59000,2,2.4,2.41]
[4,813.4,"WIRE TYPE 8 NO. 10 DIRECT BURIAL","FT",3300,1,1.8,1.8]
[4,813.42,"WIRE TYPE 8 NO. 6 DIRECT BURIAL","FT",94500,1,2.4,2.2000000000000002]
[4,813.44,"WIRE TYPE 8 NO. 2 DIRECT BURIAL","FT",186000,1,3.6,3.83]
[4,813.46,"WIRE TYPE 8 NO. 1/0 DIRECT BURIAL","FT",102000,1,5.75,5.75]
[4,813.8,"SERVICE CONNECTION (OVERHEAD)","LS",4,1,10000,9375]
[4,815.1,"TRAFFIC CONTROL SIGNAL LOCATION NO. 1","LS",8,2,274200,234025]
[4,815.98,"FOOTING COST ADJUSTMENT","FT",4,1,750,875]
[4,816.01,"TRAFFIC SIGNAL RECONSTRUCTION LOCATION NO. 1","LS",26,5,260000,278416.32]
[4,816.02,"TRAFFIC SIGNAL RECONSTRUCTION LOCATION NO. 2","LS",6,2,25000,23650]
[4,816.03,"TRAFFIC SIGNAL RECONSTRUCTION LOCATION NO. 3","LS",2,1,87500,87500]
[4,816.81,"TEMPORARY TRAFFIC CONTROL SIGNAL","LS",4,1,100000,105250]
[4,817.1,"SIGNAL POST AND BASE STANDARD - 8 FOOT","EA",24,1,1925,1683.33]
[4,817.6,"SIGNAL MAST ARM 20 FEET - STEEL","EA",2,1,2100,2050]
[4,817.61,"SIGNAL MAST ARM 25 FEET - STEEL","EA",2,1,3000,2650]
[4,817.62,"SIGNAL MAST ARM 30 FEET - STEEL","EA",3,1,5000,4400]
[4,817.63,"SIGNAL MAST ARM 35 FEET - STEEL","EA",3,1,5500,5000]
[4,817.64,"SIGNAL MAST ARM 40 FEET - STEEL","EA",3,1,5500,5266.67]
[4,817.65,"SIGNAL MAST ARM 45 FEET - STEEL","EA",3,1,5500,5566.67]
[4,819.83100000000002,"WIRE LOOP INSTALLED IN ROADWAY","FT",23800,4,15,14.14]
[4,823.6,"HIGHWAY LIGHTING LOAD CENTER","LS",12,1,20000,20595.09]
[4,823.61,"HIGHWAY LIGHTING LOAD CENTER NO.1","LS",2,1,75000,93055.5]
[4,823.62,"HIGHWAY LIGHTING LOAD CENTER NO.2","LS",2,1,75000,93055.5]
[4,824.1,"FLASHING WARNING BEACON TYPE D","LS",3,1,6000,5700]
[4,826.51,"FIRE ALARM BOX REMOVED AND RESET","EA",3,1,1000,1050]
[4,828.1,"OVERHEAD GUIDE SIGN - ALUMINUM PANEL (TYPE B)","SF",24300,2,22,21]
[4,829,"ROADSIDE GUIDE SIGN (G) - ALUMINUM PANEL (TYPE B)","SF",7560,3,23,24.5]
[4,831,"ROADSIDE GUIDE SIGN (D6/D8) - ALUMINUM PANEL (TYPE A)","SF",4348,4,25,25.21]
[4,832,"WARNING-REGULATORY AND ROUTE MARKER - ALUMINUM PANEL (TYPE A)","SF",26265,17,14,14.19]
[4,833.5,"DEMOUNTABLE REFLECTORIZED DELINEATOR - GUARD RAIL","EA",10,1,26.25,26.25]
[4,833.7,"DELINEATION FOR GUARD RAIL TERMINI","EA",1247,6,49,44.68]
[4,834.17,"REFLECTORIZED FLEXIBLE DELINEATOR POST (AMBER)","EA",460,1,40,40]
[4,834.18,"REFLECTORIZED FLEXIBLE DELINEATOR POST (WHITE)","EA",470,2,55,50]
[4,840.101,"SUPPORTS FOR OVERHEAD GUIDE SIGN (OD-1) STEEL","LS",1,1,55000,55000]
[4,840.10199999999998,"SUPPORTS FOR OVERHEAD GUIDE SIGN (OD-2) STEEL","LS",1,1,90000,90000]
[4,840.10299999999995,"SUPPORTS FOR OVERHEAD GUIDE SIGN (OD-3) STEEL","LS",1,1,47000,47000]
[4,840.10400000000004,"SUPPORTS FOR OVERHEAD GUIDE SIGN (OD-4) STEEL","LS",1,1,90000,90000]
[4,840.10500000000002,"SUPPORTS FOR OVERHEAD GUIDE SIGN (OD-5) STEEL","LS",1,1,47000,47000]
[4,840.10599999999999,"SUPPORTS FOR OVERHEAD GUIDE SIGN (OD-6) STEEL","LS",1,1,95000,95000]
[4,840.10699999999997,"SUPPORTS FOR OVERHEAD GUIDE SIGN (OD-7) STEEL","LS",1,1,45000,45000]
[4,840.10799999999995,"SUPPORTS FOR OVERHEAD GUIDE SIGN (OD-8) STEEL","LS",1,1,45000,45000]
[4,840.10900000000004,"SUPPORTS FOR OVERHEAD GUIDE SIGN (OD-9) STEEL","LS",1,1,47000,47000]
[4,840.11,"SUPPORTS FOR OVERHEAD GUIDE SIGN (OD-10) STEEL","LS",1,1,87000,87000]
[4,841.1,"SUPPORTS FOR GUIDE SIGN (D6 W/ D8-5 INCH TUBULAR POST) STEEL","EA",43,3,1625,1532.14]
[4,841.2,"SUPPORTS FOR GUIDE SIGN (D6-5 INCH TUBULAR POST) STEEL","EA",65,2,1225,1225]
[4,841.6,"SUPPORTS FOR GUIDE SIGN (I-2A-5 INCH TUBULAR POST) STEEL","EA",13,3,1200,1046.43]
[4,841.8,"SUPPORTS FOR GUIDE SIGN (D6 - SPECIAL DESIGN) STEEL","EA",18,1,1745,1866.07]
[4,844.101,"SUPPORTS FOR GUIDE SIGN (G1) STEEL","LS",4,1,13000,12762.5]
[4,844.10299999999995,"SUPPORTS FOR GUIDE SIGN (G3) STEEL","LS",1,1,2200,2200]
[4,845.1,"SUPPORT FOR GUIDE SIGN (E5-1) STEEL","EA",1,1,2700,2700]
[4,846.1,"SUPPORT FOR GUIDE SIGN (E5-1A) STEEL","EA",28,2,2950,3350]

{"sheet":"DESIGN","index":5,"n_rows":43,"n_cols":13,"rows_kept":43,"cut":false,"hidden":true,"merged":[[42,5,42,7],[39,6,39,7],[1,8,1,9],[2,8,2,9],[3,8,3,9],[18,4,18,5]]}
[]
[null,null,"CALC'D BY:","KA","DATE:","2017-11-02",null,"CITY:",{"$f":"AREA!I2","v":0}]
[null,null,"CHK'D BY:","KR","DATE:","2017-11-15",null,"PROJECT:",{"$f":"AREA!I3","v":0}]
[]
[]
[]
[]
[null,null,"Total Construction Cost:",null,null,{"$f":"SUM(SUMMARY!$I$13+SUMMARY!$I$15)","v":0}]
[null,null,"(Path + Structures)"]
[null,null,"Base design fee based on construction cost"]
[null,null,null,null,null,null,"%-age",null,"Design Fee"]
[null,null,null,0,"to",500000,0.2,{"$f":"IF(AND(D12<=$F$8,F12>$F$8),\"X\",\"\")","v":"X"},{"$f":"IF(H12=\"\",\"\",$F$8*G12)","v":0}]
[null,null,null,{"$f":"F12","v":500000},"to",1000000,0.18,{"$f":"IF(AND(D13<=$F$8,F13>$F$8),\"X\",\"\")","v":""},{"$f":"IF(H13=\"\",\"\",$F$8*G13)","v":""}]
[null,null,null,{"$f":"F13","v":1000000},"to",1500000,0.16,"",""]
[null,null,null,1500000,"to",2000000,0.14000000000000001,"",""]
[null,null,null,2000000,"to",2500000,0.13,"",""]
[null,null,null,2500000,"and","over",0.12,"",""]
[]
[null,null,"Construction Costs for Structures",null,{"$f":"SUMMARY!$I$15","v":0}]
[null,null,null,null,null,null,null,null,null,null,null,null,"DO NOT MOVE CELL"]
[null,null,"Structural Multiplier",null,null,null,"%-age",null,"Structural Design",null,null,null,{"$f":"ROUND(DESIGN!$I$43/SUMMARY!$I$26*100,0)","v":{"$error":"#DIV/0!"}}]
[null,null,null,0,"to",250000,0.02,{"$f":"IF(AND(D22<=$E$19,F22>E$19),\"X\",\"\")","v":"X"},{"$f":"IF(H22=\"\",\"\",$F$8*G22)","v":0}]
[null,null,null,{"$f":"F22","v":250000},"to",500000,2.5000000000000001E-2,{"$f":"IF(AND(D23<=$E$19,F23>E$19),\"X\",\"\")","v":""},{"$f":"IF(H23=\"\",\"\",$F$8*G23)","v":""}]
[null,null,null,{"$f":"F23","v":500000},"to",750000,0.03,"",""]
[null,null,null,750000,"to",1000000,0.04,"",""]
[null,null,null,1000000,"to",1500000,0.05,"",""]
[null,null,null,1500000,"and","over",0.06,"",{"$f":"IF(H27=\"\",\"\",$F$8*G27)","v":""}]
[]
[]
[]
[null,null,null,"Total Design Fee"]
[null,null,null,{"$f":"SUM(I12:I17)","v":0},"+",{"$f":"SUM(I22:I27)","v":0},null,"=",null,{"$f":"D32+F32","v":0}]
[]
[]
[]
[]
[]
[]
[]
[]
[]
[]
[null,null,null,null,null,"Total Cost for Design",null,null,{"$f":"SUM(J9:J38)","v":0},"DOLLARS"]

{"sheet":"SURVEY","index":6,"n_rows":43,"n_cols":10,"rows_kept":43,"cut":false,"hidden":true,"merged":[[19,3,19,5],[30,3,30,5],[31,3,31,5],[22,3,22,5],[23,3,23,5],[27,3,27,5],[28,3,28,5],[29,3,29,5],[12,3,12,5],[1,8,1,9],[2,8,2,9],[3,8,3,9],[10,3,10,5]]}
[]
[null,null,"CALC'D BY:","KA","DATE:","2017-10-25",null,"CITY:",{"$f":"AREA!I2","v":0}]
[null,null,"CHK'D BY:","KR","DATE:","2017-11-15",null,"PROJECT:",{"$f":"AREA!I3","v":0}]
[]
[]
[]
[null,null,"Existing Conditions",null,{"$f":"'USER INTERFACE'!G18","v":0},{"$f":"'USER INTERFACE'!H18","v":0},{"$f":"'USER INTERFACE'!I18","v":0},{"$f":"'USER INTERFACE'!J18","v":0}]
[null,null,"Length",null,{"$f":"'USER INTERFACE'!G17","v":0},{"$f":"'USER INTERFACE'!H17","v":0},{"$f":"'USER INTERFACE'!I17","v":0},{"$f":"'USER INTERFACE'!J17","v":0}]
[]
[]
[null,null,null,"SURVEY",null,null,{"$f":"AREA!$H$31/5280","v":0},"MI",{"$f":"H22","v":0},{"$f":"G11*I11","v":0}]
[]
[null,null,null,"Multiplier based on survey conditions"]
[]
[null,null,null,"Clear/flat",null,null,0.9,{"$f":"SUMIF($E$7:$H$7,D15,$E$8:$H$8)","v":0}]
[null,null,null,"Waterfront",null,null,1,{"$f":"SUMIF($E$7:$H$7,D16,$E$8:$H$8)","v":0}]
[null,null,null,"Roadway",null,null,1,0]
[null,null,null,"Wooded/hilly",null,null,1.1499999999999999,0]
[null,null,null,"Utility Corridor",null,null,1,{"$f":"SUMIF($E$7:$H$7,D19,$E$8:$H$8)","v":0}]
[]
[null,null,null,"Base Cost:"]
[null,null,null,75000,"/mile     *",{"$f":"IF(AREA!H31>0,(G15*H15+G16*H16+G17*H17+G18*H18+G19*H19)/SUM(H15:H19),0)","v":0},"=",{"$f":"D22*F22","v":0},"/mile"]
[]
[]
[]
[]
[]
[]
[]
[]
[]
[]
[]
[]
[]
[]
[]
[]
[null,null,null,"= Price not included in MassDOT Database."]
[]
[]
[]
[null,null,null,null,null,null,null,"Total Cost for Survey",{"$f":"SUM(J11:J36)","v":0},"DOLLARS"]

{"sheet":"TTCP","index":7,"n_rows":43,"n_cols":13,"rows_kept":43,"cut":false,"hidden":true,"merged":[[31,3,31,5],[21,3,21,5],[27,3,27,5],[28,3,28,5],[29,3,29,5],[30,3,30,5],[1,8,1,9],[2,8,2,9],[3,8,3,9],[10,3,10,5],[18,3,18,5]]}
[]
[null,null,"CALC'D BY:","KA","DATE:","2017-10-25",null,"CITY:",{"$f":"AREA!I2","v":0}]
[null,null,"CHK'D BY:","KR","DATE:","2017-11-15",null,"PROJECT:",{"$f":"AREA!I3","v":0}]
[]
[]
[]
[null,null,"Proposed Path",null,{"$f":"'USER INTERFACE'!G19","v":0},{"$f":"'USER INTERFACE'!H19","v":0},{"$f":"'USER INTERFACE'!I19","v":0},{"$f":"'USER INTERFACE'!J19","v":0}]
[null,null,"Length",null,{"$f":"'USER INTERFACE'!G17","v":0},{"$f":"'USER INTERFACE'!H17","v":0},{"$f":"'USER INTERFACE'!I17","v":0},{"$f":"'USER INTERFACE'!J17","v":0}]
[]
[]
[]
[]
[null,null,null,"Percentage Variation based on Proposed Type"]
[]
[null,null,null,"Rail Trail",null,null,-0.03,{"$f":"SUMIF($E$7:$H$7,D15&\"*\",$E$8:$H$8)","v":0}]
[null,null,null,"Roadway Sidepath",null,null,0.02,{"$f":"SUMIF($E$7:$H$7,D16,$E$8:$H$8)","v":0}]
[null,null,null,"Other SUP",null,null,0.01,0]
[]
[]
[null,null,null,"Base Percentage:",null,null,null,null,null,null,null,null,"DO NOT MOVE CELL"]
[null,null,null,0.03,{"$f":"IF(F21>=0,\"+\",\"-\")","v":{"$error":"#DIV/0!"}},{"$f":"(G15*H15+G16*H16+G17*H17)/SUM(H15:H17)","v":{"$error":"#DIV/0!"}},"=",{"$f":"D21+F21","v":{"$error":"#DIV/0!"}},null,null,null,null,{"$f":"H21*100","v":{"$error":"#DIV/0!"}}]
[]
[null,null,"Total Construction Cost:",null,null,{"$f":"SUM(SUMMARY!I13)","v":0},{"$f":"H21","v":{"$error":"#DIV/0!"}},"=",{"$f":"F23*G23","v":{"$error":"#DIV/0!"}}]
[null,null,"(Only path)"]
[]
[]
[]
[]
[]
[]
[]
[]
[]
[]
[]
[]
[]
[]
[null,null,null,"= Price not included in MassDOT Database."]
[]
[]
[]
[null,null,null,null,null,null,null,"Total Cost for TTCP",{"$f":"I23","v":{"$error":"#DIV/0!"}},"DOLLARS"]

{"sheet":"ASPHALT","index":8,"n_rows":43,"n_cols":11,"rows_kept":43,"cut":false,"hidden":true,"merged":[[1,8,1,9],[2,8,2,9],[42,5,42,7],[3,8,3,9],[13,6,13,7],[33,3,33,5],[8,3,8,5],[14,3,14,5],[23,3,23,5],[28,3,28,5],[20,3,20,5]]}
[]
[null,null,"CALC'D BY:","KA","DATE:","2021-06-02",null,"CITY:",{"$f":"AREA!I2","v":0}]
[null,null,"CHK'D BY:","KR","DATE:","2017-11-15",null,"PROJECT:",{"$f":"AREA!I3","v":0}]
[]
[]
[]
[null,null,null,null,null,null,"Shoulder Area",{"$f":"SUMIF('USER INTERFACE'!$G$21:$J$21,'USER INTERFACE'!$Q10,'USER INTERFACE'!$G$17:$J$17)*4","v":0},"SF"]
[]
[null,null,120.1,"UNCLASSIFIED EXCAVATION",null,null,{"$f":"SUM(G12:G13)","v":0},"CY",{"$f":"IF(VLOOKUP(C9,PRICES!$B$2:$J$9998,9,FALSE)<>0,VLOOKUP(C9,PRICES!$B$2:$J$9998,9,FALSE),VLOOKUP(C9,PRICES!$B$2:$H$9998,7,FALSE))","v":45.87},{"$f":"G9*I9","v":0}]
[]
[null,null,null,"Area (SF)","Depth (ft.)"]
[null,null,"Path",{"$f":"AREA!$H$16","v":0},{"$f":"1","v":1},"=",{"$f":"(D12*E12)/27","v":0},"CY"]
[null,null,"Shoulder",{"$f":"$H$7","v":0},1,"=",{"$f":"(D13*E13)/27","v":0},"CY"]
[]
[null,null,151,"GRAVEL BORROW",null,null,{"$f":"G18+G19","v":0},"CY",{"$f":"IF(VLOOKUP(C15,PRICES!$B$2:$J$9998,9,FALSE)<>0,VLOOKUP(C15,PRICES!$B$2:$J$9998,9,FALSE),VLOOKUP(C15,PRICES!$B$2:$H$9998,7,FALSE))","v":45.07},{"$f":"G15*I15","v":0}]
[]
[null,null,null,"Area (SF)","Depth (ft.)"]
[null,null,"Path",{"$f":"$D$12","v":0},{"$f":"8/12","v":0.66666666666666663},"=",{"$f":"(D18*E18)/27","v":0},"CY"]
[null,null,"Shoulder",{"$f":"$D$13","v":0},{"$f":"8/12","v":0.66666666666666663},"=",{"$f":"(D19*E19)/27","v":0},"CY"]
[]
[null,null,170,"FINE GRADING AND COMPACTING",null,null,{"$f":"G22","v":0},"SY",{"$f":"IF(VLOOKUP(C21,PRICES!$B$2:$J$9998,9,FALSE)<>0,VLOOKUP(C21,PRICES!$B$2:$J$9998,9,FALSE),VLOOKUP(C21,PRICES!$B$2:$H$9998,7,FALSE))","v":5.8},{"$f":"G21*I21","v":0}]
[null,null,null,{"$f":"$H$7/9","v":0},{"$f":"AREA!$I$16","v":0},"=",{"$f":"D22+E22","v":0},"SY"]
[]
[null,null,450.23,"SUPERPAVE SURFACE COURSE - 12.5 (SSC - 12.5)",null,null,{"$f":"ROUNDUP(G27,0)","v":0},"TON",{"$f":"IF(VLOOKUP(C24,PRICES!$B$2:$J$9998,9,FALSE)<>0,VLOOKUP(C24,PRICES!$B$2:$J$9998,9,FALSE),VLOOKUP(C24,PRICES!$B$2:$H$9998,7,FALSE))","v":118.58},{"$f":"G24*I24","v":0}]
[]
[null,null,"Area (SY)","Depth (in.)","Ton/sy/in",null,"Tons"]
[null,null,{"$f":"$D$12/9+$H$7/9","v":0},2,5.6000000000000001E-2,null,{"$f":"C27*D27*E27","v":0}]
[]
[null,null,450.31,"SUPERPAVE INTERMEDIATE COURSE - 12.5 (SIC - 12.5)",null,null,{"$f":"ROUNDUP(G32,0)","v":0},"TON",{"$f":"IF(VLOOKUP(C29,PRICES!$B$2:$J$9998,9,FALSE)<>0,VLOOKUP(C29,PRICES!$B$2:$J$9998,9,FALSE),VLOOKUP(C29,PRICES!$B$2:$H$9998,7,FALSE))","v":138.46},{"$f":"G29*I29","v":0}]
[]
[null,null,"Area (SY)","Depth (in.)","Ton/sy/in",null,"Tons"]
[null,null,{"$f":"$D$12/9+$H$7/9","v":0},2,5.6000000000000001E-2,null,{"$f":"C32*D32*E32","v":0}]
[]
[null,null,null,null,null,null,null,null,null,null,{"$f":"G34*J34","v":0}]
[]
[]
[]
[]
[]
[]
[]
[]
[null,null,null,null,null,"Total Cost for Asphalt",null,null,{"$f":"SUM(J8:J41)","v":0},"DOLLARS"]

{"sheet":"POROUS ASPHALT","index":9,"n_rows":43,"n_cols":10,"rows_kept":43,"cut":false,"hidden":true,"merged":[[1,8,1,9],[2,8,2,9],[3,8,3,9],[12,6,12,7],[8,3,8,5],[13,3,13,5],[23,3,23,5],[31,3,31,5],[27,3,27,5],[18,3,18,5]]}
[]
[null,null,"CALC'D BY:","KA","DATE:","2017-10-31",null,"CITY:",{"$f":"AREA!I2","v":0}]
[null,null,"CHK'D BY:","KR","DATE:","2017-11-15",null,"PROJECT:",{"$f":"AREA!I3","v":0}]
[]
[]
[]
[null,null,null,null,null,null,"Shoulder Area",{"$f":"SUMIF('USER INTERFACE'!$G$21:$J$21,'USER INTERFACE'!$Q11,'USER INTERFACE'!$G$17:$J$17)*4","v":0},"SF"]
[]
[null,null,120.1,"UNCLASSIFIED EXCAVATION",null,null,{"$f":"SUM(G11:G12)","v":0},"CY",{"$f":"IF(VLOOKUP(C9,PRICES!$B$2:$J$9998,9,FALSE)<>0,VLOOKUP(C9,PRICES!$B$2:$J$9998,9,FALSE),VLOOKUP(C9,PRICES!$B$2:$H$9998,7,FALSE))","v":45.87},{"$f":"G9*I9","v":0}]
[null,null,null,"Area (SF)","Depth (ft.)"]
[null,null,"Path",{"$f":"AREA!$H$17","v":0},{"$f":"1","v":1},"=",{"$f":"(D11*E11)/27","v":0},"CY"]
[null,null,"Shoulder",{"$f":"$H$7","v":0},{"$f":"1","v":1},"=",{"$f":"(D12*E12)/27","v":0},"CY"]
[]
[null,null,156.01,"#67 CRUSHED STONE FILTER BASE COURSE",null,null,{"$f":"SUM(G16:G17)","v":0},"CY",50,{"$f":"G14*I14","v":0}]
[null,null,null,"Area (SF)","Depth (ft.)"]
[null,null,"Path",{"$f":"$D$11","v":0},{"$f":"2/12","v":0.16666666666666666},"=",{"$f":"(D16*E16)/27","v":0},"CY"]
[null,null,"Shoulder",{"$f":"$H$7","v":0},{"$f":"2/12","v":0.16666666666666666},"=",{"$f":"(D17*E17)/27","v":0},"CY"]
[]
[null,null,156.02000000000001,"#57 CRUSHED STONE RESERVOIR SUB-BASE COURSE",null,null,{"$f":"SUM(G21:G22)","v":0},"CY",55,{"$f":"G19*I19","v":0}]
[null,null,null,"Area (SF)","Depth (ft.)"]
[null,null,"Path",{"$f":"$D$11","v":0},1,"=",{"$f":"(D21*E21)/27","v":0},"CY"]
[null,null,"Shoulder",{"$f":"$H$7","v":0},1,"=",{"$f":"(D22*E22)/27","v":0},"CY"]
[]
[null,null,450.14,"WMA POROUS PAVEMENT SURFACE COURSE",null,null,{"$f":"ROUNDUP(G26,0)","v":0},"TON",140,{"$f":"G24*I24","v":0}]
[null,null,"Area (SY)","Depth (in.)","Ton/sy/in",null,"Tons"]
[null,null,{"$f":"$D$11/9+$H$7/9","v":0},2,5.6000000000000001E-2,null,{"$f":"C26*D26*E26","v":0}]
[]
[null,null,450.16,"WMA POROUS PAVEMENT BASE COURSE",null,null,{"$f":"ROUNDUP(G30,0)","v":0},"TON",140,{"$f":"G28*I28","v":0}]
[null,null,"Area (SY)","Depth (in.)","Ton/sy/in",null,"Tons"]
[null,null,{"$f":"$D$11/9+$H$7/9","v":0},2,5.6000000000000001E-2,null,{"$f":"C30*D30*E30","v":0}]
[]
[null,null,698.1,"GEOTEXTILE FABRIC FOR STABILIZATION",null,null,{"$f":"SUM(H36:H37)","v":0},"SY",{"$f":"IF(VLOOKUP(C32,PRICES!$B$2:$J$9998,9,FALSE)<>0,VLOOKUP(C32,PRICES!$B$2:$J$9998,9,FALSE),VLOOKUP(C32,PRICES!$B$2:$H$9998,7,FALSE))","v":6.17},{"$f":"G32*I32","v":0}]
[]
[null,null,null,"Total Length","Depth of Fabric (ft)","Total Area of Side (SF)"]
[null,null,null,{"$f":"AREA!$H$38","v":0},{"$f":"7/6","v":1.1666666666666667},{"$f":"D35*E35","v":0}]
[null,null,"Fabric on sides of the trenches",null,null,null,null,{"$f":"F35/9","v":0},"SY"]
[null,null,"Fabric on bottom of trenches (total area of Porous Pavement)",null,null,null,null,{"$f":"$D$11/9+$H$7/9","v":0},"SY"]
[]
[]
[]
[]
[null,null,null,"= Price not included in MassDOT Database."]
[null,null,null,null,null,null,null,"Total Cost for Porous Asphalt",{"$f":"SUM(J8:J41)","v":0},"DOLLARS"]

{"sheet":"STONE DUST","index":10,"n_rows":43,"n_cols":10,"rows_kept":43,"cut":false,"hidden":true,"merged":[[42,5,42,7],[1,8,1,9],[2,8,2,9],[3,8,3,9],[7,3,7,5],[32,3,32,5],[26,3,26,5]]}
[]
[null,null,"CALC'D BY:","KA","DATE:","2017-10-31",null,"CITY:",{"$f":"AREA!I2","v":0}]
[null,null,"CHK'D BY:","KR","DATE:","2017-11-15",null,"PROJECT:",{"$f":"AREA!I3","v":0}]
[]
[]
[]
[null,null,null,null,null,null,"Shoulder Area",{"$f":"SUMIF('USER INTERFACE'!$G$21:$J$21,'USER INTERFACE'!$Q12,'USER INTERFACE'!$G$17:$J$17)*4","v":0},"SF"]
[null,null,704.12,"STONE DUST PAVEMENT",null,null,{"$f":"G17","v":0},"TONS",30,{"$f":"G8*I8","v":0}]
[]
[null,null,"SHOULDER"]
[null,null,null,null,"Area","=",{"$f":"$H$7/9","v":0},"SY"]
[null,null,"PATH"]
[null,null,null,null,"Area","=",{"$f":"AREA!$I$18","v":0},"SY"]
[]
[null,null,null,"Stone Dust Total"]
[null,null,null,"Area (SY)","Depth (in.)","Ton/sy/in","Tons"]
[null,null,null,{"$f":"G11+G13","v":0},4,{"$f":"1.5/36","v":4.1666666666666664E-2},{"$f":"D17*E17*F17","v":0}]
[]
[null,null,null,null,"**2' shoulders on each side"]
[]
[]
[null,null,"EQUESTRIAN TRAIL"]
[null,null,"10' width assumed - 2\" stone dust over 6\" gravel"]
[]
[null,null,null,null,"Length of unpaved","=",{"$f":"SUMIF('USER INTERFACE'!G23:J23,'USER INTERFACE'!$U$33,'USER INTERFACE'!$G$17:$J$17)","v":0},"FT"]
[]
[null,null,704.12,"STONE DUST PAVEMENT",null,null,{"$f":"G31","v":0},"TONS",30,{"$f":"G27*I27","v":0}]
[]
[null,null,null,"Stone Dust Total"]
[null,null,null,"Area (SY)","Depth (in.)","Ton/sy/in","Tons"]
[null,null,null,{"$f":"$G$25*10/9","v":0},2,{"$f":"1.5/36","v":4.1666666666666664E-2},{"$f":"D31*E31*F31","v":0}]
[]
[null,null,151,"GRAVEL BORROW",null,null,{"$f":"G37","v":0},"CY",{"$f":"IF(VLOOKUP(C33,PRICES!$B$2:$J$9998,9,FALSE)<>0,VLOOKUP(C33,PRICES!$B$2:$J$9998,9,FALSE),VLOOKUP(C33,PRICES!$B$2:$H$9998,7,FALSE))","v":45.07},{"$f":"G33*I33","v":0}]
[]
[null,null,null,null,null,"Area",{"$f":"$D$31","v":0},"SY"]
[null,null,null,null,null,"6\" depth",0.5,"FT"]
[null,null,null,null,null,null,{"$f":"G35*G36/3","v":0},"CY"]
[]
[]
[null,null,null,"= Price not included in MassDOT Database."]
[]
[]
[null,null,null,null,null,"Total Cost for Stone Dust",null,null,{"$f":"SUM(J8:J41)","v":0},"DOLLARS"]

{"sheet":"STABILIZED AGG","index":11,"n_rows":43,"n_cols":16,"rows_kept":43,"cut":false,"hidden":true,"merged":[[28,6,28,7],[8,3,8,5],[13,6,13,7],[14,3,14,5],[1,8,1,9],[2,8,2,9],[3,8,3,9],[20,3,20,5],[24,6,24,7]]}
[]
[null,null,"CALC'D BY:","KA","DATE:","2018-02-14",null,"CITY:",{"$f":"AREA!I2","v":0}]
[null,null,"CHK'D BY:",null,"DATE:",null,null,"PROJECT:",{"$f":"AREA!I3","v":0}]
[]
[]
[]
[null,null,null,null,null,null,"Path Area",{"$f":"AREA!$H$20","v":0},"SF"]
[null,null,null,null,null,null,"Shoulder Area",{"$f":"SUMIF('USER INTERFACE'!$G$21:$J$21,'USER INTERFACE'!$Q14,'USER INTERFACE'!$G$17:$J$17)*4","v":0},"SF"]
[null,null,120.1,"UNCLASSIFIED EXCAVATION",null,null,{"$f":"SUM(G12:G13)","v":0},"CY",{"$f":"IF(VLOOKUP(C9,PRICES!$B$2:$J$9998,9,FALSE)<>0,VLOOKUP(C9,PRICES!$B$2:$J$9998,9,FALSE),VLOOKUP(C9,PRICES!$B$2:$H$9998,7,FALSE))","v":45.87},{"$f":"G9*I9","v":0}]
[]
[null,null,null,"Area (SF)","Depth (ft.)"]
[null,null,"Path",{"$f":"$H$7","v":0},{"$f":"1","v":1},"=",{"$f":"(D12*E12)/27","v":0},"CY"]
[null,null,"Shoulder",{"$f":"$H$8","v":0},{"$f":"1","v":1},"=",{"$f":"(D13*E13)/27","v":0},"CY"]
[]
[null,null,151,"GRAVEL BORROW",null,null,{"$f":"G18+G19","v":0},"CY",{"$f":"IF(VLOOKUP(C15,PRICES!$B$2:$J$9998,9,FALSE)<>0,VLOOKUP(C15,PRICES!$B$2:$J$9998,9,FALSE),VLOOKUP(C15,PRICES!$B$2:$H$9998,7,FALSE))","v":45.07},{"$f":"G15*I15","v":0}]
[]
[null,null,null,"Area (SF)","Depth (ft.)"]
[null,null,"Path",{"$f":"$H$7","v":0},{"$f":"8/12","v":0.66666666666666663},"=",{"$f":"(D18*E18)/27","v":0},"CY"]
[null,null,"Shoulder",{"$f":"$H$8","v":0},{"$f":"8/12","v":0.66666666666666663},"=",{"$f":"(D19*E19)/27","v":0},"CY"]
[]
[null,null,704.01,"STABILIZED AGGREGATE",null,null,{"$f":"G24","v":0},"SY",44,{"$f":"G21*I21","v":0}]
[]
[null,null,null,null,"Total Area","=",{"$f":"SUM(H7:H8)","v":0},"SF"]
[null,null,null,null,null,"=",{"$f":"G23/9","v":0},"SY"]
[]
[null,null,"Aggregate layer is 4\" over a gravel sub-grade, $44/SY cost is from DCR.",null,null,null,null,null,null,null,null,null,"Stabilized Aggregate Total"]
[null,null,null,null,null,null,null,null,null,null,null,null,"Area (SY)","Depth (in.)","Ton/sy/in","Tons"]
[null,null,null,null,null,null,null,null,null,null,null,null,{"$f":"G24","v":0},4,{"$f":"1.5/36","v":4.1666666666666664E-2},{"$f":"M28*N28*O28","v":0}]
[]
[]
[]
[]
[]
[]
[]
[]
[]
[]
[]
[null,null,null,"= Price not included in MassDOT Database."]
[]
[]
[null,null,null,null,null,null,null,"Total Cost for Stabilized Aggregate",{"$f":"SUM(J7:J42)","v":0},"DOLLARS"]

{"sheet":"CONCRETE","index":12,"n_rows":43,"n_cols":13,"rows_kept":43,"cut":false,"hidden":true,"merged":[[13,3,13,5],[1,8,1,9],[2,8,2,9],[3,8,3,9],[7,3,7,5],[12,6,12,7],[42,5,42,7],[28,3,28,5],[30,3,30,5],[19,3,19,5],[24,3,24,5],[34,3,34,5],[35,3,35,5],[29,3,29,5]]}
[]
[null,null,"CALC'D BY:","KA","DATE:","2017-10-13",null,"CITY:",{"$f":"AREA!I2","v":0}]
[null,null,"CHK'D BY:","KR","DATE:","2017-11-15",null,"PROJECT:",{"$f":"AREA!I3","v":0}]
[]
[]
[]
[null,null,null,null,null,null,"Shoulder Area",{"$f":"SUMIF('USER INTERFACE'!$G$21:$J$21,'USER INTERFACE'!$Q13,'USER INTERFACE'!$G$17:$J$17)*4","v":0},"SF"]
[null,null,120.1,"UNCLASSIFIED EXCAVATION",null,null,{"$f":"G11+G12","v":0},"CY",{"$f":"IF(VLOOKUP(C8,PRICES!$B$2:$J$9998,9,FALSE)<>0,VLOOKUP(C8,PRICES!$B$2:$J$9998,9,FALSE),VLOOKUP(C8,PRICES!$B$2:$H$9998,7,FALSE))","v":45.87},{"$f":"G8*I8","v":0}]
[]
[null,null,null,"Area (SF)","Depth (ft.)"]
[null,null,"Path",{"$f":"AREA!$H$19","v":0},{"$f":"1","v":1},"=",{"$f":"(D11*E11)/27","v":0},"CY"]
[null,null,"Shoulder",{"$f":"$H$7","v":0},{"$f":"1","v":1},"=",{"$f":"(D12*E12)/27","v":0},"CY"]
[]
[null,null,151,"GRAVEL BORROW",null,null,{"$f":"G17+G18","v":0},"CY",{"$f":"IF(VLOOKUP(C14,PRICES!$B$2:$J$9998,9,FALSE)<>0,VLOOKUP(C14,PRICES!$B$2:$J$9998,9,FALSE),VLOOKUP(C14,PRICES!$B$2:$H$9998,7,FALSE))","v":45.07},{"$f":"G14*I14","v":0}]
[]
[null,null,null,"Area (SF)","Depth (ft.)"]
[null,null,"Path",{"$f":"$D$11","v":0},{"$f":"8/12","v":0.66666666666666663},"=",{"$f":"(D17*E17)/27","v":0},"CY"]
[null,null,"Shoulder",{"$f":"$H$7","v":0},{"$f":"8/12","v":0.66666666666666663},"=",{"$f":"(D18*E18)/27","v":0},"CY"]
[]
[null,null,440,"CALCIUM CHLORIDE FOR ROADWAY DUST CONTROL",null,null,{"$f":"ROUNDUP(E23,0)","v":0},"LBS",{"$f":"IF(VLOOKUP(C20,PRICES!$B$2:$J$9998,9,FALSE)<>0,VLOOKUP(C20,PRICES!$B$2:$J$9998,9,FALSE),VLOOKUP(C20,PRICES!$B$2:$H$9998,7,FALSE))","v":0.42},{"$f":"G20*I20","v":0}]
[]
[null,null,"Area (SY)","LBS/SY","LBS"]
[null,null,{"$f":"$D$11/9+$H$7/9","v":0},1.5,{"$f":"C23*D23","v":0}]
[]
[null,null,170,"FINE GRADING AND COMPACTING",null,null,{"$f":"G27","v":0},"SY",{"$f":"IF(VLOOKUP(C25,PRICES!$B$2:$J$9998,9,FALSE)<>0,VLOOKUP(C25,PRICES!$B$2:$J$9998,9,FALSE),VLOOKUP(C25,PRICES!$B$2:$H$9998,7,FALSE))","v":5.8},{"$f":"G25*I25","v":0}]
[]
[null,null,null,null,{"$f":"C23","v":0},"=",{"$f":"E27","v":0},"SY"]
[]
[]
[null,null,701,"CEMENT CONCRETE SIDEWALKS",null,null,{"$f":"G32","v":0},"SY",{"$f":"IF(VLOOKUP(C30,PRICES!$B$2:$J$9998,9,FALSE)<>0,VLOOKUP(C30,PRICES!$B$2:$J$9998,9,FALSE),VLOOKUP(C30,PRICES!$B$2:$H$9998,7,FALSE))","v":64.790000000000006},{"$f":"G30*I30","v":0}]
[]
[null,null,null,null,{"$f":"C23","v":0},"=",{"$f":"E32","v":0},"SY"]
[]
[]
[]
[]
[]
[null,null,null,null,null,null,null,null,null,null,null,null,{"$f":"I43/4000","v":0}]
[]
[]
[]
[]
[null,null,null,null,null,"Total Cost for Concrete",null,null,{"$f":"SUM(J7:J42)","v":0},"DOLLARS"]

{"sheet":"CRUSHED STONE","index":13,"n_rows":43,"n_cols":10,"rows_kept":43,"cut":false,"hidden":true,"merged":[[25,3,25,5],[1,8,1,9],[2,8,2,9],[3,8,3,9],[7,3,7,5],[12,3,12,5]]}
[]
[null,null,"CALC'D BY:","KA","DATE:","2017-10-31",null,"CITY:",{"$f":"AREA!I2","v":0}]
[null,null,"CHK'D BY:","KR","DATE:","2017-11-15",null,"PROJECT:",{"$f":"AREA!I3","v":0}]
[]
[]
[]
[null,null,null,null,null,null,"Shoulder Area",{"$f":"SUMIF('USER INTERFACE'!$G$21:$J$21,'USER INTERFACE'!$Q15,'USER INTERFACE'!$G$17:$J$17)*4","v":0},"SF"]
[null,null,156,"CRUSHED STONE",null,null,{"$f":"G20","v":0},"TONS",{"$f":"IF(VLOOKUP(C8,PRICES!$B$2:$J$9998,9,FALSE)<>0,VLOOKUP(C8,PRICES!$B$2:$J$9998,9,FALSE),VLOOKUP(C8,PRICES!$B$2:$H$9998,7,FALSE))","v":49.3},{"$f":"G8*I8","v":0}]
[]
[null,null,"SHOULDER"]
[null,null,null,null,"Area","=",{"$f":"$H$7/9","v":0},"SY"]
[]
[null,null,120.1,"UNCLASSIFIED EXCAVATION",null,null,{"$f":"G16","v":0},"CY",{"$f":"IF(VLOOKUP(C13,PRICES!$B$2:$J$9998,9,FALSE)<>0,VLOOKUP(C13,PRICES!$B$2:$J$9998,9,FALSE),VLOOKUP(C13,PRICES!$B$2:$H$9998,7,FALSE))","v":45.87},{"$f":"G13*I13","v":0}]
[]
[null,null,null,"Area (SF)","Depth (ft.)"]
[null,null,"Shoulder",{"$f":"H7","v":0},{"$f":"E20/12","v":0.33333333333333331},"=",{"$f":"(D16*E16)/27","v":0},"CY"]
[]
[null,null,null,"Crushed Stone Total"]
[null,null,null,"Area (SY)","Depth (in.)","Ton/sy/in","Tons"]
[null,null,null,{"$f":"G11","v":0},4,5.6000000000000001E-2,{"$f":"D20*E20*F20","v":0}]
[]
[null,null,null,null,"**2' shoulders on each side"]
[]
[]
[]
[]
[]
[]
[]
[]
[]
[]
[]
[]
[]
[null,null,null,"= Price not included in MassDOT Database."]
[]
[]
[]
[]
[]
[]
[null,null,null,null,null,null,null,"Total Cost for Crushed Stone",{"$f":"SUM(J7:J42)","v":0},"DOLLARS"]

{"sheet":"MULCH","index":14,"n_rows":43,"n_cols":13,"rows_kept":43,"cut":false,"hidden":true,"merged":[[17,3,17,5],[1,8,1,9],[2,8,2,9],[3,8,3,9],[7,3,7,5],[12,3,12,5]]}
[]
[null,null,"CALC'D BY:","KA","DATE:","2017-10-31",null,"CITY:",{"$f":"AREA!I2","v":0}]
[null,null,"CHK'D BY:","KR","DATE:","2017-11-15",null,"PROJECT:",{"$f":"AREA!I3","v":0}]
[]
[]
[]
[null,null,null,null,null,null,"Shoulder Area",{"$f":"SUMIF('USER INTERFACE'!$G$21:$J$21,'USER INTERFACE'!$Q17,'USER INTERFACE'!$G$17:$J$17)*4","v":0},"SF"]
[null,null,769,"PAVEMENT MILLING MULCH",null,null,{"$f":"G11","v":0},"FT",{"$f":"IF(VLOOKUP(C8,PRICES!$B$2:$J$9998,9,FALSE)<>0,VLOOKUP(C8,PRICES!$B$2:$J$9998,9,FALSE),VLOOKUP(C8,PRICES!$B$2:$H$9998,7,FALSE))","v":9.66},{"$f":"G8*I8","v":0},null,null,1631]
[]
[null,null,"Milling Mulch Shoulder"]
[null,null,null,null,"Length","=",{"$f":"$H$7/4","v":0},"FT","| 2' shoulders each side"]
[]
[null,null,120.1,"UNCLASSIFIED EXCAVATION",null,null,{"$f":"G16","v":0},"CY",{"$f":"IF(VLOOKUP(C13,PRICES!$B$2:$J$9998,9,FALSE)<>0,VLOOKUP(C13,PRICES!$B$2:$J$9998,9,FALSE),VLOOKUP(C13,PRICES!$B$2:$H$9998,7,FALSE))","v":45.87},{"$f":"G13*I13","v":0}]
[]
[null,null,null,"Area (SF)","Depth (ft.)"]
[null,null,"Shoulder",{"$f":"H7","v":0},{"$f":"4/12","v":0.33333333333333331},"=",{"$f":"(D16*E16)/27","v":0},"CY"]
[]
[null,null,151,"GRAVEL BORROW",null,null,{"$f":"G21","v":0},"CY",{"$f":"IF(VLOOKUP(C18,PRICES!$B$2:$J$9998,9,FALSE)<>0,VLOOKUP(C18,PRICES!$B$2:$J$9998,9,FALSE),VLOOKUP(C18,PRICES!$B$2:$H$9998,7,FALSE))","v":45.07},{"$f":"G18*I18","v":0}]
[]
[null,null,null,"Area (SF)","Depth (ft.)"]
[null,null,"Shoulder",{"$f":"H7","v":0},{"$f":"4/12","v":0.33333333333333331},"=",{"$f":"(D21*E21)/27","v":0},"CY"]
[]
[]
[]
[]
[]
[]
[]
[]
[]
[]
[]
[]
[]
[]
[null,null,null,"= Price not included in MassDOT Database."]
[]
[]
[]
[]
[]
[]
[null,null,null,null,null,null,null,"Total Cost for Milling Mulch",{"$f":"SUM(J7:J42)","v":0},"DOLLARS"]

{"sheet":"MISC","index":15,"n_rows":43,"n_cols":13,"rows_kept":43,"cut":false,"hidden":true,"merged":[[31,3,31,5],[28,3,28,5],[7,3,7,5],[1,8,1,9],[2,8,2,9],[3,8,3,9],[14,3,14,5],[15,3,15,5]]}
[]
[null,null,"CALC'D BY:","KA","DATE:","2017-10-31",null,"CITY:",{"$f":"AREA!I2","v":0}]
[null,null,"CHK'D BY:","KR","DATE:","2017-11-15",null,"PROJECT:",{"$f":"AREA!I3","v":0}]
[]
[]
[]
[]
[null,null,665.3,"WOOD RAIL FENCE",null,null,{"$f":"SUM(H11:H14)","v":0},"FT",50,{"$f":"G8*I8","v":0}]
[null,null,"Assume 50% of path has afence on both sides if hilly or waterfront, otherwise 25%. 100% for boardwalk."]
[]
[null,null,"Boardwalk length",{"$f":"AREA!H33","v":0},2,1,"=",{"$f":"(D11*E11)*F11","v":0}]
[null,null,"Wooded/hilly length",{"$f":"SUMIF('USER INTERFACE'!$G$18:$J$18,'USER INTERFACE'!$X$24,'USER INTERFACE'!$G$17:$J$17)","v":0},2,0.5,"=",{"$f":"(D12*E12)*F12","v":0}]
[null,null,"Waterfront length",{"$f":"SUMIF('USER INTERFACE'!$G$18:$J$18,'USER INTERFACE'!$X$25,'USER INTERFACE'!$G$17:$J$17)","v":0},2,0.5,"=",0]
[null,null,"Remaining length",{"$f":"AREA!H31-MISC!D13-MISC!D12","v":0},2,0.25,"=",0]
[]
[null,null,751,"LOAM BORROW",null,null,{"$f":"G27","v":0},"CY",{"$f":"IF(VLOOKUP(C16,PRICES!$B$2:$J$9998,9,FALSE)<>0,VLOOKUP(C16,PRICES!$B$2:$J$9998,9,FALSE),VLOOKUP(C16,PRICES!$B$2:$H$9998,7,FALSE))","v":66.11},{"$f":"G16*I16","v":0}]
[]
[null,null,null,null,null,null,"Grass shoulder Area:",{"$f":"SUMIF('USER INTERFACE'!$G$21:$J$21,'USER INTERFACE'!$Q16,'USER INTERFACE'!$G$17:$J$17)","v":0},"SF"]
[null,null,null,null,null,null,"Equestrian Grass Area, assume 10' W:",{"$f":"SUMIF('USER INTERFACE'!G23:J23,'USER INTERFACE'!$U$32,'USER INTERFACE'!$G$17:$J$17)*10","v":0},"SF"]
[]
[null,null,null,null,null,"Shoulder + Equestrian Trail:",{"$f":"SUM(H18:H19)","v":0},"SF"]
[null,null,null,null,null,"Loam Depth:",{"$f":"4/12","v":0.33333333333333331},"FT"]
[null,null,null,null,null,"Total",{"$f":"((G21*G22)/27)","v":0},"CY"]
[null,null,null,null,null,"Contingency",{"$f":"IF(G21=0,0,10)","v":0},"CY"]
[null,null,null,null,null,"Total",{"$f":"G23+G24","v":0},"CY"]
[null,null,null,null,null,"+ 25% SWELL",{"$f":"G25*0.25","v":0}]
[null,null,null,null,null,"Total = ",{"$f":"SUM(G25:G26)","v":0},"CY"]
[]
[null,null,765,"SEEDING",null,null,{"$f":"G21/9","v":0},"SY",{"$f":"IF(VLOOKUP(C29,PRICES!$B$2:$J$9998,9,FALSE)<>0,VLOOKUP(C29,PRICES!$B$2:$J$9998,9,FALSE),VLOOKUP(C29,PRICES!$B$2:$H$9998,7,FALSE))","v":1.83},{"$f":"G29*I29","v":0}]
[null,null,"Include clearing & grubbing for equestrian trails + paths through woods"]
[]
[null,null,101,"CLEARING AND GRUBBING",null,null,{"$f":"SUM(H38)/43560","v":0},"A",{"$f":"IF(VLOOKUP(C32,PRICES!$B$2:$J$9998,9,FALSE)<>0,VLOOKUP(C32,PRICES!$B$2:$J$9998,9,FALSE),VLOOKUP(C32,PRICES!$B$2:$H$9998,7,FALSE))","v":35950.71},{"$f":"G32*I32","v":0}]
[null,null,"Assume average width + 20' (4' shld+6' grading+10' beyond LOG) or average width + 10' for equestrian.",null,null,null,null,null,null,null,null,null,"Average Rail Trail Width"]
[null,null,null,null,null,"Ave width (ft)","Length (ft)",null,null,null,null,null,{"$f":"SUMIF('USER INTERFACE'!G19:J19,\"Rail \"&\"*\",'USER INTERFACE'!$G$22:$J$22)/COUNTIF('USER INTERFACE'!G19:J19,\"Rail \"&\"*\")","v":{"$error":"#DIV/0!"}}]
[null,null,null,"Rail Trail or Rail w/ Trail Area",20,{"$f":"IF(SUMIF('USER INTERFACE'!G19:J19,\"Rail \"&\"*\"<>0,'USER INTERFACE'!$G$22:$J$22)<>0,(SUMIF('USER INTERFACE'!G19:J19,\"Rail \"&\"*\",'USER INTERFACE'!$G$22:$J$22)/COUNTIF('USER INTERFACE'!G19:J19,\"Rail \"&\"*\")),0)","v":0},{"$f":"SUMIF('USER INTERFACE'!G19:J19,\"Rail \"&\"*\",'USER INTERFACE'!$G$17:$J$17)","v":0},{"$f":"(E35+F35)*G35","v":0},"SF"]
[null,null,null,"Wooded Area",20,{"$f":"IF(SUMIF('USER INTERFACE'!G19:J19,\"Rail \"&\"*\"<>0,'USER INTERFACE'!$G$22:$J$22)<>0,SUMIF('USER INTERFACE'!$G$18:$J$18,'USER INTERFACE'!$X$24,'USER INTERFACE'!$G$22:$J$22)/COUNTIF('USER INTERFACE'!$G$18:$J$18,'USER INTERFACE'!$X$24),0)","v":0},{"$f":"SUMIF('USER INTERFACE'!$G$18:$J$18,'USER INTERFACE'!$X$24,'USER INTERFACE'!$G$17:$J$17)","v":0},{"$f":"(E36+F36)*G36","v":0},"SF"]
[null,null,null,"Equestrian Area",10,{"$f":"SUMIF('USER INTERFACE'!G23:J23,\"<>No\",'USER INTERFACE'!$G$22:$J$22)/COUNTIF('USER INTERFACE'!G23:J23,\"<>No\")","v":0},{"$f":"SUMIF('USER INTERFACE'!G23:J23,\"<>No\",'USER INTERFACE'!$G$17:$J$17)","v":0},{"$f":"(E37+F37)*G37","v":0},"SF"]
[null,null,null,null,null,null,null,{"$f":"SUM(H35:H37)","v":0},"SF"]
[]
[null,null,null,"= Price not included in MassDOT Database."]
[]
[]
[null,null,null,null,null,null,null,"Total Cost for Fence/Curbing/Edging",{"$f":"SUM(J7:K40)","v":0},"DOLLARS"]

{"sheet":"INTERSECTIONS","index":16,"n_rows":43,"n_cols":10,"rows_kept":43,"cut":false,"hidden":true,"merged":[[1,8,1,9],[2,8,2,9],[3,8,3,9],[10,6,10,7],[7,3,7,5],[27,3,27,5],[42,5,42,7],[11,3,11,5],[20,3,20,5],[16,3,16,5],[19,3,19,5],[12,3,12,5],[24,3,24,5],[33,3,33,5],[35,3,35,5],[28,3,28,5],[29,3,29,5],[26,3,26,5],[37,3,37,5]]}
[]
[null,null,"CALC'D BY:","KA","DATE:","2017-10-16",null,"CITY:",{"$f":"AREA!I2","v":0}]
[null,null,"CHK'D BY:","KR","DATE:","2017-11-15",null,"PROJECT:",{"$f":"AREA!I3","v":0}]
[]
[]
[null,null,"# WCRs",{"$f":"'USER INTERFACE'!$I$31*2","v":0}]
[]
[null,null,151,"GRAVEL BORROW",null,null,{"$f":"G10","v":0},"CY",{"$f":"IF(VLOOKUP(C8,PRICES!$B$2:$J$9998,9,FALSE)<>0,VLOOKUP(C8,PRICES!$B$2:$J$9998,9,FALSE),VLOOKUP(C8,PRICES!$B$2:$H$9998,7,FALSE))","v":45.07},{"$f":"G8*I8","v":0}]
[null,null,"Area (SF)","x","Depth (ft.)"]
[null,null,{"$f":"AREA!$H$14","v":0},null,{"$f":"8/12","v":0.66666666666666663},"=",{"$f":"(C10*E10)/27","v":0},"CY"]
[]
[null,null,170,"FINE GRADING AND COMPACTING",null,null,{"$f":"G15","v":0},"SY",{"$f":"IF(VLOOKUP(C12,PRICES!$B$2:$J$9998,9,FALSE)<>0,VLOOKUP(C12,PRICES!$B$2:$J$9998,9,FALSE),VLOOKUP(C12,PRICES!$B$2:$H$9998,7,FALSE))","v":5.8},{"$f":"G12*I12","v":0}]
[null,null,701.2,"CEMENT CONCRETE SIDEWALKS FOR WCR",null,null,{"$f":"G15","v":0},"SY",{"$f":"IF(VLOOKUP(C13,PRICES!$B$2:$J$9998,9,FALSE)<>0,VLOOKUP(C13,PRICES!$B$2:$J$9998,9,FALSE),VLOOKUP(C13,PRICES!$B$2:$H$9998,7,FALSE))","v":100.92},{"$f":"G13*I13","v":0}]
[]
[null,null,null,"From Area Summary:",{"$f":"AREA!$I$14","v":0},"=",{"$f":"E15","v":0},"SY"]
[]
[null,null,440,"CALCIUM CHLORIDE FOR ROADWAY DUST CONTROL",null,null,{"$f":"ROUNDUP(E19,0)","v":0},"LBS",{"$f":"IF(VLOOKUP(C17,PRICES!$B$2:$J$9998,9,FALSE)<>0,VLOOKUP(C17,PRICES!$B$2:$J$9998,9,FALSE),VLOOKUP(C17,PRICES!$B$2:$H$9998,7,FALSE))","v":0.42},{"$f":"G17*I17","v":0}]
[null,null,"Area (SY)","LBS/SY","LBS"]
[null,null,{"$f":"AREA!$I$14","v":0},1.5,{"$f":"C19*D19","v":0}]
[]
[null,null,509,"GRANITE TRANSITION CURB FOR WCR - STRAIGHT",null,null,{"$f":"G23","v":0},"FT",{"$f":"IF(VLOOKUP(C21,PRICES!$B$2:$J$9998,9,FALSE)<>0,VLOOKUP(C21,PRICES!$B$2:$J$9998,9,FALSE),VLOOKUP(C21,PRICES!$B$2:$H$9998,7,FALSE))","v":54.15},{"$f":"G21*I21","v":0}]
[]
[null,null,null,{"$f":"$D$6","v":0},{"$f":"6.5*2","v":13},"=",{"$f":"D23*E23","v":0},"FT"]
[]
[null,null,874,"STREET NAME SIGN",null,null,{"$f":"G26","v":0},"EA",{"$f":"IF(VLOOKUP(C25,PRICES!$B$2:$J$9998,9,FALSE)<>0,VLOOKUP(C25,PRICES!$B$2:$J$9998,9,FALSE),VLOOKUP(C25,PRICES!$B$2:$H$9998,7,FALSE))","v":118.63},{"$f":"G25*I25","v":0}]
[null,null,null,null,null,"At each approach:",{"$f":"'USER INTERFACE'!$I$31","v":0}]
[]
[null,null,866.11199999999997,"12 INCH REFLECTORIZED WHITE LINE (THERMOPLASTIC)",null,null,{"$f":"G40","v":0},"FT",{"$f":"IF(VLOOKUP(C28,PRICES!$B$2:$J$9998,9,FALSE)<>0,VLOOKUP(C28,PRICES!$B$2:$J$9998,9,FALSE),VLOOKUP(C28,PRICES!$B$2:$H$9998,7,FALSE))","v":5.32},{"$f":"G28*I28","v":0}]
[]
[null,null,867.11199999999997,"12 INCH REFLECTORIZED YELLOW LINE (THERMOPLASTIC)",null,null,{"$f":"G32","v":0},"FT",{"$f":"IF(VLOOKUP(C30,PRICES!$B$2:$J$9998,9,FALSE)<>0,VLOOKUP(C30,PRICES!$B$2:$J$9998,9,FALSE),VLOOKUP(C30,PRICES!$B$2:$H$9998,7,FALSE))","v":4.72},{"$f":"G30*I30","v":0}]
[]
[null,null,null,null,null,"20' line before each crossing:",{"$f":"$G$26*20","v":0},"FT"]
[]
[null,null,"###.###","RRFB",null,null,{"$f":"COUNTIF('USER INTERFACE'!$Q$60:$R$79,\"RRFB\")","v":0},"EA",20000,{"$f":"G34*I34","v":0}]
[]
[null,null,"###.###","HAWK",null,null,{"$f":"COUNTIF('USER INTERFACE'!$Q$60:$R$79,\"HAWK\")","v":0},"EA",75000,{"$f":"G36*I36","v":0}]
[]
[null,null,"###.###","FULL SIGNALIZATION",null,null,{"$f":"COUNTIF('USER INTERFACE'!$Q$60:$R$79,\"SIGNALIZATION\")","v":0},"EA",150000,{"$f":"G38*I38","v":0}]
[]
[]
[]
[]
[null,null,null,null,null,"Total Cost for Concrete",null,null,{"$f":"SUM(J7:J41)","v":0},"DOLLARS"]

{"sheet":"ENVIRONMENTAL","index":17,"n_rows":43,"n_cols":13,"rows_kept":43,"cut":false,"hidden":true,"merged":[[27,3,27,5],[28,3,28,5],[30,3,30,5],[8,3,8,5],[1,8,1,9],[2,8,2,9],[3,8,3,9],[13,3,13,5],[6,3,6,5],[7,3,7,5]]}
[]
[null,null,"CALC'D BY:","KA","DATE:","2018-02-13",null,"CITY:",{"$f":"AREA!I2","v":0}]
[null,null,"CHK'D BY:","KR","DATE:","2017-11-15",null,"PROJECT:",{"$f":"AREA!I3","v":0}]
[]
[]
[]
[null,null,767.12099999999998,"SEDIMENT CONTROLS*",null,null,{"$f":"G9","v":0},"FT",{"$f":"IF(VLOOKUP(C7,PRICES!$B$2:$J$9998,9,FALSE)<>0,VLOOKUP(C7,PRICES!$B$2:$J$9998,9,FALSE),VLOOKUP(C7,PRICES!$B$2:$H$9998,7,FALSE))","v":7.01},{"$f":"G7*I7","v":0}]
[null,null,null,"Placed at bottom of proposed slopes"]
[null,null,null,"Assume one length of project",null,null,{"$f":"AREA!$H$31","v":0},"ft"]
[null,null,null,"*Formerly COMPOST FILTER TUBES"]
[]
[null,null,"If path is on a railroad (w/ or w/o existing ties) assume 2% contingecy for contamination (180 items)."]
[]
[null,null,"180s","CONTAMINATION CONTINGENCY",null,null,1,"LS",{"$f":"G24","v":0},{"$f":"G14*I14","v":0}]
[]
[null,null,null,null,null,"Length of rail trail segments w/ existing ties:",{"$f":"SUMIF('USER INTERFACE'!$G$19:$J$19,'USER INTERFACE'!U27,'USER INTERFACE'!$G$17:$J$17)","v":0},"ft"]
[null,null,null,null,null,"Length of Rails with Trails or Rail Trail w/o existing ties:",{"$f":"SUMIF('USER INTERFACE'!$G$19:$J$19,'USER INTERFACE'!U26,'USER INTERFACE'!$G$17:$J$17)+SUMIF('USER INTERFACE'!$G$19:$J$19,'USER INTERFACE'!U28,'USER INTERFACE'!$G$17:$J$17)","v":0},"ft"]
[null,null,null,null,null,"Total Length of Path:",{"$f":"AREA!H31","v":0},"ft"]
[]
[null,null,null,null,null,"Ratio of path along/on rail:",{"$f":"IF(G18>0,(G16+G17)/G18,0)","v":0}]
[null,null,null,null,null,"Construction Cost (without structural or environmental):",{"$f":"ROUND(ASPHALT!$I$43+'POROUS ASPHALT'!$I$43+'STONE DUST'!I43+CONCRETE!$I$43+MISC!$I$43+'CRUSHED STONE'!$I$43+DRAINAGE!$I$43+INTERSECTIONS!$I$43+MISC!$I$43,-2)*(1+LANDSCAPING!F13)","v":0},null,null,null,null,null,"manually add in landscaping to avoid circular reference"]
[null,null,null,null,null,"Rail Trail construction cost:",{"$f":"G21*G20","v":0}]
[]
[null,null,null,null,null,"2% Contingency:",{"$f":"G22*0.02","v":0}]
[]
[null,null,"If path is on a railroad w/ existing ties, also assume track and tie excavation."]
[]
[null,null,129.5,"TRACK EXCAVATION",null,null,{"$f":"G16","v":0},"FT",{"$f":"IF(VLOOKUP(C28,PRICES!$B$2:$J$9998,9,FALSE)<>0,VLOOKUP(C28,PRICES!$B$2:$J$9998,9,FALSE),VLOOKUP(C28,PRICES!$B$2:$H$9998,7,FALSE))","v":32.25},{"$f":"G28*I28","v":0}]
[null,null,129.69999999999999,"HANDLING AND TRANSPORTING RAIL",null,null,{"$f":"G16*2","v":0},"FT",5,{"$f":"G29*I29","v":0}]
[]
[null,null,184.1,"DISPOSAL OF TREATED WOOD PRODUCTS",null,null,{"$f":"G35","v":0},"TON",{"$f":"IF(VLOOKUP(C31,PRICES!$B$2:$J$9998,9,FALSE)<>0,VLOOKUP(C31,PRICES!$B$2:$J$9998,9,FALSE),VLOOKUP(C31,PRICES!$B$2:$H$9998,7,FALSE))","v":322},{"$f":"G31*I31","v":0},null,null,"wooden ties typ 7\"x9\"x8.5' spaced at 19.5\" o.c."]
[null,null,"Wooden ties are typically 7\"x9\"x8.5' spaced 19.5\" o.c., weighing 56 pounds per cubic foot.",null,null,null,null,null,null,null,null,null,"wood 56 pcf"]
[null,null,null,null,null,"Weight per tie:",{"$f":"(7*9)/144*8.5*56","v":208.25},"lbs"]
[null,null,null,null,null,"# ties:",{"$f":"G16*12/19.5*2","v":0},"ea.","| Assume two tracks"]
[null,null,null,null,null,"Total weight:",{"$f":"G33*G34/2000","v":0},"TON"]
[]
[]
[]
[]
[null,null,null,"= Price not included in MassDOT Database."]
[]
[]
[null,null,null,null,null,null,null,"Total Cost for Environmental",{"$f":"SUM(J7:K40)","v":0},"DOLLARS"]

{"sheet":"BRIDGE","index":18,"n_rows":55,"n_cols":15,"rows_kept":55,"cut":false,"hidden":true,"merged":[[5,7,6,9],[54,5,54,7],[1,8,1,9],[2,8,2,9],[3,8,3,9],[49,3,49,5],[51,3,51,5],[50,3,50,5],[52,3,52,5],[27,6,27,7],[28,6,28,7],[29,6,29,7],[30,6,30,7],[31,6,31,7],[32,6,32,7],[33,6,33,7],[45,6,45,7],[46,6,46,7],[47,6,47,7],[35,6,35,7],[39,6,39,7],[17,6,17,7],[18,6,18,7],[19,6,19,7],[43,6,43,7],[44,6,44,7],[20,6,20,7],[21,6,21,7],[22,6,22,7],[23,6,23,7],[42,6,42,7],[41,6,41,7],[40,6,40,7],[34,6,34,7],[12,6,12,7],[13,6,13,7],[14,6,14,7],[15,6,15,7],[16,6,16,7],[7,6,7,7],[8,6,8,7],[9,6,9,7],[10,6,10,7],[11,6,11,7]]}
[]
[null,null,"CALC'D BY:","KA","DATE:","2018-02-21",null,"CITY:",{"$f":"AREA!I2","v":0}]
[null,null,"CHK'D BY:",null,"DATE:",null,null,"PROJECT:",{"$f":"AREA!I3","v":0}]
[]
[]
[null,null,null,null,null,null,null,"Assume $100/ft for bridges. Sum is included on Lighting tab."]
[null,null,"From Intersection Crossings:"]
[null,null,null,"Crossing #","No. Lanes","Length","Lighting",null,"Lighting Cost"]
[null,null,null,{"$f":"IFERROR(INDEX('USER INTERFACE'!$B$60:$B$79,SMALL(IF(\"Bridge\"='USER INTERFACE'!$B$60:$J$79,ROW('USER INTERFACE'!$B$60:$B$79)-MIN(ROW('USER INTERFACE'!$B$60:$B$79))+1,\"\"),ROW()-8)),\"No\")","v":"No"},{"$f":"IF(D9=\"No\",0,VLOOKUP(D9,'USER INTERFACE'!$B$60:$H79,5,FALSE))","v":0},{"$f":"IF(E9>0,12*E9+50,\"\")","v":""},{"$f":"IF(D9=\"No\",0,VLOOKUP(D9,'USER INTERFACE'!$B$60:$I79,8,FALSE))","v":0},null,{"$f":"IF(G9='USER INTERFACE'!$U$38,IF(F9<>\"\",F9*$N$17,0),0)","v":0}]
[null,null,null,"No",{"$f":"IF(D10=\"No\",0,VLOOKUP(D10,'USER INTERFACE'!$C$60:$I80,5,FALSE))","v":0},{"$f":"IF(E10>0,12*E10+50,\"\")","v":""},{"$f":"IF(D10=\"No\",0,VLOOKUP(D10,'USER INTERFACE'!$B$60:$I80,8,FALSE))","v":0},null,{"$f":"IF(G10='USER INTERFACE'!$U$38,IF(F10<>\"\",F10*$N$17,0),0)","v":0}]
[null,null,null,"No",{"$f":"IF(D11=\"No\",0,VLOOKUP(D11,'USER INTERFACE'!$C$60:$I81,5,FALSE))","v":0},"",{"$f":"IF(D11=\"No\",0,VLOOKUP(D11,'USER INTERFACE'!$B$60:$I81,8,FALSE))","v":0},null,{"$f":"IF(G11='USER INTERFACE'!$U$38,IF(F11<>\"\",F11*$N$17,0),0)","v":0}]
[null,null,null,"No",{"$f":"IF(D12=\"No\",0,VLOOKUP(D12,'USER INTERFACE'!$C$60:$I82,5,FALSE))","v":0},"",{"$f":"IF(D12=\"No\",0,VLOOKUP(D12,'USER INTERFACE'!$B$60:$I82,8,FALSE))","v":0},null,{"$f":"IF(G12='USER INTERFACE'!$U$38,IF(F12<>\"\",F12*$N$17,0),0)","v":0}]
[null,null,null,"No",{"$f":"IF(D13=\"No\",0,VLOOKUP(D13,'USER INTERFACE'!$C$60:$I83,5,FALSE))","v":0},"",{"$f":"IF(D13=\"No\",0,VLOOKUP(D13,'USER INTERFACE'!$B$60:$I83,8,FALSE))","v":0},null,{"$f":"IF(G13='USER INTERFACE'!$U$38,IF(F13<>\"\",F13*$N$17,0),0)","v":0}]
[null,null,null,"No",{"$f":"IF(D14=\"No\",0,VLOOKUP(D14,'USER INTERFACE'!$C$60:$I84,5,FALSE))","v":0},"",{"$f":"IF(D14=\"No\",0,VLOOKUP(D14,'USER INTERFACE'!$B$60:$I84,8,FALSE))","v":0},null,{"$f":"IF(G14='USER INTERFACE'!$U$38,IF(F14<>\"\",F14*$N$17,0),0)","v":0}]
[null,null,null,"No",{"$f":"IF(D15=\"No\",0,VLOOKUP(D15,'USER INTERFACE'!$C$60:$I85,5,FALSE))","v":0},"",{"$f":"IF(D15=\"No\",0,VLOOKUP(D15,'USER INTERFACE'!$B$60:$I85,8,FALSE))","v":0},null,{"$f":"IF(G15='USER INTERFACE'!$U$38,IF(F15<>\"\",F15*$N$17,0),0)","v":0}]
[null,null,null,"No",{"$f":"IF(D16=\"No\",0,VLOOKUP(D16,'USER INTERFACE'!$C$60:$I86,5,FALSE))","v":0},"",{"$f":"IF(D16=\"No\",0,VLOOKUP(D16,'USER INTERFACE'!$B$60:$I86,8,FALSE))","v":0},null,{"$f":"IF(G16='USER INTERFACE'!$U$38,IF(F16<>\"\",F16*$N$17,0),0)","v":0}]
[null,null,null,"No",{"$f":"IF(D17=\"No\",0,VLOOKUP(D17,'USER INTERFACE'!$C$60:$I87,5,FALSE))","v":0},"",{"$f":"IF(D17=\"No\",0,VLOOKUP(D17,'USER INTERFACE'!$B$60:$I87,8,FALSE))","v":0},null,{"$f":"IF(G17='USER INTERFACE'!$U$38,IF(F17<>\"\",F17*$N$17,0),0)","v":0},null,null,null,"Assume",100,"per foot for lighting"]
[null,null,null,"No",{"$f":"IF(D18=\"No\",0,VLOOKUP(D18,'USER INTERFACE'!$C$60:$I88,5,FALSE))","v":0},"",{"$f":"IF(D18=\"No\",0,VLOOKUP(D18,'USER INTERFACE'!$B$60:$I88,8,FALSE))","v":0},null,{"$f":"IF(G18='USER INTERFACE'!$U$38,IF(F18<>\"\",F18*$N$17,0),0)","v":0}]
[null,null,null,"No",{"$f":"IF(D19=\"No\",0,VLOOKUP(D19,'USER INTERFACE'!$C$60:$I89,5,FALSE))","v":0},"",{"$f":"IF(D19=\"No\",0,VLOOKUP(D19,'USER INTERFACE'!$B$60:$I89,8,FALSE))","v":0},null,{"$f":"IF(G19='USER INTERFACE'!$U$38,IF(F19<>\"\",F19*$N$17,0),0)","v":0}]
[null,null,null,"No",{"$f":"IF(D20=\"No\",0,VLOOKUP(D20,'USER INTERFACE'!$C$60:$I90,5,FALSE))","v":0},"",{"$f":"IF(D20=\"No\",0,VLOOKUP(D20,'USER INTERFACE'!$B$60:$I90,8,FALSE))","v":0},null,{"$f":"IF(G20='USER INTERFACE'!$U$38,IF(F20<>\"\",F20*$N$17,0),0)","v":0}]
[null,null,null,"No",{"$f":"IF(D21=\"No\",0,VLOOKUP(D21,'USER INTERFACE'!$C$60:$I91,5,FALSE))","v":0},"",{"$f":"IF(D21=\"No\",0,VLOOKUP(D21,'USER INTERFACE'!$B$60:$I91,8,FALSE))","v":0},null,{"$f":"IF(G21='USER INTERFACE'!$U$38,IF(F21<>\"\",F21*$N$17,0),0)","v":0}]
[null,null,null,"No",{"$f":"IF(D22=\"No\",0,VLOOKUP(D22,'USER INTERFACE'!$C$60:$I93,5,FALSE))","v":0},"",{"$f":"IF(D22=\"No\",0,VLOOKUP(D22,'USER INTERFACE'!$B$60:$I93,8,FALSE))","v":0},null,{"$f":"IF(G22='USER INTERFACE'!$U$38,IF(F22<>\"\",F22*$N$17,0),0)","v":0}]
[null,null,null,"No",{"$f":"IF(D23=\"No\",0,VLOOKUP(D23,'USER INTERFACE'!$C$60:$I94,5,FALSE))","v":0},"",{"$f":"IF(D23=\"No\",0,VLOOKUP(D23,'USER INTERFACE'!$B$60:$I94,8,FALSE))","v":0},null,{"$f":"IF(G23='USER INTERFACE'!$U$38,IF(F23<>\"\",F23*$N$17,0),0)","v":0}]
[null,null,null,"No",{"$f":"IF(D24=\"No\",0,VLOOKUP(D24,'USER INTERFACE'!$C$60:$I95,5,FALSE))","v":0},"",{"$f":"IF(D24=\"No\",0,VLOOKUP(D24,'USER INTERFACE'!$B$60:$I95,8,FALSE))","v":0},null,{"$f":"IF(G24='USER INTERFACE'!$U$38,IF(F24<>\"\",F24*$N$17,0),0)","v":0}]
[]
[null,null,"# of river crossings?",null,{"$f":"'USER INTERFACE'!$I$33","v":0}]
[]
[null,null,"Crossing #","Width","Exist Bridge?","Bridge Length","Lighting ",null,"Lighting Cost"]
[1,null,{"$f":"IF($E$26>=A29,A29,\"No\")","v":"No"},{"$f":"IF(C29=\"No\",0,VLOOKUP(C29,'USER INTERFACE'!$B$84:$D$91,2,FALSE))","v":0},{"$f":"IF(C29=\"No\",0,VLOOKUP(C29,'USER INTERFACE'!$B$84:$D$91,3,FALSE))","v":0},{"$f":"IF(D29>0,D29+20,0)","v":0},{"$f":"IF(C29=\"No\",0,VLOOKUP(C29,'USER INTERFACE'!$B$84:$E$91,4,FALSE))","v":0},null,{"$f":"IF(G29='USER INTERFACE'!$U$38,IF(F29<>\"\",F29*$N$17,0),0)","v":0},null,null,1]
[2,null,{"$f":"IF($E$26>=A30,A30,\"No\")","v":"No"},{"$f":"IF(C30=\"No\",0,VLOOKUP(C30,'USER INTERFACE'!$B$84:$D$91,2,FALSE))","v":0},{"$f":"IF(C30=\"No\",0,VLOOKUP(C30,'USER INTERFACE'!$B$84:$D$91,3,FALSE))","v":0},{"$f":"IF(D30>0,D30+20,0)","v":0},{"$f":"IF(C30=\"No\",0,VLOOKUP(C30,'USER INTERFACE'!$B$84:$E$91,4,FALSE))","v":0},null,{"$f":"IF(G30='USER INTERFACE'!$U$38,IF(F30<>\"\",F30*$N$17,0),0)","v":0},null,null,2]
[3,null,"No",{"$f":"IF(C31=\"No\",0,VLOOKUP(C31,'USER INTERFACE'!$B$84:$D$91,2,FALSE))","v":0},{"$f":"IF(C31=\"No\",0,VLOOKUP(C31,'USER INTERFACE'!$B$84:$D$91,3,FALSE))","v":0},0,{"$f":"IF(C31=\"No\",0,VLOOKUP(C31,'USER INTERFACE'!$B$84:$E$91,4,FALSE))","v":0},null,{"$f":"IF(G31='USER INTERFACE'!$U$38,IF(F31<>\"\",F31*$N$17,0),0)","v":0},null,null,3]
[4,null,"No",{"$f":"IF(C32=\"No\",0,VLOOKUP(C32,'USER INTERFACE'!$B$84:$D$91,2,FALSE))","v":0},{"$f":"IF(C32=\"No\",0,VLOOKUP(C32,'USER INTERFACE'!$B$84:$D$91,3,FALSE))","v":0},0,{"$f":"IF(C32=\"No\",0,VLOOKUP(C32,'USER INTERFACE'!$B$84:$E$91,4,FALSE))","v":0},null,{"$f":"IF(G32='USER INTERFACE'!$U$38,IF(F32<>\"\",F32*$N$17,0),0)","v":0},null,null,4]
[5,null,"No",{"$f":"IF(C33=\"No\",0,VLOOKUP(C33,'USER INTERFACE'!$B$84:$D$91,2,FALSE))","v":0},{"$f":"IF(C33=\"No\",0,VLOOKUP(C33,'USER INTERFACE'!$B$84:$D$91,3,FALSE))","v":0},0,{"$f":"IF(C33=\"No\",0,VLOOKUP(C33,'USER INTERFACE'!$B$84:$E$91,4,FALSE))","v":0},null,{"$f":"IF(G33='USER INTERFACE'!$U$38,IF(F33<>\"\",F33*$N$17,0),0)","v":0},null,null,5]
[6,null,"No",{"$f":"IF(C34=\"No\",0,VLOOKUP(C34,'USER INTERFACE'!$B$84:$D$91,2,FALSE))","v":0},{"$f":"IF(C34=\"No\",0,VLOOKUP(C34,'USER INTERFACE'!$B$84:$D$91,3,FALSE))","v":0},0,{"$f":"IF(C34=\"No\",0,VLOOKUP(C34,'USER INTERFACE'!$B$84:$E$91,4,FALSE))","v":0},null,{"$f":"IF(G34='USER INTERFACE'!$U$38,IF(F34<>\"\",F34*$N$17,0),0)","v":0},null,null,6]
[7,null,"No",{"$f":"IF(C35=\"No\",0,VLOOKUP(C35,'USER INTERFACE'!$B$84:$D$91,2,FALSE))","v":0},{"$f":"IF(C35=\"No\",0,VLOOKUP(C35,'USER INTERFACE'!$B$84:$D$91,3,FALSE))","v":0},0,{"$f":"IF(C35=\"No\",0,VLOOKUP(C35,'USER INTERFACE'!$B$84:$E$91,4,FALSE))","v":0},null,{"$f":"IF(G35='USER INTERFACE'!$U$38,IF(F35<>\"\",F35*$N$17,0),0)","v":0},null,null,7]
[8,null,"No",{"$f":"IF(C36=\"No\",0,VLOOKUP(C36,'USER INTERFACE'!$B$84:$D$91,2,FALSE))","v":0},{"$f":"IF(C36=\"No\",0,VLOOKUP(C36,'USER INTERFACE'!$B$84:$D$91,3,FALSE))","v":0},0,{"$f":"IF(C36=\"No\",0,VLOOKUP(C36,'USER INTERFACE'!$B$84:$E$91,4,FALSE))","v":0},null,{"$f":"IF(G36='USER INTERFACE'!$U$38,IF(F36<>\"\",F36*$N$17,0),0)","v":0},null,null,8]
[]
[null,null,"# of railroad bridge crossings?",null,null,{"$f":"SUMIF('USER INTERFACE'!$H$84:$H$91,\"Overpass\",'USER INTERFACE'!$F$84:$F$91)","v":0}]
[]
[null,null,"Crossing #","Length","Exist Bridge?","Bridge Length","Lighting ",null,"Lighting Cost"]
[1,null,{"$f":"IFERROR(INDEX('USER INTERFACE'!$F$84:$F$91,SMALL(IF(\"Overpass\"='USER INTERFACE'!$F$84:$K$91,ROW('USER INTERFACE'!$F$84:$F$91)-MIN(ROW('USER INTERFACE'!$F$84:$F$91))+1,\"\"),ROW()-40)),\"No\")","v":"No"},{"$f":"IF(C41=\"No\",0,VLOOKUP(C41,'USER INTERFACE'!$F$84:$K$91,2,FALSE))","v":0},{"$f":"IF(C41=\"No\",0,VLOOKUP(C41,'USER INTERFACE'!$F$84:$K$91,4,FALSE))","v":0},{"$f":"IF(D41>0,D41+125,0)","v":0},{"$f":"IF(C41=\"No\",0,VLOOKUP(C41,'USER INTERFACE'!$F$84:$J$91,5,FALSE))","v":0},null,{"$f":"IF(G41='USER INTERFACE'!$U$38,IF(F41<>\"\",F41*$N$17,0),0)","v":0},null,null,1]
[2,null,"No",{"$f":"IF(C42=\"No\",0,VLOOKUP(C42,'USER INTERFACE'!$F$84:$K$91,2,FALSE))","v":0},{"$f":"IF(C42=\"No\",0,VLOOKUP(C42,'USER INTERFACE'!$F$84:$K$91,3,FALSE))","v":0},{"$f":"IF(D42>0,D42+125,0)","v":0},{"$f":"IF(C42=\"No\",0,VLOOKUP(C42,'USER INTERFACE'!$F$84:$J$91,5,FALSE))","v":0},null,{"$f":"IF(G42='USER INTERFACE'!$U$38,IF(F42<>\"\",F42*$N$17,0),0)","v":0},null,null,2]
[3,null,"No",{"$f":"IF(C43=\"No\",0,VLOOKUP(C43,'USER INTERFACE'!$F$84:$K$91,2,FALSE))","v":0},{"$f":"IF(C43=\"No\",0,VLOOKUP(C43,'USER INTERFACE'!$F$84:$K$91,3,FALSE))","v":0},0,{"$f":"IF(C43=\"No\",0,VLOOKUP(C43,'USER INTERFACE'!$F$84:$J$91,5,FALSE))","v":0},null,{"$f":"IF(G43='USER INTERFACE'!$U$38,IF(F43<>\"\",F43*$N$17,0),0)","v":0},null,null,3]
[4,null,"No",{"$f":"IF(C44=\"No\",0,VLOOKUP(C44,'USER INTERFACE'!$F$84:$K$91,2,FALSE))","v":0},{"$f":"IF(C44=\"No\",0,VLOOKUP(C44,'USER INTERFACE'!$F$84:$K$91,3,FALSE))","v":0},0,{"$f":"IF(C44=\"No\",0,VLOOKUP(C44,'USER INTERFACE'!$F$84:$J$91,5,FALSE))","v":0},null,{"$f":"IF(G44='USER INTERFACE'!$U$38,IF(F44<>\"\",F44*$N$17,0),0)","v":0},null,null,4]
[5,null,"No",{"$f":"IF(C45=\"No\",0,VLOOKUP(C45,'USER INTERFACE'!$F$84:$K$91,2,FALSE))","v":0},{"$f":"IF(C45=\"No\",0,VLOOKUP(C45,'USER INTERFACE'!$F$84:$K$91,3,FALSE))","v":0},0,{"$f":"IF(C45=\"No\",0,VLOOKUP(C45,'USER INTERFACE'!$F$84:$J$91,5,FALSE))","v":0},null,{"$f":"IF(G45='USER INTERFACE'!$U$38,IF(F45<>\"\",F45*$N$17,0),0)","v":0},null,null,5]
[6,null,"No",{"$f":"IF(C46=\"No\",0,VLOOKUP(C46,'USER INTERFACE'!$F$84:$K$91,2,FALSE))","v":0},{"$f":"IF(C46=\"No\",0,VLOOKUP(C46,'USER INTERFACE'!$F$84:$K$91,3,FALSE))","v":0},0,{"$f":"IF(C46=\"No\",0,VLOOKUP(C46,'USER INTERFACE'!$F$84:$J$91,5,FALSE))","v":0},null,{"$f":"IF(G46='USER INTERFACE'!$U$38,IF(F46<>\"\",F46*$N$17,0),0)","v":0},null,null,6]
[7,null,"No",{"$f":"IF(C47=\"No\",0,VLOOKUP(C47,'USER INTERFACE'!$F$84:$K$91,2,FALSE))","v":0},{"$f":"IF(C47=\"No\",0,VLOOKUP(C47,'USER INTERFACE'!$F$84:$K$91,3,FALSE))","v":0},0,{"$f":"IF(C47=\"No\",0,VLOOKUP(C47,'USER INTERFACE'!$F$84:$J$91,5,FALSE))","v":0},null,{"$f":"IF(G47='USER INTERFACE'!$U$38,IF(F47<>\"\",F47*$N$17,0),0)","v":0},null,null,7]
[8,null,"No",{"$f":"IF(C48=\"No\",0,VLOOKUP(C48,'USER INTERFACE'!$F$84:$K$91,2,FALSE))","v":0},{"$f":"IF(C48=\"No\",0,VLOOKUP(C48,'USER INTERFACE'!$F$84:$K$91,3,FALSE))","v":0},0,{"$f":"IF(C48=\"No\",0,VLOOKUP(C48,'USER INTERFACE'!$F$84:$J$91,5,FALSE))","v":0},null,{"$f":"IF(G48='USER INTERFACE'!$U$38,IF(F48<>\"\",F48*$N$17,0),0)","v":0},null,null,8]
[]
[null,null,null,"SUPERSTRUCTURE ONLY",null,null,{"$f":"SUMIF(E29:E36,'USER INTERFACE'!$U$12,F29:F36)+SUMIF(E41:E48,'USER INTERFACE'!$U$12,F41:F48)","v":0},"FT",7500,{"$f":"G50*I50","v":0}]
[null,null,null,"CLEAN AND REHABILITATE",null,null,{"$f":"SUMIF(E29:E36,\"Yes\",F29:F36)+SUMIF(I29:I36,\"Yes\",J29:J36)","v":0},"FT",1250,{"$f":"G51*I51","v":0}]
[null,null,null,"PREFABRICATED STEEL BRIDGE",null,null,{"$f":"SUM(F9:F24)+SUM(SUMIFS(F29:F36,E29:E36,{\"No\",\"Needs Replacement\"}))+SUM(SUMIFS(E41:E48,F41:F48,{\"No\",\"Needs Replacement\"}))","v":0},"FT",10000,{"$f":"G52*I52","v":0}]
[null,null,null,"BRIDGE DEMOLITION",null,null,{"$f":"SUMIF(E29:E36,\"Needs Replacement\",F29:F36)+SUMIF(I29:I36,\"Needs Replacement\",J29:J36)","v":0},"FT",2500,{"$f":"G53*I53","v":0}]
[null,null,null,"= Price not included in MassDOT Database."]
[null,null,null,null,null,"Total Cost for Bridge",null,null,{"$f":"SUM(J50:K53)","v":0},"DOLLARS"]

{"sheet":"CULVERT","index":19,"n_rows":43,"n_cols":21,"rows_kept":43,"cut":false,"hidden":true,"merged":[[35,7,35,8],[36,7,36,8],[37,7,37,8],[38,7,38,8],[39,7,39,8],[25,6,25,7],[26,6,26,7],[27,6,27,7],[33,7,33,8],[34,7,34,8],[11,6,11,7],[12,6,12,7],[31,7,31,8],[32,7,32,8],[13,6,13,7],[14,6,14,7],[15,6,15,7],[16,6,16,7],[17,6,17,7],[18,6,18,7],[19,6,19,7],[20,6,20,7],[21,6,21,7],[22,6,22,7],[23,6,23,7],[24,6,24,7],[8,3,8,5],[9,3,9,5],[6,14,6,16],[1,8,1,9],[2,8,2,9],[3,8,3,9],[5,7,6,9]]}
[]
[null,null,"CALC'D BY:","KA","DATE:","2017-11-03",null,"CITY:",{"$f":"AREA!I2","v":0}]
[null,null,"CHK'D BY:","KR","DATE:","2017-11-15",null,"PROJECT:",{"$f":"AREA!I3","v":0}]
[]
[]
[null,null,null,null,null,null,null,"Assume $75/ft for culverts. Sum is included on Lighting tab."]
[null,null,null,null,null,null,null,null,null,null,null,null,null,995.01099999999997,"CULVERT",null,null,1,"LS",{"$f":"SUM(J8:J25)","v":0},{"$f":"R7*T7","v":0}]
[null,null,"Unit Cost for 995.011-1 includes excavation, concrete, rebar, backfill, headwalls and wingwalls."]
[null,null,"995.011-1","PRECAST CONCRETE BOX CULVERT",null,null,{"$f":"SUM(F13:F28,F33:F40)-SUMIF(G33:G40,\"Yes\",F33:F40)","v":0},"FT",12000,{"$f":"G9*I9","v":0},null,null,null,"Assumed/inputted dimensions"]
[null,null,992.3,"TEMPORARY SUPPORTS FOR BRIDGE STRUCTURE",null,null,{"$f":"G9*10*2","v":0},"SF",100,{"$f":"G10*I10","v":0},null,null,null,null,"L (FT.)","W (FT.)","H (FT.)","AREA (SF)","VOL (CF)"]
[null,null,null,null,null,null,null,null,null,null,null,null,null,null,{"$f":"SUM(F13:F28)","v":0},16,10,{"$f":"O11*P11","v":0},{"$f":"R11*Q11","v":0}]
[null,null,null,"Crossing #","No. Lanes","Length","Lighting",null,"Lighting Cost"]
[null,null,null,{"$f":"IFERROR(INDEX('USER INTERFACE'!$B$60:$B$79,SMALL(IF(\"Culvert\"='USER INTERFACE'!$B$60:$J$79,ROW('USER INTERFACE'!$B$60:$B$79)-MIN(ROW('USER INTERFACE'!$B$60:$B$79))+1,\"\"),ROW()-12)),\"No\")","v":"No"},{"$f":"IF(D13=\"No\",0,VLOOKUP(D13,'USER INTERFACE'!$B$60:$H$79,5,FALSE))","v":0},{"$f":"IF(E13>0,12*E13+10+25,\"\")","v":""},{"$f":"IF(D13=\"No\",0,VLOOKUP(D13,'USER INTERFACE'!$B$60:$I83,8,FALSE))","v":0},null,{"$f":"IF(G13='USER INTERFACE'!$U$38,IF(F13<>\"\",F13*$N$17,0),0)","v":0}]
[null,null,null,"No",{"$f":"IF(D14=\"No\",0,VLOOKUP(D14,'USER INTERFACE'!$B$60:$H$79,5,FALSE))","v":0},{"$f":"IF(E14>0,12*E14+10+25,\"\")","v":""},{"$f":"IF(D14=\"No\",0,VLOOKUP(D14,'USER INTERFACE'!$B$60:$I84,8,FALSE))","v":0},null,{"$f":"IF(G14='USER INTERFACE'!$U$38,IF(F14<>\"\",F14*$N$17,0),0)","v":0}]
[null,null,null,"No",{"$f":"IF(D15=\"No\",0,VLOOKUP(D15,'USER INTERFACE'!$B$60:$H$79,5,FALSE))","v":0},"",{"$f":"IF(D15=\"No\",0,VLOOKUP(D15,'USER INTERFACE'!$B$60:$I85,8,FALSE))","v":0},null,{"$f":"IF(G15='USER INTERFACE'!$U$38,IF(F15<>\"\",F15*$N$17,0),0)","v":0},null,null,"<-- $7,500 cost from Gill, includes excavation -- upped to $12,000 based on bid tab"]
[null,null,null,"No",{"$f":"IF(D16=\"No\",0,VLOOKUP(D16,'USER INTERFACE'!$B$60:$H$79,5,FALSE))","v":0},"",{"$f":"IF(D16=\"No\",0,VLOOKUP(D16,'USER INTERFACE'!$B$60:$I86,8,FALSE))","v":0},null,{"$f":"IF(G16='USER INTERFACE'!$U$38,IF(F16<>\"\",F16*$N$17,0),0)","v":0}]
[null,null,null,"No",{"$f":"IF(D17=\"No\",0,VLOOKUP(D17,'USER INTERFACE'!$B$60:$H$79,5,FALSE))","v":0},"",{"$f":"IF(D17=\"No\",0,VLOOKUP(D17,'USER INTERFACE'!$B$60:$I87,8,FALSE))","v":0},null,{"$f":"IF(G17='USER INTERFACE'!$U$38,IF(F17<>\"\",F17*$N$17,0),0)","v":0},null,null,null,"Assume",75,"per foot for lighting"]
[null,null,null,"No",{"$f":"IF(D18=\"No\",0,VLOOKUP(D18,'USER INTERFACE'!$B$60:$H$79,5,FALSE))","v":0},"",{"$f":"IF(D18=\"No\",0,VLOOKUP(D18,'USER INTERFACE'!$B$60:$I88,8,FALSE))","v":0},null,{"$f":"IF(G18='USER INTERFACE'!$U$38,IF(F18<>\"\",F18*$N$17,0),0)","v":0}]
[null,null,null,"No",{"$f":"IF(D19=\"No\",0,VLOOKUP(D19,'USER INTERFACE'!$B$60:$H$79,5,FALSE))","v":0},"",{"$f":"IF(D19=\"No\",0,VLOOKUP(D19,'USER INTERFACE'!$B$60:$I89,8,FALSE))","v":0},null,{"$f":"IF(G19='USER INTERFACE'!$U$38,IF(F19<>\"\",F19*$N$17,0),0)","v":0}]
[null,null,null,"No",{"$f":"IF(D20=\"No\",0,VLOOKUP(D20,'USER INTERFACE'!$B$60:$H$79,5,FALSE))","v":0},"",{"$f":"IF(D20=\"No\",0,VLOOKUP(D20,'USER INTERFACE'!$B$60:$I90,8,FALSE))","v":0},null,{"$f":"IF(G20='USER INTERFACE'!$U$38,IF(F20<>\"\",F20*$N$17,0),0)","v":0}]
[null,null,null,"No",{"$f":"IF(D21=\"No\",0,VLOOKUP(D21,'USER INTERFACE'!$B$60:$H$79,5,FALSE))","v":0},"",{"$f":"IF(D21=\"No\",0,VLOOKUP(D21,'USER INTERFACE'!$B$60:$I91,8,FALSE))","v":0},null,{"$f":"IF(G21='USER INTERFACE'!$U$38,IF(F21<>\"\",F21*$N$17,0),0)","v":0}]
[null,null,null,"No",{"$f":"IF(D22=\"No\",0,VLOOKUP(D22,'USER INTERFACE'!$B$60:$H$79,5,FALSE))","v":0},"",{"$f":"IF(D22=\"No\",0,VLOOKUP(D22,'USER INTERFACE'!$B$60:$I92,8,FALSE))","v":0},null,{"$f":"IF(G22='USER INTERFACE'!$U$38,IF(F22<>\"\",F22*$N$17,0),0)","v":0}]
[null,null,null,"No",{"$f":"IF(D23=\"No\",0,VLOOKUP(D23,'USER INTERFACE'!$B$60:$H$79,5,FALSE))","v":0},"",{"$f":"IF(D23=\"No\",0,VLOOKUP(D23,'USER INTERFACE'!$B$60:$I93,8,FALSE))","v":0},null,{"$f":"IF(G23='USER INTERFACE'!$U$38,IF(F23<>\"\",F23*$N$17,0),0)","v":0}]
[null,null,null,"No",{"$f":"IF(D24=\"No\",0,VLOOKUP(D24,'USER INTERFACE'!$B$60:$H$79,5,FALSE))","v":0},"",{"$f":"IF(D24=\"No\",0,VLOOKUP(D24,'USER INTERFACE'!$B$60:$I94,8,FALSE))","v":0},null,{"$f":"IF(G24='USER INTERFACE'!$U$38,IF(F24<>\"\",F24*$N$17,0),0)","v":0}]
[null,null,null,"No",{"$f":"IF(D25=\"No\",0,VLOOKUP(D25,'USER INTERFACE'!$B$60:$H$79,5,FALSE))","v":0},"",{"$f":"IF(D25=\"No\",0,VLOOKUP(D25,'USER INTERFACE'!$B$60:$I95,8,FALSE))","v":0},null,{"$f":"IF(G25='USER INTERFACE'!$U$38,IF(F25<>\"\",F25*$N$17,0),0)","v":0}]
[null,null,null,"No",{"$f":"IF(D26=\"No\",0,VLOOKUP(D26,'USER INTERFACE'!$B$60:$H$79,5,FALSE))","v":0},"",{"$f":"IF(D26=\"No\",0,VLOOKUP(D26,'USER INTERFACE'!$B$60:$I96,8,FALSE))","v":0},null,{"$f":"IF(G26='USER INTERFACE'!$U$38,IF(F26<>\"\",F26*$N$17,0),0)","v":0}]
[null,null,null,"No",{"$f":"IF(D27=\"No\",0,VLOOKUP(D27,'USER INTERFACE'!$B$60:$H$79,5,FALSE))","v":0},"",{"$f":"IF(D27=\"No\",0,VLOOKUP(D27,'USER INTERFACE'!$B$60:$I97,8,FALSE))","v":0},null,{"$f":"IF(G27='USER INTERFACE'!$U$38,IF(F27<>\"\",F27*$N$17,0),0)","v":0}]
[null,null,null,"No",{"$f":"IF(D28=\"No\",0,VLOOKUP(D28,'USER INTERFACE'!$B$60:$H$79,5,FALSE))","v":0},"",{"$f":"IF(D28=\"No\",0,VLOOKUP(D28,'USER INTERFACE'!$B$60:$I98,8,FALSE))","v":0},null,{"$f":"IF(G28='USER INTERFACE'!$U$38,IF(F28<>\"\",F28*$N$17,0),0)","v":0}]
[]
[null,null,"# of railroad culvert crossings?",null,{"$f":"SUMIF('USER INTERFACE'!H84:H91,\"Underpass\",'USER INTERFACE'!F84:F91)","v":0}]
[]
[null,null,null,"Crossing #","Length","Culvert Length","Existing Culvert?","Lighting ",null,"Lighting Cost"]
[1,null,null,{"$f":"IFERROR(INDEX('USER INTERFACE'!$F$84:$F$91,SMALL(IF(\"Underpass\"='USER INTERFACE'!$F$84:$K$91,ROW('USER INTERFACE'!$F$84:$F$91)-MIN(ROW('USER INTERFACE'!$F$84:$F$91))+1,\"\"),ROW()-32)),\"No\")","v":"No"},{"$f":"IF(D33=\"No\",0,VLOOKUP(D33,'USER INTERFACE'!$F$84:$K$91,2,FALSE))","v":0},{"$f":"IF(E33>0,E33+200,0)","v":0},{"$f":"IF(D33=\"No\",0,VLOOKUP(D33,'USER INTERFACE'!$F$84:$K$91,4,FALSE))","v":0},{"$f":"IF(D33=\"No\",0,VLOOKUP(D33,'USER INTERFACE'!$F$84:$J$91,5,FALSE))","v":0},null,{"$f":"IF(H33='USER INTERFACE'!$U$38,IF(F33<>\"\",F33*$N$17,0),0)","v":0}]
[2,null,null,"No",{"$f":"IF(D34=\"No\",0,VLOOKUP(D34,'USER INTERFACE'!$F$84:$K$91,2,FALSE))","v":0},{"$f":"IF(E34>0,E34+20,0)","v":0},{"$f":"IF(D34=\"No\",0,VLOOKUP(D34,'USER INTERFACE'!$F$84:$K$91,4,FALSE))","v":0},{"$f":"IF(D34=\"No\",0,VLOOKUP(D34,'USER INTERFACE'!$F$84:$J$91,5,FALSE))","v":0},null,{"$f":"IF(H34='USER INTERFACE'!$U$38,IF(F34<>\"\",F34*$N$17,0),0)","v":0}]
[3,null,null,"No",{"$f":"IF(D35=\"No\",0,VLOOKUP(D35,'USER INTERFACE'!$F$84:$K$91,2,FALSE))","v":0},0,{"$f":"IF(D35=\"No\",0,VLOOKUP(D35,'USER INTERFACE'!$F$84:$K$91,4,FALSE))","v":0},{"$f":"IF(D35=\"No\",0,VLOOKUP(D35,'USER INTERFACE'!$F$84:$J$91,5,FALSE))","v":0},null,{"$f":"IF(H35='USER INTERFACE'!$U$38,IF(F35<>\"\",F35*$N$17,0),0)","v":0}]
[4,null,null,"No",{"$f":"IF(D36=\"No\",0,VLOOKUP(D36,'USER INTERFACE'!$F$84:$K$91,2,FALSE))","v":0},0,{"$f":"IF(D36=\"No\",0,VLOOKUP(D36,'USER INTERFACE'!$F$84:$K$91,4,FALSE))","v":0},{"$f":"IF(D36=\"No\",0,VLOOKUP(D36,'USER INTERFACE'!$F$84:$J$91,5,FALSE))","v":0},null,{"$f":"IF(H36='USER INTERFACE'!$U$38,IF(F36<>\"\",F36*$N$17,0),0)","v":0}]
[5,null,null,"No",{"$f":"IF(D37=\"No\",0,VLOOKUP(D37,'USER INTERFACE'!$F$84:$K$91,2,FALSE))","v":0},0,{"$f":"IF(D37=\"No\",0,VLOOKUP(D37,'USER INTERFACE'!$F$84:$K$91,4,FALSE))","v":0},{"$f":"IF(D37=\"No\",0,VLOOKUP(D37,'USER INTERFACE'!$F$84:$J$91,5,FALSE))","v":0},null,{"$f":"IF(H37='USER INTERFACE'!$U$38,IF(F37<>\"\",F37*$N$17,0),0)","v":0}]
[6,null,null,"No",{"$f":"IF(D38=\"No\",0,VLOOKUP(D38,'USER INTERFACE'!$F$84:$K$91,2,FALSE))","v":0},0,{"$f":"IF(D38=\"No\",0,VLOOKUP(D38,'USER INTERFACE'!$F$84:$K$91,4,FALSE))","v":0},{"$f":"IF(D38=\"No\",0,VLOOKUP(D38,'USER INTERFACE'!$F$84:$J$91,5,FALSE))","v":0},null,{"$f":"IF(H38='USER INTERFACE'!$U$38,IF(F38<>\"\",F38*$N$17,0),0)","v":0}]
[7,null,null,"No",{"$f":"IF(D39=\"No\",0,VLOOKUP(D39,'USER INTERFACE'!$F$84:$K$91,2,FALSE))","v":0},0,{"$f":"IF(D39=\"No\",0,VLOOKUP(D39,'USER INTERFACE'!$F$84:$K$91,4,FALSE))","v":0},{"$f":"IF(D39=\"No\",0,VLOOKUP(D39,'USER INTERFACE'!$F$84:$J$91,5,FALSE))","v":0},null,{"$f":"IF(H39='USER INTERFACE'!$U$38,IF(F39<>\"\",F39*$N$17,0),0)","v":0}]
[8,null,null,"No",{"$f":"IF(D40=\"No\",0,VLOOKUP(D40,'USER INTERFACE'!$F$84:$K$91,2,FALSE))","v":0},0,{"$f":"IF(D40=\"No\",0,VLOOKUP(D40,'USER INTERFACE'!$F$84:$K$91,4,FALSE))","v":0},{"$f":"IF(D40=\"No\",0,VLOOKUP(D40,'USER INTERFACE'!$F$84:$J$91,5,FALSE))","v":0},null,{"$f":"IF(H40='USER INTERFACE'!$U$38,IF(F40<>\"\",F40*$N$17,0),0)","v":0}]
[]
[null,null,null,"= Price not included in MassDOT Database."]
[null,null,null,null,null,null,null,"Total Cost for Culvert",{"$f":"SUM(J7:J40)","v":0},"DOLLARS"]

{"sheet":"RETAINING WALL","index":20,"n_rows":68,"n_cols":14,"rows_kept":68,"cut":false,"hidden":true,"merged":[[17,3,17,5],[56,2,56,4],[1,8,1,9],[2,8,2,9],[3,8,3,9]]}
[]
[null,null,"CALC'D BY:","KA","DATE:","2017-11-03",null,"CITY:",{"$f":"AREA!I2","v":0}]
[null,null,"CHK'D BY:","KR","DATE:","2017-11-15",null,"PROJECT:",{"$f":"AREA!I3","v":0}]
[]
[null,null,null,null,null,null,null,null,null,null,null,null,"Clear/flat",26]
[null,null,null,null,null,null,null,null,null,null,null,null,"Roadway",27]
[null,null,"Existing Conditions",null,{"$f":"'USER INTERFACE'!G18","v":0},{"$f":"'USER INTERFACE'!H18","v":0},{"$f":"'USER INTERFACE'!I18","v":0},{"$f":"'USER INTERFACE'!J18","v":0},null,null,null,null,"Wooded/hilly",28]
[null,null,"Length",null,{"$f":"'USER INTERFACE'!G17","v":0},{"$f":"'USER INTERFACE'!H17","v":0},{"$f":"'USER INTERFACE'!I17","v":0},{"$f":"'USER INTERFACE'!J17","v":0},null,null,null,null,"Waterfront",29]
[]
[null,null,"% of total cost required for retaining walls"]
[null,null,null,"Clear/flat",null,null,0.01,{"$f":"SUMIF($E$7:$H$7,D11,$E$8:$H$8)","v":0}]
[null,null,null,"Waterfront",null,null,0.05,{"$f":"SUMIF($E$7:$H$7,D12,$E$8:$H$8)","v":0}]
[null,null,null,"Roadway",null,null,0,0]
[null,null,null,"Wooded/hilly",null,null,0.1,0]
[null,null,null,"Utility Corridor",null,null,0.04,0]
[null,null,null,{"$f":"SUM(SUMMARY!I13+SUMMARY!I19)","v":0},"*",{"$f":"IF(AREA!H31>0,(G11*H11+G12*H12+G13*H13+G14*H14+G15*H15)/SUM(H11:H15),0)","v":0},"=",{"$f":"D16*F16","v":0},null,{"$f":"H16","v":0}]
[null,null,"Cost if there are resource areas to be avoided",null,null,null,"% Resource Area",{"$f":"IF(AREA!H31>0,AREA!H33/AREA!H31,0)","v":0}]
[null,null,null,"%-age of Resource Areas",null,null,"Multiplier"]
[null,null,null,0,"to",10,0.02,{"$f":"IF(AND(D19<=$H$17,F19>$H$17),\"X\",\"\")","v":"X"}]
[null,null,null,{"$f":"F19","v":10},"to",20,0.04,{"$f":"IF(AND(D20<=$H$17,F20>$H$17),\"X\",\"\")","v":""}]
[null,null,null,{"$f":"F20","v":20},"to",30,0.06,"",{"$f":"IF(H21=\"\",\"\",$D$29*(G21-1))","v":""}]
[null,null,null,30,"to",40,0.08,"",""]
[null,null,null,{"$f":"F22","v":40},"to",50,0.1,"",""]
[null,null,null,50,"to",60,0.12,"",""]
[null,null,null,60,"to",70,0.14000000000000001,"",""]
[null,null,null,70,"to",80,0.16,"",""]
[null,null,null,80,"to",90,0.18,"",""]
[null,null,null,90,"to",100,0.2,"",""]
[null,null,null,{"$f":"D16","v":0},"*",{"$f":"VLOOKUP(\"X\",CHOOSE({2,1},$G$19:$G$28,$H$19:$H$28),2,0)","v":0.02},"=",{"$f":"D29*F29","v":0},null,{"$f":"H29","v":0}]
[]
[null,null,"Cost if there are steep drop-offs ",null,null,null,null,{"$f":"'USER INTERFACE'!$I$27","v":0}]
[null,null,null,{"$f":"D16","v":0},"*",{"$f":"IF(H31=\"Yes\",0.02,0)","v":0},"=",{"$f":"D32*F32","v":0},null,{"$f":"H32","v":0}]
[null,null,"Cost if ROW is constrained",null,null,null,{"$f":"'USER INTERFACE'!$I$29","v":0}]
[null,null,null,{"$f":"D32","v":0},"*",{"$f":"IF($G$33='USER INTERFACE'!$X$28,0.01,IF($G$33='USER INTERFACE'!$X$29,0.03,0.05))","v":0.05},"=",{"$f":"D34*F34","v":0},null,{"$f":"H34","v":0}]
[null,null,"Cost if bodies of water being crossed",null,null,null,null,{"$f":"'USER INTERFACE'!$I$33","v":0}]
[null,null,null,{"$f":"D34","v":0},"*",{"$f":"H35/50","v":0},"=",{"$f":"D36*F36","v":0},null,{"$f":"H36","v":0}]
[]
[null,null,"Cost for retaining walls associated with bridges & culverts"]
[null,null,null,null,null,null,"Cost per foot",null,null,null,null,"** cost for concrete cantilever wall w/ backfill+footing"]
[null,null,null,"Railroad bridges + culverts",null,{"$f":"SUM(CULVERT!$F$33:$F$40)-SUM(CULVERT!$E$33:$E$40)+SUM(BRIDGE!$J$29:$J$36)-SUM(BRIDGE!$H$29:$H$36)","v":0},2050,"=",null,{"$f":"F40*G40","v":0}]
[null,null,null,"Other bridges + culverts",null,{"$f":"SUM(CULVERT!$F$13:$F$28)-SUM(CULVERT!$E$13:$E$28)*14+SUM(BRIDGE!$F$29:$F$36)-SUM(BRIDGE!$D$29:$D$36)+SUM(BRIDGE!F9:F24)-SUM(BRIDGE!E9:E24)*14","v":0},970,"=",null,{"$f":"F41*G41","v":0}]
[]
[null,null,null,null,null,null,null,"Total Cost for Retaining Wall",{"$f":"SUM(J7:J42)","v":0},"DOLLARS"]
[]
[]
[]
[]
[]
[]
[null,685,"STONE MASONRY WALL",null,null,{"$f":"F52","v":{"$error":"#REF!"}},"CY",{"$f":"VLOOKUP(B50,PRICES!$B$2:$H$9998,7,FALSE)","v":797.36},{"$f":"F50*H50","v":{"$error":"#REF!"}}]
[]
[null,"Length (ft.)","Width (ft.)","Depth (ft.)","=",{"$f":"(B53*C53*D53)/27","v":{"$error":"#REF!"}},"CY"]
[null,{"$f":"AREA!#REF!","v":{"$error":"#REF!"}},{"$f":"AVERAGE(0.5*D53,18/12)","v":{"$error":"#REF!"}},{"$f":"AREA!#REF!","v":{"$error":"#REF!"}}]
[]
[null,"Width calculated per dimensions on MassDOT DWG E302.2.0."]
[]
[null,151.19999999999999,"GRAVEL BORROW FOR BACKFILLING STRUCTURES AND PIPES ",null,null,{"$f":"F59","v":{"$error":"#REF!"}},"CY",{"$f":"VLOOKUP(B57,PRICES!$B$2:$H$9998,7,FALSE)","v":49.69},{"$f":"F57*H57","v":{"$error":"#REF!"}}]
[]
[null,"Length (ft.)","Width (ft.)","Depth (ft.)","=",{"$f":"(B60*C60*D60)/27","v":{"$error":"#REF!"}},"CY"]
[null,{"$f":"AREA!#REF!","v":{"$error":"#REF!"}},{"$f":"1+(0.5*D60-18/12)*0.5","v":{"$error":"#REF!"}},{"$f":"AREA!#REF!","v":{"$error":"#REF!"}}]
[]
[null,905,"4000 PSI, 3/8 IN., 660 CEMENT CONCRETE",null,null,{"$f":"F64","v":{"$error":"#REF!"}},"CY",{"$f":"VLOOKUP(B62,PRICES!$B$2:$H$9998,7,FALSE)","v":3729.22},{"$f":"F62*H62","v":{"$error":"#REF!"}}]
[]
[null,"Length (ft.)","Width (ft.)","Depth (ft.)","=",{"$f":"(B65*C65*D65)/27","v":{"$error":"#REF!"}},"CY"]
[null,{"$f":"AREA!#REF!","v":{"$error":"#REF!"}},{"$f":"AVERAGE(0.5*D65,18/12)","v":{"$error":"#REF!"}},{"$f":"AREA!#REF!","v":{"$error":"#REF!"}}]
[]
[]
[null,null,"= Price not included in MassDOT Database."]

{"sheet":"BOARDWALK","index":21,"n_rows":43,"n_cols":18,"rows_kept":43,"cut":false,"hidden":true,"merged":[[12,16,13,16],[12,17,13,17],[42,5,42,7],[1,8,1,9],[2,8,2,9],[3,8,3,9],[6,3,6,8],[7,3,7,5]]}
[]
[null,null,"CALC'D BY:","KA","DATE:","2017-10-30",null,"CITY:",{"$f":"AREA!I2","v":0}]
[null,null,"CHK'D BY:","KR","DATE:","2017-11-15",null,"PROJECT:",{"$f":"AREA!I3","v":0}]
[]
[]
[]
[]
[null,null,995.1,"TIMBER BOARDWALK",null,null,1,"LS",{"$f":"H11","v":0},{"$f":"G8*I8","v":0}]
[]
[null,null,"COST PER LF",null,null,1500]
[null,null,"LENGTH OF BOARDWALK",null,null,{"$f":"F14","v":0},"FT",{"$f":"F10*F11","v":0},"LS"]
[]
[null,null,"path Length",null,null,{"$f":"AREA!$H$31","v":0},"FT",null,null,null,null,null,null,null,null,null,"% Length","Total Length"]
[null,null,"User-inputted % Boardwalk Length",null,null,{"$f":"'USER INTERFACE'!$I$25","v":0},"FT",null,null,null,null,null,"User-input for resource areas:"]
[null,null,null,null,null,null,null,null,null,null,null,null,null,{"$f":"'USER INTERFACE'!Y10","v":"Minimal"},null,{"$f":"IF('USER INTERFACE'!$I$23=BOARDWALK!N15,\"X\",\"\")","v":""},0.05,{"$f":"IF(P15=\"\",\"\",Q15*AREA!$H$31)","v":""}]
[null,null,null,null,null,null,null,null,null,null,null,null,null,{"$f":"'USER INTERFACE'!Y11","v":"Moderate"},null,{"$f":"IF('USER INTERFACE'!$I$23=BOARDWALK!N16,\"X\",\"\")","v":""},0.15,{"$f":"IF(P16=\"\",\"\",Q16*AREA!$H$31)","v":""}]
[null,null,null,null,null,null,null,null,null,null,null,null,null,{"$f":"'USER INTERFACE'!Y12","v":"Advanced"},null,{"$f":"IF('USER INTERFACE'!$I$23=BOARDWALK!N17,\"X\",\"\")","v":""},0.45,{"$f":"IF(P17=\"\",\"\",Q17*AREA!$H$31)","v":""}]
[]
[]
[]
[]
[]
[]
[]
[]
[]
[]
[]
[]
[]
[]
[]
[]
[]
[]
[null,null,null,"= Price not included in MassDOT Database."]
[]
[]
[]
[]
[]
[]
[null,null,null,null,null,"Total Cost for Boardwalk",null,null,{"$f":"SUM(J7:J40)","v":0},"DOLLARS"]

{"sheet":"LIGHTING","index":22,"n_rows":64,"n_cols":10,"rows_kept":64,"cut":false,"hidden":true,"merged":[[1,8,1,9],[2,8,2,9],[3,8,3,9],[6,3,6,5],[63,5,63,7],[9,3,9,5],[14,3,14,5],[13,3,13,5],[30,3,30,5],[15,3,15,5],[16,3,16,5],[17,3,17,5],[18,3,18,5],[22,3,22,5],[26,3,26,5],[34,3,34,5],[37,3,37,5],[40,3,40,5],[43,3,43,5],[47,3,47,5],[48,3,48,5],[60,3,60,5],[49,3,49,5],[50,3,50,5],[51,3,51,5],[52,3,52,5],[56,3,56,5]]}
[]
[null,null,"CALC'D BY:","KA","DATE:","2018-02-22",null,"CITY:",{"$f":"AREA!I2","v":0}]
[null,null,"CHK'D BY:",null,"DATE:",null,null,"PROJECT:",{"$f":"AREA!I3","v":0}]
[]
[]
[]
[null,null,"Path Length:",{"$f":"AREA!$H$31","v":0},null,null,"OR","Lighting Length",null,{"$f":"'USER INTERFACE'!$I$44","v":0}]
[null,null,"Assume light every 50' of path."]
[]
[null,null,804.2,"2 INCH ELECTRICAL CONDUIT TYPE NM - PLASTIC (UL)",null,null,{"$f":"G12","v":0},"FT",{"$f":"IF(VLOOKUP(C10,PRICES!$B$2:$J$9998,9,FALSE)<>0,VLOOKUP(C10,PRICES!$B$2:$J$9998,9,FALSE),VLOOKUP(C10,PRICES!$B$2:$H$9998,7,FALSE))","v":28.43},{"$f":"G10*I10","v":0}]
[null,null,null,"Assume a 4' offset from each pullbox to the light poles"]
[null,null,null,4,{"$f":"G27","v":0},"=",{"$f":"D12*E12","v":0},"ft"]
[]
[null,null,804.3,"3 INCH ELECTRICAL CONDUIT TYPE NM - PLASTIC -(UL)",null,null,{"$f":"IF($J$7=0,$D$7,$J$7)","v":0},"FT",{"$f":"IF(VLOOKUP(C14,PRICES!$B$2:$J$9998,9,FALSE)<>0,VLOOKUP(C14,PRICES!$B$2:$J$9998,9,FALSE),VLOOKUP(C14,PRICES!$B$2:$H$9998,7,FALSE))","v":40.76},{"$f":"G14*I14","v":0}]
[null,null,811.22,"ELECTRIC HANDHOLE - SD2.022",null,null,{"$f":"G27","v":0},"EA",{"$f":"IF(VLOOKUP(C15,PRICES!$B$2:$J$9998,9,FALSE)<>0,VLOOKUP(C15,PRICES!$B$2:$J$9998,9,FALSE),VLOOKUP(C15,PRICES!$B$2:$H$9998,7,FALSE))","v":1200},0]
[null,null,812.09,"LIGHT STANDARD FOUNDATION PRECAST",null,null,{"$f":"G27","v":0},"EA",{"$f":"IF(VLOOKUP(C16,PRICES!$B$2:$J$9998,9,FALSE)<>0,VLOOKUP(C16,PRICES!$B$2:$J$9998,9,FALSE),VLOOKUP(C16,PRICES!$B$2:$H$9998,7,FALSE))","v":2610},0]
[null,null,813.4,"WIRE TYPE 8 NO. 10 DIRECT BURIAL",null,null,{"$f":"G10*4","v":0},"FT",{"$f":"IF(VLOOKUP(C17,PRICES!$B$2:$J$9998,9,FALSE)<>0,VLOOKUP(C17,PRICES!$B$2:$J$9998,9,FALSE),VLOOKUP(C17,PRICES!$B$2:$H$9998,7,FALSE))","v":1.53},0]
[null,null,813.43,"WIRE TYPE 8 NO. 4 DIRECT BURIAL",null,null,null,"FT",{"$f":"IF(VLOOKUP(C18,PRICES!$B$2:$J$9998,9,FALSE)<>0,VLOOKUP(C18,PRICES!$B$2:$J$9998,9,FALSE),VLOOKUP(C18,PRICES!$B$2:$H$9998,7,FALSE))","v":2.58},0]
[null,null,813.52099999999996,"WIRE TYPE 10 #6 GROUNDING AND BONDING",null,null,{"$f":"H21","v":0},"FT",1.5,0]
[null,null,null,null,"Item 804.3","Item 804.2"]
[null,null,null,null,{"$f":"G14","v":0},{"$f":"G10","v":0},"=",{"$f":"E21+F21","v":0},"feet"]
[]
[null,null,813.72,"GROUND ROD 10 FT. LONG",null,null,{"$f":"H25","v":0},"EA",{"$f":"IF(VLOOKUP(C23,PRICES!$B$2:$J$9998,9,FALSE)<>0,VLOOKUP(C23,PRICES!$B$2:$J$9998,9,FALSE),VLOOKUP(C23,PRICES!$B$2:$H$9998,7,FALSE))","v":165},{"$f":"G23*I23","v":0}]
[null,null,null,"Item 820.111","Item 823.61","Item 811.22"]
[null,null,null,{"$f":"G27","v":0},{"$f":"G33","v":0},{"$f":"G15","v":0},"=",{"$f":"D25+E25+F25","v":0}]
[]
[null,null,820.11099999999999,"PATH LIGHTING FIXTURE \"A\"",null,null,{"$f":"G29","v":0},"EA",5000,{"$f":"G27*I27","v":0}]
[]
[null,null,"# Lights",{"$f":"IF($J$7=0,$D$7,$J$7)","v":0},50,"=",{"$f":"D29/E29","v":0},"fixtures"]
[]
[null,null,823.61,"HIGHWAY LIGHTING LOAD CENTER NO.1",null,null,1,"LS",{"$f":"G33*G34","v":0},{"$f":"G31*I31","v":0}]
[]
[null,null,null,{"$f":"IF($J$7=0,$D$7,$J$7)","v":0},1000,"=",{"$f":"IF(D33>0,MAX(D33/E33,1),0)","v":0},"load centers"]
[null,null,null,null,null,"Say",10000,"/ea"]
[null,null,"###.##","Bridge Lighting",null,null,1,"LS",{"$f":"SUM(BRIDGE!I9:I24,BRIDGE!I29:I36,BRIDGE!I41:I48)","v":0},{"$f":"G35*I35","v":0}]
[null,null,"See bridge tab for calculations."]
[]
[null,null,"###.##","Culvert Lighting",null,null,1,"LS",{"$f":"SUM(CULVERT!I13:I28,CULVERT!J33:J40)","v":0},{"$f":"G38*I38","v":0}]
[null,null,"See culvert  tab for calculations."]
[]
[null,null,"###.##","Intersection Lighting",null,null,"Length of intersections:",null,{"$f":"SUMIFS('USER INTERFACE'!F60:F79,'USER INTERFACE'!H60:H79,'USER INTERFACE'!S26,'USER INTERFACE'!I60:I79,'USER INTERFACE'!U38)*12+10*E42","v":0}]
[null,null,null,"# Crossings:",{"$f":"COUNTIFS('USER INTERFACE'!H60:H79,'USER INTERFACE'!S26,'USER INTERFACE'!I60:I79,'USER INTERFACE'!U38)","v":0},null,"# lights",null,{"$f":"E42*2","v":0}]
[]
[null,null,804.2,"2 INCH ELECTRICAL CONDUIT TYPE NM - PLASTIC (UL)",null,null,{"$f":"G46","v":0},"FT",{"$f":"IF(VLOOKUP(C44,PRICES!$B$2:$J$9998,9,FALSE)<>0,VLOOKUP(C44,PRICES!$B$2:$J$9998,9,FALSE),VLOOKUP(C44,PRICES!$B$2:$H$9998,7,FALSE))","v":28.43},{"$f":"G44*I44","v":0}]
[null,null,null,"Assume a 4' offset from each pullbox to the light poles"]
[null,null,null,4,{"$f":"G61","v":0},"=",{"$f":"D46*E46","v":0},"ft"]
[]
[null,null,804.3,"3 INCH ELECTRICAL CONDUIT TYPE NM - PLASTIC -(UL)",null,null,{"$f":"I41","v":0},"FT",{"$f":"IF(VLOOKUP(C48,PRICES!$B$2:$J$9998,9,FALSE)<>0,VLOOKUP(C48,PRICES!$B$2:$J$9998,9,FALSE),VLOOKUP(C48,PRICES!$B$2:$H$9998,7,FALSE))","v":40.76},{"$f":"G48*I48","v":0}]
[null,null,811.22,"ELECTRIC HANDHOLE - SD2.022",null,null,{"$f":"G61","v":0},"EA",{"$f":"IF(VLOOKUP(C49,PRICES!$B$2:$J$9998,9,FALSE)<>0,VLOOKUP(C49,PRICES!$B$2:$J$9998,9,FALSE),VLOOKUP(C49,PRICES!$B$2:$H$9998,7,FALSE))","v":1200},0]
[null,null,812.09,"LIGHT STANDARD FOUNDATION PRECAST",null,null,{"$f":"G61","v":0},"EA",{"$f":"IF(VLOOKUP(C50,PRICES!$B$2:$J$9998,9,FALSE)<>0,VLOOKUP(C50,PRICES!$B$2:$J$9998,9,FALSE),VLOOKUP(C50,PRICES!$B$2:$H$9998,7,FALSE))","v":2610},0]
[null,null,813.4,"WIRE TYPE 8 NO. 10 DIRECT BURIAL",null,null,{"$f":"G44*4","v":0},"FT",{"$f":"IF(VLOOKUP(C51,PRICES!$B$2:$J$9998,9,FALSE)<>0,VLOOKUP(C51,PRICES!$B$2:$J$9998,9,FALSE),VLOOKUP(C51,PRICES!$B$2:$H$9998,7,FALSE))","v":1.53},0]
[null,null,813.43,"WIRE TYPE 8 NO. 4 DIRECT BURIAL",null,null,null,"FT",{"$f":"IF(VLOOKUP(C52,PRICES!$B$2:$J$9998,9,FALSE)<>0,VLOOKUP(C52,PRICES!$B$2:$J$9998,9,FALSE),VLOOKUP(C52,PRICES!$B$2:$H$9998,7,FALSE))","v":2.58},0]
[null,null,813.52099999999996,"WIRE TYPE 10 #6 GROUNDING AND BONDING",null,null,{"$f":"H55","v":0},"FT",1.5,0]
[null,null,null,null,"Item 804.3","Item 804.2"]
[null,null,null,null,{"$f":"G48","v":0},{"$f":"G44","v":0},"=",{"$f":"E55+F55","v":0},"feet"]
[]
[null,null,813.72,"GROUND ROD 10 FT. LONG",null,null,{"$f":"H59","v":0},"EA",{"$f":"IF(VLOOKUP(C57,PRICES!$B$2:$J$9998,9,FALSE)<>0,VLOOKUP(C57,PRICES!$B$2:$J$9998,9,FALSE),VLOOKUP(C57,PRICES!$B$2:$H$9998,7,FALSE))","v":165},{"$f":"G57*I57","v":0}]
[null,null,null,null,"Item 820.111","Item 811.22"]
[null,null,null,null,{"$f":"G61","v":0},{"$f":"G49","v":0},"=",{"$f":"E59+F59","v":0}]
[]
[null,null,820.11099999999999,"ROAD LIGHTING FIXTURE \"A\"",null,null,{"$f":"I42","v":0},"EA",6000,{"$f":"G61*I61","v":0}]
[]
[null,null,null,"= Price not included in MassDOT Database."]
[null,null,null,null,null,"Total Cost for Lighting",null,null,{"$f":"IF('USER INTERFACE'!I43=\"No\",0,SUM(J9:J62))","v":0},"DOLLARS"]

{"sheet":"SECURITY","index":23,"n_rows":43,"n_cols":10,"rows_kept":43,"cut":false,"hidden":true,"merged":[[1,8,1,9],[2,8,2,9],[3,8,3,9],[26,3,26,5],[30,3,30,5],[42,5,42,7],[16,3,16,5],[17,3,17,5],[18,3,18,5],[22,3,22,5]]}
[]
[null,null,"CALC'D BY:","KA","DATE:","2017-10-31",null,"CITY:",{"$f":"AREA!I2","v":0}]
[null,null,"CHK'D BY:","KR","DATE:","2017-11-15",null,"PROJECT:",{"$f":"AREA!I3","v":0}]
[]
[]
[]
[null,null,"Length Requiring Secuity:",null,{"$f":"IF('USER INTERFACE'!$I$45='USER INTERFACE'!$X$16,LIGHTING!$D$29,0)+IF(ISNUMBER(SEARCH(\"Partial\",'USER INTERFACE'!$I$45)),'USER INTERFACE'!$I$46,0)","v":0},"# Crossings Requiring Security:",null,null,{"$f":"IF(ISNUMBER(SEARCH(\"Crossings\",'USER INTERFACE'!$I$45)),'USER INTERFACE'!$I$31,0)","v":0}]
[]
[null,null,"Assume a camera every 500 feet of path."]
[null,null,"Assume a camera at each roadway crossing, if required by user inputs."]
[]
[null,null,"COST PER CAMERA",null,null,25000]
[null,null,"NUMBER OF CAMERAS",null,null,{"$f":"ROUNDUP(E7/500, -0.1)+I7","v":0},"EA"]
[null,null,null,null,null,{"$f":"F12*F13","v":0},null,null,null,{"$f":"F14","v":0}]
[]
[]
[]
[]
[]
[]
[]
[]
[]
[]
[]
[]
[]
[]
[]
[]
[]
[]
[]
[]
[]
[]
[]
[]
[null,null,null,"= Price not included in MassDOT Database."]
[]
[]
[]
[null,null,null,null,null,"Total Cost for Security",null,null,{"$f":"SUM(J9:J38)","v":0},"DOLLARS"]

{"sheet":"DRAINAGE","index":24,"n_rows":43,"n_cols":10,"rows_kept":43,"cut":false,"hidden":true,"merged":[[1,8,1,9],[2,8,2,9],[3,8,3,9],[12,3,12,5],[27,3,27,5],[31,3,31,5],[42,5,42,7],[14,3,14,5],[25,3,25,5],[29,3,29,5],[30,3,30,5],[32,3,32,5],[17,3,17,5],[18,3,18,5],[19,3,19,5],[16,3,16,5],[36,3,36,5]]}
[]
[null,null,"CALC'D BY:","KA","DATE:","2017-10-13",null,"CITY:",{"$f":"AREA!I2","v":0}]
[null,null,"CHK'D BY:","KR","DATE:","2017-11-15",null,"PROJECT:",{"$f":"AREA!I3","v":0}]
[]
[]
[]
[null,null,"Sidepath Length:",{"$f":"SUMIF('USER INTERFACE'!$G$19:$J$19,'USER INTERFACE'!$U$29,'USER INTERFACE'!$G$17:$J$17)","v":0},"ft"]
[null,null,"Other SUP Length:",{"$f":"AREA!H31-AREA!H33-DRAINAGE!D7","v":0},"ft","excluding boardwalks"]
[]
[null,null,"If closed system…"]
[null,null,"Assume a catch basin and manhole every 250' along length. Only use if roadway sidepath."]
[]
[null,null,201,"CATCH BASIN",null,null,{"$f":"ROUNDUP(D7/250,0)","v":0},"EA",{"$f":"IF(VLOOKUP(C13,PRICES!$B$2:$J$9998,9,FALSE)<>0,VLOOKUP(C13,PRICES!$B$2:$J$9998,9,FALSE),VLOOKUP(C13,PRICES!$B$2:$H$9998,7,FALSE))","v":4430.75},{"$f":"G13*I13","v":0}]
[]
[null,null,221,"FRAME AND COVER",null,null,{"$f":"G13","v":0},"EA",{"$f":"IF(VLOOKUP(C15,PRICES!$B$2:$J$9998,9,FALSE)<>0,VLOOKUP(C15,PRICES!$B$2:$J$9998,9,FALSE),VLOOKUP(C15,PRICES!$B$2:$H$9998,7,FALSE))","v":864.4},{"$f":"G15*I15","v":0}]
[]
[null,null,241.12,"12 INCH REINFORCED CONCRETE PIPE",null,null,{"$f":"D7","v":0},"FT",{"$f":"IF(VLOOKUP(C17,PRICES!$B$2:$J$9998,9,FALSE)<>0,VLOOKUP(C17,PRICES!$B$2:$J$9998,9,FALSE),VLOOKUP(C17,PRICES!$B$2:$H$9998,7,FALSE))","v":104.73},{"$f":"G17*I17","v":0}]
[]
[null,null,202,"MANHOLE",null,null,{"$f":"G13","v":0},"EA",{"$f":"IF(VLOOKUP(C19,PRICES!$B$2:$J$9998,9,FALSE)<>0,VLOOKUP(C19,PRICES!$B$2:$J$9998,9,FALSE),VLOOKUP(C19,PRICES!$B$2:$H$9998,7,FALSE))","v":4817.26},{"$f":"G19*I19","v":0}]
[]
[]
[]
[null,null,"If open system…"]
[null,null,"Assume erosion control and hydoseed, but drainage is largely accounted for in grading."]
[]
[null,null,null,null,null,null,{"$f":"D8","v":0},"LF",4,{"$f":"G26*I26","v":0}]
[]
[]
[]
[]
[]
[]
[]
[]
[]
[]
[null,null,506,"GRANITE CURB TYPE VB - STRAIGHT",null,null,{"$f":"G38","v":0},"FT",{"$f":"IF(VLOOKUP(C37,PRICES!$B$2:$J$9998,9,FALSE)<>0,VLOOKUP(C37,PRICES!$B$2:$J$9998,9,FALSE),VLOOKUP(C37,PRICES!$B$2:$H$9998,7,FALSE))","v":44.03},{"$f":"G37*I37","v":0}]
[null,null,"Curb?",{"$f":"IF('USER INTERFACE'!$I$16='USER INTERFACE'!$U$29,\"Yes\",\"No\")","v":"No"},null,null,{"$f":"SUMIF('USER INTERFACE'!$G$19:$J$19,'USER INTERFACE'!$U$29,'USER INTERFACE'!$G$17:$J$17)","v":0},"FT"]
[]
[]
[null,null,null,"= Price not included in MassDOT Database."]
[]
[null,null,null,null,null,"Total Cost for Drainage",null,null,{"$f":"SUM(J13:J40)","v":0},"DOLLARS"]

{"sheet":"LANDSCAPING","index":25,"n_rows":43,"n_cols":10,"rows_kept":43,"cut":false,"hidden":true,"merged":[[1,8,1,9],[2,8,2,9],[3,8,3,9],[7,3,7,5],[14,3,14,5],[25,3,25,5],[31,3,31,5],[16,3,16,5],[17,3,17,5],[18,3,18,5],[23,3,23,5]]}
[]
[null,null,"CALC'D BY:","KA","DATE:","2017-10-16",null,"CITY:",{"$f":"AREA!I2","v":0}]
[null,null,"CHK'D BY:","KR","DATE:","2017-11-15",null,"PROJECT:",{"$f":"AREA!I3","v":0}]
[]
[]
[]
[]
[null,null,102.99,"LANDSCAPING",null,null,1,"LS",{"$f":"C11*F13","v":0},{"$f":"G8*I8","v":0}]
[]
[null,null,"Construction Cost (without landscaping or structural)"]
[null,null,{"$f":"ROUND(ASPHALT!$I$43+'POROUS ASPHALT'!$I$43+'STONE DUST'!I43+CONCRETE!$I$43+MISC!$I$43+'CRUSHED STONE'!$I$43+DRAINAGE!$I$43+INTERSECTIONS!$I$43+MISC!$I$43,-2)","v":0}]
[]
[null,null,"% cost of landscaping?",null,{"$f":"'USER INTERFACE'!$I$38","v":0},{"$f":"IF(E13='USER INTERFACE'!$Y$10,0.02,IF(E13='USER INTERFACE'!$Y$11,0.05,0.09))","v":0.09}]
[]
[null,null,707.1,"PARK BENCH",null,null,{"$f":"ROUNDUP(AREA!$H$31/2640,0)","v":0},"EA",{"$f":"IF(VLOOKUP(C15,PRICES!$B$2:$J$9998,9,FALSE)<>0,VLOOKUP(C15,PRICES!$B$2:$J$9998,9,FALSE),VLOOKUP(C15,PRICES!$B$2:$H$9998,7,FALSE))","v":2498.41},{"$f":"G15*I15","v":0}]
[]
[null,null,707.9,"BICYCLE RACK",null,null,{"$f":"ROUNDUP(AREA!$H$31/2640,0)","v":0},"EA",{"$f":"IF(VLOOKUP(C17,PRICES!$B$2:$J$9998,9,FALSE)<>0,VLOOKUP(C17,PRICES!$B$2:$J$9998,9,FALSE),VLOOKUP(C17,PRICES!$B$2:$H$9998,7,FALSE))","v":890.13},{"$f":"G17*I17","v":0}]
[]
[null,null,707.6,"PICNIC TABLE",null,null,{"$f":"ROUNDUP(AREA!$H$31/2640,0)","v":0},"EA",4000,{"$f":"G19*I19","v":0}]
[]
[]
[null,null,"Assume one bench, park, and table every 1/2 mile."]
[]
[null,null,751.7,"COMPOST TOPDRESSING*",null,null,{"$f":"G28","v":0},"SY",{"$f":"IF(VLOOKUP(C24,PRICES!$B$2:$J$9998,9,FALSE)<>0,VLOOKUP(C24,PRICES!$B$2:$J$9998,9,FALSE),VLOOKUP(C24,PRICES!$B$2:$H$9998,7,FALSE))","v":8.52},{"$f":"G24*I24","v":0}]
[]
[null,null,null,"Assume one length of project",null,null,{"$f":"AREA!$H$31","v":0},"ft"]
[null,null,null,null,null,"Assume length of project * 6' width",{"$f":"G26*6","v":0},"sf"]
[null,null,null,null,null,null,{"$f":"G27/9","v":0},"SY"]
[]
[null,null,null,"* Formerly COMPOST TOPSOIL"]
[]
[]
[]
[]
[]
[]
[]
[]
[null,null,null,"= Price not included in MassDOT Database."]
[]
[]
[]
[null,null,null,null,null,null,null,"Total Cost for Lansdcaping & Amenities",{"$f":"SUM(J7:J40)","v":0},"DOLLARS"]

{"sheet":"PARKING","index":26,"n_rows":54,"n_cols":14,"rows_kept":54,"cut":false,"hidden":true,"merged":[[43,3,43,5],[45,3,45,5],[47,3,47,5],[48,3,48,5],[49,3,49,5],[40,3,40,5],[28,3,28,5],[32,3,32,5],[15,3,15,5],[19,3,19,5],[26,3,26,5],[36,3,36,5],[22,3,22,5],[6,3,6,5],[1,8,1,9],[2,8,2,9],[3,8,3,9],[11,3,11,5]]}
[]
[null,null,"CALC'D BY:","KA","DATE:","2018-04-11",null,"CITY:",{"$f":"AREA!I2","v":0}]
[null,null,"CHK'D BY:","DN","DATE:","2018-04-11",null,"PROJECT:",{"$f":"AREA!I3","v":0}]
[]
[]
[]
[null,null,"# Parking Spaces",{"$f":"'USER INTERFACE'!I40","v":0},null,null,"Porous?",{"$f":"'USER INTERFACE'!I41","v":0}]
[]
[null,null,"Area (SF)","Area (SY)","Depth (in.)","Ton/sy/in",null,"Tons"]
[null,null,{"$f":"D7*250","v":0},{"$f":"C10/9","v":0},4,5.6000000000000001E-2,null,{"$f":"C10*E10*F10","v":0}]
[]
[null,null,120.1,"UNCLASSIFIED EXCAVATION",null,null,{"$f":"SUM(G14:G14)","v":0},"CY",{"$f":"IF(VLOOKUP(C12,PRICES!$B$2:$J$9998,9,FALSE)<>0,VLOOKUP(C12,PRICES!$B$2:$J$9998,9,FALSE),VLOOKUP(C12,PRICES!$B$2:$H$9998,7,FALSE))","v":45.87},{"$f":"G12*I12","v":0},null,null,null,12340.740740740741]
[]
[null,null,null,{"$f":"C10","v":0},{"$f":"16/12","v":1.3333333333333333},"=",{"$f":"(D14*E14)/27","v":0},"CY"]
[]
[null,null,151,"GRAVEL BORROW",null,null,{"$f":"G18","v":0},"CY",{"$f":"IF(VLOOKUP(C16,PRICES!$B$2:$J$9998,9,FALSE)<>0,VLOOKUP(C16,PRICES!$B$2:$J$9998,9,FALSE),VLOOKUP(C16,PRICES!$B$2:$H$9998,7,FALSE))","v":45.07},{"$f":"G16*I16","v":0},null,null,null,10097.222222222223]
[]
[null,null,null,{"$f":"C10","v":0},1,"=",{"$f":"(D18*E18)/27","v":0},"CY"]
[]
[null,null,170,"FINE GRADING AND COMPACTING",null,null,{"$f":"G21","v":0},"SY",{"$f":"IF(VLOOKUP(C20,PRICES!$B$2:$J$9998,9,FALSE)<>0,VLOOKUP(C20,PRICES!$B$2:$J$9998,9,FALSE),VLOOKUP(C20,PRICES!$B$2:$H$9998,7,FALSE))","v":5.8},{"$f":"G20*I20","v":0},null,null,null,3216.6666666666665]
[null,null,null,null,{"$f":"D10","v":0},"=",{"$f":"E21","v":0},"SY"]
[]
[null,null,null,null,null,null,null,null,null,null,{"$f":"G23*J23","v":0}]
[]
[]
[]
[null,null,{"$f":"IF(H7='USER INTERFACE'!$Q$31,450.14,450.23)","v":450.23},{"$f":"IF(C27=450.23,\"SUPERPAVE SURFACE COURSE\",\"POROUS PAVEMENT\")","v":"SUPERPAVE SURFACE COURSE"},null,null,{"$f":"ROUNDUP(H10,0)","v":0},"TON",{"$f":"IF(C27=450.14,140,IF(VLOOKUP(C27,PRICES!$B$2:$J$9998,9,FALSE)<>0,VLOOKUP(C27,PRICES!$B$2:$J$9998,9,FALSE),VLOOKUP(C27,PRICES!$B$2:$H$9998,7,FALSE)))","v":118.58},{"$f":"G27*I27","v":0},null,null,null,159986.4]
[]
[null,null,156.01,"#67 CRUSHED STONE FILTER BASE COURSE",null,null,{"$f":"G31","v":0},"CY",50,{"$f":"G29*I29","v":0},null,null,null,62500]
[]
[null,null,null,{"$f":"C10","v":0},0.16666666666666666,"=",{"$f":"D31*E31/27","v":0},"CY"]
[]
[null,null,156.02000000000001,"#57 CRUSHED STONE RESERVOIR SUB-BASE COURSE",null,null,{"$f":"G35","v":0},"CY",55,{"$f":"G33*I33","v":0},null,null,null,412500]
[]
[null,null,null,{"$f":"C10","v":0},1,"=",{"$f":"D35*E35/27","v":0},"CY"]
[]
[null,null,698.1,"GEOTEXTILE FABRIC FOR STABILIZATION",null,null,{"$f":"H39","v":0},"SY",{"$f":"IF(VLOOKUP(C37,PRICES!$B$2:$J$9998,9,FALSE)<>0,VLOOKUP(C37,PRICES!$B$2:$J$9998,9,FALSE),VLOOKUP(C37,PRICES!$B$2:$H$9998,7,FALSE))","v":6.17},{"$f":"G37*I37","v":0},null,null,null,4233.3333333333339]
[]
[null,null,"Fabric on bottom of trenches (total area of Porous Pavement)",null,null,null,null,{"$f":"$D$10","v":0},"SY"]
[]
[null,null,101,"CLEARING AND GRUBBING",null,null,{"$f":"C10/43560","v":0},"A",{"$f":"IF(VLOOKUP(C41,PRICES!$B$2:$J$9998,9,FALSE)<>0,VLOOKUP(C41,PRICES!$B$2:$J$9998,9,FALSE),VLOOKUP(C41,PRICES!$B$2:$H$9998,7,FALSE))","v":35950.71},{"$f":"G41*I41","v":0},null,null,null,3485.6680440771347]
[]
[null,null,"Assume 1 CB, 10' drainage pipe, and 2 leaching basins for every 20 parking spaces"]
[null,null,201,"CATCH BASIN",null,null,{"$f":"ROUND(D7/20,0)","v":0},"EA",{"$f":"IF(VLOOKUP(C44,PRICES!$B$2:$J$9998,9,FALSE)<>0,VLOOKUP(C44,PRICES!$B$2:$J$9998,9,FALSE),VLOOKUP(C44,PRICES!$B$2:$H$9998,7,FALSE))","v":4430.75},{"$f":"G44*I44","v":0}]
[]
[null,null,221,"FRAME AND COVER",null,null,{"$f":"G44","v":0},"EA",{"$f":"IF(VLOOKUP(C46,PRICES!$B$2:$J$9998,9,FALSE)<>0,VLOOKUP(C46,PRICES!$B$2:$J$9998,9,FALSE),VLOOKUP(C46,PRICES!$B$2:$H$9998,7,FALSE))","v":864.4},{"$f":"G46*I46","v":0}]
[]
[null,null,241.12,"12 INCH REINFORCED CONCRETE PIPE",null,null,{"$f":"10*G46","v":0},"FT",{"$f":"IF(VLOOKUP(C48,PRICES!$B$2:$J$9998,9,FALSE)<>0,VLOOKUP(C48,PRICES!$B$2:$J$9998,9,FALSE),VLOOKUP(C48,PRICES!$B$2:$H$9998,7,FALSE))","v":104.73},{"$f":"G48*I48","v":0}]
[]
[null,null,205,"LEACHING BASIN",null,null,{"$f":"G44*2","v":0},"EA",{"$f":"IF(VLOOKUP(C50,PRICES!$B$2:$J$9998,9,FALSE)<>0,VLOOKUP(C50,PRICES!$B$2:$J$9998,9,FALSE),VLOOKUP(C50,PRICES!$B$2:$H$9998,7,FALSE))","v":6448.94},{"$f":"G50*I50","v":0}]
[]
[null,null,null,"= Price not included in MassDOT Database."]
[]
[null,null,null,null,null,null,null,"Total Cost for Parking",{"$f":"J41+IF($H$7='USER INTERFACE'!$Q$31,$J$12+SUM($J$27:$J$37),IF($H$7='USER INTERFACE'!$Q$32,SUM($J$12:$J$27,J44:J50),0))","v":0},"DOLLARS"]