{"text_format":"1","workbook":"xlsx","n_sheets":27,"sheets":["USER INTERFACE","ASSUMPTIONS","SUMMARY","AREA","PRICES","DESIGN","SURVEY","TTCP","ASPHALT","POROUS ASPHALT","STONE DUST","STABILIZED AGG","CONCRETE","CRUSHED STONE","MULCH","MISC","INTERSECTIONS","ENVIRONMENTAL","BRIDGE","CULVERT","RETAINING WALL","BOARDWALK","LIGHTING","SECURITY","DRAINAGE","LANDSCAPING","PARKING"],"not_rendered":{"charts":0,"images":14,"macros":1,"external_links":0,"defined_names":32,"comments":0,"pivot_tables":0},"unopened":[],"bounds":{"document_bytes":16777216,"sheet_cells":100000,"rows_first":2000,"rows_last":500,"rows_between":2000,"halvings":0,"cell_chars":16384,"cell_head_chars":4096},"cells_cut":0,"cells_raw":0,"read":"whole","date_system":"1900"}

{"sheet":"USER INTERFACE","index":0,"n_rows":113,"n_cols":33,"rows_kept":113,"cut":false,"hidden":false,"merged":[[73,2,73,3],[74,2,74,3],[75,2,75,3],[76,2,76,3],[68,2,68,3],[69,2,69,3],[70,2,70,3],[71,2,71,3],[72,2,72,3],[63,2,63,3],[64,2,64,3],[65,2,65,3],[66,2,66,3],[67,2,67,3],[58,9,58,10],[59,9,59,10],[60,9,60,10],[61,9,61,10],[62,2,62,3],[62,9,62,10],[61,2,61,3],[60,2,60,3],[59,2,59,3],[58,2,58,3],[63,9,63,10],[64,9,64,10],[65,9,65,10],[66,9,66,10],[72,11,72,12],[72,9,72,10],[71,11,71,12],[75,11,75,12],[76,11,76,12],[74,9,74,10],[75,9,75,10],[76,9,76,10],[1,8,1,9],[2,8,2,9],[3,16,5,19],[51,4,52,7],[54,2,54,9],[46,8,47,9],[48,8,48,9],[4,4,5,7],[7,2,7,9],[50,16,52,19],[49,8,49,9],[1,4,3,7],[48,4,50,7],[74,16,74,17],[75,16,75,17],[76,16,76,17],[108,3,108,5],[98,3,98,5],[103,3,103,5],[77,16,77,17],[78,16,78,17],[78,11,78,12],[77,11,77,12],[93,8,94,9],[77,2,77,3],[78,2,78,3],[77,9,77,10],[78,9,78,10],[74,11,74,12],[73,11,73,12],[66,16,66,17],[67,11,67,12],[68,11,68,12],[69,11,69,12],[70,11,70,12],[72,16,72,17],[73,16,73,17],[67,16,67,17],[68,16,68,17],[69,16,69,17],[70,16,70,17],[71,16,71,17],[73,9,73,10],[67,9,67,10],[68,9,68,10],[69,9,69,10],[70,9,70,10],[71,9,71,10],[13,26,15,34],[62,16,62,17],[63,16,63,17],[64,16,64,17],[65,16,65,17],[59,16,59,17],[60,16,60,17],[61,16,61,17],[21,26,25,33]]}
[]
[null,null,null,null,"Shared Used Path Design Guide",null,null,null,null,null,null,null,null,null,null,null,null,null,null,null,null,null,null,null,null,null,"INSTRUCTIONS & INFORMATION SEEN BELOW - WILL NOT PRINT"]
[null,null,null,null,null,null,null,null,null,null,null,null,null,null,null,null,null,null,null,null,null,null,null,null,null,null,"Press [Tab] or use your mouse to move between fields."]
[null,null,null,null,null,null,null,null,null,null,null,null,null,null,null,null,"DO NOT MOVE CELLS",null,null,null,null,null,null,null,null,null,"Color Key:"]
[null,null,null,null,"Cost Estimator"]
[]
[]
[null,null,"PROJECT INPUTS - PAGE 1 OF 2"]
[null,null,"PROJECT DESCRIPTION",null,null,null,null,null,"INPUT","CLICK INFO",null,null,null,null,null,null,"Surface Materials",null,null,null,"Bridge",null,null,"Yes/No","Landscaping"]
[null,null,null,null,null,null,null,null,null,null,null,null,null,null,null,null,"Asphalt",null,null,null,"Yes",null,null,"Yes","Minimal"]
{"$rows_left_out":104}
{"sheet":"ASSUMPTIONS","index":1,"n_rows":39,"n_cols":5,"rows_kept":39,"cut":false,"hidden":false,"merged":[[38,2,39,9],[15,2,16,9],[1,8,1,9],[2,8,2,9],[4,4,5,7],[7,2,7,9],[1,4,3,7]]}
[]
[null,null,null,null,"Shared Used Path Design Guide"]
[]
[]
[null,null,null,null,"Cost Estimator"]
[]
[]
[null,null,"ESTIMATING TOOL ASSUMPTIONS"]
[]
[null,null,"The statewide unit cost prices are exported from the MassDOT website."]
{"$rows_left_out":30}
{"sheet":"SUMMARY","index":2,"n_rows":53,"n_cols":17,"rows_kept":53,"cut":false,"hidden":false,"merged":[[45,2,45,9],[44,2,44,9],[39,2,39,9],[40,2,40,9],[41,2,41,9],[42,2,42,9],[43,2,43,9],[1,8,1,9],[2,8,2,9],[4,4,5,7],[7,2,7,9],[38,2,38,9],[8,3,8,8],[9,3,9,8],[1,4,3,7]]}
[]
[null,null,null,null,"Shared Used Path Design Guide"]
[]
[]
[null,null,null,null,"Cost Estimator"]
[]
[]
[null,null,"PROJECT COST SUMMARY"]
[null,null,"Project Name:","Please enter Project Name here"]
[null,null,"Project Location:","Please enter Project Town here"]
{"$rows_left_out":44}
{"sheet":"AREA","index":3,"n_rows":41,"n_cols":16,"rows_kept":41,"cut":false,"hidden":true,"merged":[[1,8,1,9],[2,8,2,9],[5,4,6,7],[8,2,8,9]]}
[]
[]
[]
[]
[]
[null,null,null,null,"Shared Used Path Design Guide\nCost Estimator"]
[]
[]
[null,null,"AREA SUMMARY"]
[]
{"$rows_left_out":32}
{"sheet":"PRICES","index":4,"n_rows":4065,"n_cols":14,"rows_kept":4065,"cut":false,"hidden":true,"merged":[]}
["Location","Item #","Description","Units","Quantity","# of Projects","Median Price","Mean Price","SUP Multiplier","SUP Price",null,null,"Updated","2021-06-02"]
["All Districts",100,"SCHEDULE OF OPERATIONS - FIXED PRICE $__________","LS",200,34,26500,28050.02]
["All Districts",100.001,"ELECTRICIAN","HR",24365,5,131,128.62]
["All Districts",100.002,"LABORER","HR",9106,11,92.5,91.43]
["All Districts",100.003,"SKILLED LABORER","HR",800,1,65,58.75]
["All Districts",100.005,"PLUMBER","HR",1120,1,145,139.75]
["All Districts",100.1,"BASE LABOR RATE","HR",357623,39,118,118.46]
["All Districts",100.4,"STORAGE FACILITY OR BUILDING","LS",6,1,581250,559457.17000000004]
["All Districts",100.5,"ELECTRICAL WORK","LS",10,3,77000,61048.6]
["All Districts",100.61,"HVAC WORK","LS",4,2,645750,732757.5]
{"$rows_left_out":4056}
{"sheet":"DESIGN","index":5,"n_rows":43,"n_cols":13,"rows_kept":43,"cut":false,"hidden":true,"merged":[[42,5,42,7],[39,6,39,7],[1,8,1,9],[2,8,2,9],[3,8,3,9],[18,4,18,5]]}
[]
[null,null,"CALC'D BY:","KA","DATE:","2017-11-02",null,"CITY:",{"$f":"AREA!I2","v":0}]
[null,null,"CHK'D BY:","KR","DATE:","2017-11-15",null,"PROJECT:",{"$f":"AREA!I3","v":0}]
[]
[]
[]
[]
[null,null,"Total Construction Cost:",null,null,{"$f":"SUM(SUMMARY!$I$13+SUMMARY!$I$15)","v":0}]
[null,null,"(Path + Structures)"]
[null,null,"Base design fee based on construction cost"]
{"$rows_left_out":34}
{"sheet":"SURVEY","index":6,"n_rows":43,"n_cols":10,"rows_kept":43,"cut":false,"hidden":true,"merged":[[19,3,19,5],[30,3,30,5],[31,3,31,5],[22,3,22,5],[23,3,23,5],[27,3,27,5],[28,3,28,5],[29,3,29,5],[12,3,12,5],[1,8,1,9],[2,8,2,9],[3,8,3,9],[10,3,10,5]]}
[]
[null,null,"CALC'D BY:","KA","DATE:","2017-10-25",null,"CITY:",{"$f":"AREA!I2","v":0}]
[null,null,"CHK'D BY:","KR","DATE:","2017-11-15",null,"PROJECT:",{"$f":"AREA!I3","v":0}]
[]
[]
[]
[null,null,"Existing Conditions",null,{"$f":"'USER INTERFACE'!G18","v":0},{"$f":"'USER INTERFACE'!H18","v":0},{"$f":"'USER INTERFACE'!I18","v":0},{"$f":"'USER INTERFACE'!J18","v":0}]
[null,null,"Length",null,{"$f":"'USER INTERFACE'!G17","v":0},{"$f":"'USER INTERFACE'!H17","v":0},{"$f":"'USER INTERFACE'!I17","v":0},{"$f":"'USER INTERFACE'!J17","v":0}]
[]
[]
{"$rows_left_out":34}
{"sheet":"TTCP","index":7,"n_rows":43,"n_cols":13,"rows_kept":43,"cut":false,"hidden":true,"merged":[[31,3,31,5],[21,3,21,5],[27,3,27,5],[28,3,28,5],[29,3,29,5],[30,3,30,5],[1,8,1,9],[2,8,2,9],[3,8,3,9],[10,3,10,5],[18,3,18,5]]}
[]
[null,null,"CALC'D BY:","KA","DATE:","2017-10-25",null,"CITY:",{"$f":"AREA!I2","v":0}]
[null,null,"CHK'D BY:","KR","DATE:","2017-11-15",null,"PROJECT:",{"$f":"AREA!I3","v":0}]
[]
[]
[]
[null,null,"Proposed Path",null,{"$f":"'USER INTERFACE'!G19","v":0},{"$f":"'USER INTERFACE'!H19","v":0},{"$f":"'USER INTERFACE'!I19","v":0},{"$f":"'USER INTERFACE'!J19","v":0}]
[null,null,"Length",null,{"$f":"'USER INTERFACE'!G17","v":0},{"$f":"'USER INTERFACE'!H17","v":0},{"$f":"'USER INTERFACE'!I17","v":0},{"$f":"'USER INTERFACE'!J17","v":0}]
[]
[]
{"$rows_left_out":34}
{"sheet":"ASPHALT","index":8,"n_rows":43,"n_cols":11,"rows_kept":43,"cut":false,"hidden":true,"merged":[[1,8,1,9],[2,8,2,9],[42,5,42,7],[3,8,3,9],[13,6,13,7],[33,3,33,5],[8,3,8,5],[14,3,14,5],[23,3,23,5],[28,3,28,5],[20,3,20,5]]}
[]
[null,null,"CALC'D BY:","KA","DATE:","2021-06-02",null,"CITY:",{"$f":"AREA!I2","v":0}]
[null,null,"CHK'D BY:","KR","DATE:","2017-11-15",null,"PROJECT:",{"$f":"AREA!I3","v":0}]
[]
[]
[]
[null,null,null,null,null,null,"Shoulder Area",{"$f":"SUMIF('USER INTERFACE'!$G$21:$J$21,'USER INTERFACE'!$Q10,'USER INTERFACE'!$G$17:$J$17)*4","v":0},"SF"]
[]
[null,null,120.1,"UNCLASSIFIED EXCAVATION",null,null,{"$f":"SUM(G12:G13)","v":0},"CY",{"$f":"IF(VLOOKUP(C9,PRICES!$B$2:$J$9998,9,FALSE)<>0,VLOOKUP(C9,PRICES!$B$2:$J$9998,9,FALSE),VLOOKUP(C9,PRICES!$B$2:$H$9998,7,FALSE))","v":45.87},{"$f":"G9*I9","v":0}]
[]
{"$rows_left_out":34}
{"sheet":"POROUS ASPHALT","index":9,"n_rows":43,"n_cols":10,"rows_kept":43,"cut":false,"hidden":true,"merged":[[1,8,1,9],[2,8,2,9],[3,8,3,9],[12,6,12,7],[8,3,8,5],[13,3,13,5],[23,3,23,5],[31,3,31,5],[27,3,27,5],[18,3,18,5]]}
[]
[null,null,"CALC'D BY:","KA","DATE:","2017-10-31",null,"CITY:",{"$f":"AREA!I2","v":0}]
[null,null,"CHK'D BY:","KR","DATE:","2017-11-15",null,"PROJECT:",{"$f":"AREA!I3","v":0}]
[]
[]
[]
[null,null,null,null,null,null,"Shoulder Area",{"$f":"SUMIF('USER INTERFACE'!$G$21:$J$21,'USER INTERFACE'!$Q11,'USER INTERFACE'!$G$17:$J$17)*4","v":0},"SF"]
[]
[null,null,120.1,"UNCLASSIFIED EXCAVATION",null,null,{"$f":"SUM(G11:G12)","v":0},"CY",{"$f":"IF(VLOOKUP(C9,PRICES!$B$2:$J$9998,9,FALSE)<>0,VLOOKUP(C9,PRICES!$B$2:$J$9998,9,FALSE),VLOOKUP(C9,PRICES!$B$2:$H$9998,7,FALSE))","v":45.87},{"$f":"G9*I9","v":0}]
[null,null,null,"Area (SF)","Depth (ft.)"]
{"$rows_left_out":34}
{"sheet":"STONE DUST","index":10,"n_rows":43,"n_cols":10,"rows_kept":43,"cut":false,"hidden":true,"merged":[[42,5,42,7],[1,8,1,9],[2,8,2,9],[3,8,3,9],[7,3,7,5],[32,3,32,5],[26,3,26,5]]}
[]
[null,null,"CALC'D BY:","KA","DATE:","2017-10-31",null,"CITY:",{"$f":"AREA!I2","v":0}]
[null,null,"CHK'D BY:","KR","DATE:","2017-11-15",null,"PROJECT:",{"$f":"AREA!I3","v":0}]
[]
[]
[]
[null,null,null,null,null,null,"Shoulder Area",{"$f":"SUMIF('USER INTERFACE'!$G$21:$J$21,'USER INTERFACE'!$Q12,'USER INTERFACE'!$G$17:$J$17)*4","v":0},"SF"]
[null,null,704.12,"STONE DUST PAVEMENT",null,null,{"$f":"G17","v":0},"TONS",30,{"$f":"G8*I8","v":0}]
[]
[null,null,"SHOULDER"]
{"$rows_left_out":34}
{"sheet":"STABILIZED AGG","index":11,"n_rows":43,"n_cols":16,"rows_kept":43,"cut":false,"hidden":true,"merged":[[28,6,28,7],[8,3,8,5],[13,6,13,7],[14,3,14,5],[1,8,1,9],[2,8,2,9],[3,8,3,9],[20,3,20,5],[24,6,24,7]]}
[]
[null,null,"CALC'D BY:","KA","DATE:","2018-02-14",null,"CITY:",{"$f":"AREA!I2","v":0}]
[null,null,"CHK'D BY:",null,"DATE:",null,null,"PROJECT:",{"$f":"AREA!I3","v":0}]
[]
[]
[]
[null,null,null,null,null,null,"Path Area",{"$f":"AREA!$H$20","v":0},"SF"]
[null,null,null,null,null,null,"Shoulder Area",{"$f":"SUMIF('USER INTERFACE'!$G$21:$J$21,'USER INTERFACE'!$Q14,'USER INTERFACE'!$G$17:$J$17)*4","v":0},"SF"]
[null,null,120.1,"UNCLASSIFIED EXCAVATION",null,null,{"$f":"SUM(G12:G13)","v":0},"CY",{"$f":"IF(VLOOKUP(C9,PRICES!$B$2:$J$9998,9,FALSE)<>0,VLOOKUP(C9,PRICES!$B$2:$J$9998,9,FALSE),VLOOKUP(C9,PRICES!$B$2:$H$9998,7,FALSE))","v":45.87},{"$f":"G9*I9","v":0}]
[]
{"$rows_left_out":34}
{"sheet":"CONCRETE","index":12,"n_rows":43,"n_cols":13,"rows_kept":43,"cut":false,"hidden":true,"merged":[[13,3,13,5],[1,8,1,9],[2,8,2,9],[3,8,3,9],[7,3,7,5],[12,6,12,7],[42,5,42,7],[28,3,28,5],[30,3,30,5],[19,3,19,5],[24,3,24,5],[34,3,34,5],[35,3,35,5],[29,3,29,5]]}
[]
[null,null,"CALC'D BY:","KA","DATE:","2017-10-13",null,"CITY:",{"$f":"AREA!I2","v":0}]
[null,null,"CHK'D BY:","KR","DATE:","2017-11-15",null,"PROJECT:",{"$f":"AREA!I3","v":0}]
[]
[]
[]
[null,null,null,null,null,null,"Shoulder Area",{"$f":"SUMIF('USER INTERFACE'!$G$21:$J$21,'USER INTERFACE'!$Q13,'USER INTERFACE'!$G$17:$J$17)*4","v":0},"SF"]
[null,null,120.1,"UNCLASSIFIED EXCAVATION",null,null,{"$f":"G11+G12","v":0},"CY",{"$f":"IF(VLOOKUP(C8,PRICES!$B$2:$J$9998,9,FALSE)<>0,VLOOKUP(C8,PRICES!$B$2:$J$9998,9,FALSE),VLOOKUP(C8,PRICES!$B$2:$H$9998,7,FALSE))","v":45.87},{"$f":"G8*I8","v":0}]
[]
[null,null,null,"Area (SF)","Depth (ft.)"]
{"$rows_left_out":34}
{"sheet":"CRUSHED STONE","index":13,"n_rows":43,"n_cols":10,"rows_kept":43,"cut":false,"hidden":true,"merged":[[25,3,25,5],[1,8,1,9],[2,8,2,9],[3,8,3,9],[7,3,7,5],[12,3,12,5]]}
[]
[null,null,"CALC'D BY:","KA","DATE:","2017-10-31",null,"CITY:",{"$f":"AREA!I2","v":0}]
[null,null,"CHK'D BY:","KR","DATE:","2017-11-15",null,"PROJECT:",{"$f":"AREA!I3","v":0}]
[]
[]
[]
[null,null,null,null,null,null,"Shoulder Area",{"$f":"SUMIF('USER INTERFACE'!$G$21:$J$21,'USER INTERFACE'!$Q15,'USER INTERFACE'!$G$17:$J$17)*4","v":0},"SF"]
[null,null,156,"CRUSHED STONE",null,null,{"$f":"G20","v":0},"TONS",{"$f":"IF(VLOOKUP(C8,PRICES!$B$2:$J$9998,9,FALSE)<>0,VLOOKUP(C8,PRICES!$B$2:$J$9998,9,FALSE),VLOOKUP(C8,PRICES!$B$2:$H$9998,7,FALSE))","v":49.3},{"$f":"G8*I8","v":0}]
[]
[null,null,"SHOULDER"]
{"$rows_left_out":34}
{"sheet":"MULCH","index":14,"n_rows":43,"n_cols":13,"rows_kept":43,"cut":false,"hidden":true,"merged":[[17,3,17,5],[1,8,1,9],[2,8,2,9],[3,8,3,9],[7,3,7,5],[12,3,12,5]]}
[]
[null,null,"CALC'D BY:","KA","DATE:","2017-10-31",null,"CITY:",{"$f":"AREA!I2","v":0}]
[null,null,"CHK'D BY:","KR","DATE:","2017-11-15",null,"PROJECT:",{"$f":"AREA!I3","v":0}]
[]
[]
[]
[null,null,null,null,null,null,"Shoulder Area",{"$f":"SUMIF('USER INTERFACE'!$G$21:$J$21,'USER INTERFACE'!$Q17,'USER INTERFACE'!$G$17:$J$17)*4","v":0},"SF"]
[null,null,769,"PAVEMENT MILLING MULCH",null,null,{"$f":"G11","v":0},"FT",{"$f":"IF(VLOOKUP(C8,PRICES!$B$2:$J$9998,9,FALSE)<>0,VLOOKUP(C8,PRICES!$B$2:$J$9998,9,FALSE),VLOOKUP(C8,PRICES!$B$2:$H$9998,7,FALSE))","v":9.66},{"$f":"G8*I8","v":0},null,null,1631]
[]
[null,null,"Milling Mulch Shoulder"]
{"$rows_left_out":34}
{"sheet":"MISC","index":15,"n_rows":43,"n_cols":13,"rows_kept":43,"cut":false,"hidden":true,"merged":[[31,3,31,5],[28,3,28,5],[7,3,7,5],[1,8,1,9],[2,8,2,9],[3,8,3,9],[14,3,14,5],[15,3,15,5]]}
[]
[null,null,"CALC'D BY:","KA","DATE:","2017-10-31",null,"CITY:",{"$f":"AREA!I2","v":0}]
[null,null,"CHK'D BY:","KR","DATE:","2017-11-15",null,"PROJECT:",{"$f":"AREA!I3","v":0}]
[]
[]
[]
[]
[null,null,665.3,"WOOD RAIL FENCE",null,null,{"$f":"SUM(H11:H14)","v":0},"FT",50,{"$f":"G8*I8","v":0}]
[null,null,"Assume 50% of path has afence on both sides if hilly or waterfront, otherwise 25%. 100% for boardwalk."]
[]
{"$rows_left_out":34}
{"sheet":"INTERSECTIONS","index":16,"n_rows":43,"n_cols":10,"rows_kept":43,"cut":false,"hidden":true,"merged":[[1,8,1,9],[2,8,2,9],[3,8,3,9],[10,6,10,7],[7,3,7,5],[27,3,27,5],[42,5,42,7],[11,3,11,5],[20,3,20,5],[16,3,16,5],[19,3,19,5],[12,3,12,5],[24,3,24,5],[33,3,33,5],[35,3,35,5],[28,3,28,5],[29,3,29,5],[26,3,26,5],[37,3,37,5]]}
[]
[null,null,"CALC'D BY:","KA","DATE:","2017-10-16",null,"CITY:",{"$f":"AREA!I2","v":0}]
[null,null,"CHK'D BY:","KR","DATE:","2017-11-15",null,"PROJECT:",{"$f":"AREA!I3","v":0}]
[]
[]
[null,null,"# WCRs",{"$f":"'USER INTERFACE'!$I$31*2","v":0}]
[]
[null,null,151,"GRAVEL BORROW",null,null,{"$f":"G10","v":0},"CY",{"$f":"IF(VLOOKUP(C8,PRICES!$B$2:$J$9998,9,FALSE)<>0,VLOOKUP(C8,PRICES!$B$2:$J$9998,9,FALSE),VLOOKUP(C8,PRICES!$B$2:$H$9998,7,FALSE))","v":45.07},{"$f":"G8*I8","v":0}]
[null,null,"Area (SF)","x","Depth (ft.)"]
[null,null,{"$f":"AREA!$H$14","v":0},null,{"$f":"8/12","v":0.66666666666666663},"=",{"$f":"(C10*E10)/27","v":0},"CY"]
{"$rows_left_out":34}
{"sheet":"ENVIRONMENTAL","index":17,"n_rows":43,"n_cols":13,"rows_kept":43,"cut":false,"hidden":true,"merged":[[27,3,27,5],[28,3,28,5],[30,3,30,5],[8,3,8,5],[1,8,1,9],[2,8,2,9],[3,8,3,9],[13,3,13,5],[6,3,6,5],[7,3,7,5]]}
[]
[null,null,"CALC'D BY:","KA","DATE:","2018-02-13",null,"CITY:",{"$f":"AREA!I2","v":0}]
[null,null,"CHK'D BY:","KR","DATE:","2017-11-15",null,"PROJECT:",{"$f":"AREA!I3","v":0}]
[]
[]
[]
[null,null,767.12099999999998,"SEDIMENT CONTROLS*",null,null,{"$f":"G9","v":0},"FT",{"$f":"IF(VLOOKUP(C7,PRICES!$B$2:$J$9998,9,FALSE)<>0,VLOOKUP(C7,PRICES!$B$2:$J$9998,9,FALSE),VLOOKUP(C7,PRICES!$B$2:$H$9998,7,FALSE))","v":7.01},{"$f":"G7*I7","v":0}]
[null,null,null,"Placed at bottom of proposed slopes"]
[null,null,null,"Assume one length of project",null,null,{"$f":"AREA!$H$31","v":0},"ft"]
[null,null,null,"*Formerly COMPOST FILTER TUBES"]
{"$rows_left_out":34}
{"sheet":"BRIDGE","index":18,"n_rows":55,"n_cols":15,"rows_kept":55,"cut":false,"hidden":true,"merged":[[5,7,6,9],[54,5,54,7],[1,8,1,9],[2,8,2,9],[3,8,3,9],[49,3,49,5],[51,3,51,5],[50,3,50,5],[52,3,52,5],[27,6,27,7],[28,6,28,7],[29,6,29,7],[30,6,30,7],[31,6,31,7],[32,6,32,7],[33,6,33,7],[45,6,45,7],[46,6,46,7],[47,6,47,7],[35,6,35,7],[39,6,39,7],[17,6,17,7],[18,6,18,7],[19,6,19,7],[43,6,43,7],[44,6,44,7],[20,6,20,7],[21,6,21,7],[22,6,22,7],[23,6,23,7],[42,6,42,7],[41,6,41,7],[40,6,40,7],[34,6,34,7],[12,6,12,7],[13,6,13,7],[14,6,14,7],[15,6,15,7],[16,6,16,7],[7,6,7,7],[8,6,8,7],[9,6,9,7],[10,6,10,7],[11,6,11,7]]}
[]
[null,null,"CALC'D BY:","KA","DATE:","2018-02-21",null,"CITY:",{"$f":"AREA!I2","v":0}]
[null,null,"CHK'D BY:",null,"DATE:",null,null,"PROJECT:",{"$f":"AREA!I3","v":0}]
[]
[]
[null,null,null,null,null,null,null,"Assume $100/ft for bridges. Sum is included on Lighting tab."]
[null,null,"From Intersection Crossings:"]
[null,null,null,"Crossing #","No. Lanes","Length","Lighting",null,"Lighting Cost"]
[null,null,null,{"$f":"IFERROR(INDEX('USER INTERFACE'!$B$60:$B$79,SMALL(IF(\"Bridge\"='USER INTERFACE'!$B$60:$J$79,ROW('USER INTERFACE'!$B$60:$B$79)-MIN(ROW('USER INTERFACE'!$B$60:$B$79))+1,\"\"),ROW()-8)),\"No\")","v":"No"},{"$f":"IF(D9=\"No\",0,VLOOKUP(D9,'USER INTERFACE'!$B$60:$H79,5,FALSE))","v":0},{"$f":"IF(E9>0,12*E9+50,\"\")","v":""},{"$f":"IF(D9=\"No\",0,VLOOKUP(D9,'USER INTERFACE'!$B$60:$I79,8,FALSE))","v":0},null,{"$f":"IF(G9='USER INTERFACE'!$U$38,IF(F9<>\"\",F9*$N$17,0),0)","v":0}]
[null,null,null,"No",{"$f":"IF(D10=\"No\",0,VLOOKUP(D10,'USER INTERFACE'!$C$60:$I80,5,FALSE))","v":0},{"$f":"IF(E10>0,12*E10+50,\"\")","v":""},{"$f":"IF(D10=\"No\",0,VLOOKUP(D10,'USER INTERFACE'!$B$60:$I80,8,FALSE))","v":0},null,{"$f":"IF(G10='USER INTERFACE'!$U$38,IF(F10<>\"\",F10*$N$17,0),0)","v":0}]
{"$rows_left_out":46}
{"sheet":"CULVERT","index":19,"n_rows":43,"n_cols":21,"rows_kept":43,"cut":false,"hidden":true,"merged":[[35,7,35,8],[36,7,36,8],[37,7,37,8],[38,7,38,8],[39,7,39,8],[25,6,25,7],[26,6,26,7],[27,6,27,7],[33,7,33,8],[34,7,34,8],[11,6,11,7],[12,6,12,7],[31,7,31,8],[32,7,32,8],[13,6,13,7],[14,6,14,7],[15,6,15,7],[16,6,16,7],[17,6,17,7],[18,6,18,7],[19,6,19,7],[20,6,20,7],[21,6,21,7],[22,6,22,7],[23,6,23,7],[24,6,24,7],[8,3,8,5],[9,3,9,5],[6,14,6,16],[1,8,1,9],[2,8,2,9],[3,8,3,9],[5,7,6,9]]}
[]
[null,null,"CALC'D BY:","KA","DATE:","2017-11-03",null,"CITY:",{"$f":"AREA!I2","v":0}]
[null,null,"CHK'D BY:","KR","DATE:","2017-11-15",null,"PROJECT:",{"$f":"AREA!I3","v":0}]
[]
[]
[null,null,null,null,null,null,null,"Assume $75/ft for culverts. Sum is included on Lighting tab."]
[null,null,null,null,null,null,null,null,null,null,null,null,null,995.01099999999997,"CULVERT",null,null,1,"LS",{"$f":"SUM(J8:J25)","v":0},{"$f":"R7*T7","v":0}]
[null,null,"Unit Cost for 995.011-1 includes excavation, concrete, rebar, backfill, headwalls and wingwalls."]
[null,null,"995.011-1","PRECAST CONCRETE BOX CULVERT",null,null,{"$f":"SUM(F13:F28,F33:F40)-SUMIF(G33:G40,\"Yes\",F33:F40)","v":0},"FT",12000,{"$f":"G9*I9","v":0},null,null,null,"Assumed/inputted dimensions"]
[null,null,992.3,"TEMPORARY SUPPORTS FOR BRIDGE STRUCTURE",null,null,{"$f":"G9*10*2","v":0},"SF",100,{"$f":"G10*I10","v":0},null,null,null,null,"L (FT.)","W (FT.)","H (FT.)","AREA (SF)","VOL (CF)"]
{"$rows_left_out":34}
{"sheet":"RETAINING WALL","index":20,"n_rows":68,"n_cols":14,"rows_kept":68,"cut":false,"hidden":true,"merged":[[17,3,17,5],[56,2,56,4],[1,8,1,9],[2,8,2,9],[3,8,3,9]]}
[]
[null,null,"CALC'D BY:","KA","DATE:","2017-11-03",null,"CITY:",{"$f":"AREA!I2","v":0}]
[null,null,"CHK'D BY:","KR","DATE:","2017-11-15",null,"PROJECT:",{"$f":"AREA!I3","v":0}]
[]
[null,null,null,null,null,null,null,null,null,null,null,null,"Clear/flat",26]
[null,null,null,null,null,null,null,null,null,null,null,null,"Roadway",27]
[null,null,"Existing Conditions",null,{"$f":"'USER INTERFACE'!G18","v":0},{"$f":"'USER INTERFACE'!H18","v":0},{"$f":"'USER INTERFACE'!I18","v":0},{"$f":"'USER INTERFACE'!J18","v":0},null,null,null,null,"Wooded/hilly",28]
[null,null,"Length",null,{"$f":"'USER INTERFACE'!G17","v":0},{"$f":"'USER INTERFACE'!H17","v":0},{"$f":"'USER INTERFACE'!I17","v":0},{"$f":"'USER INTERFACE'!J17","v":0},null,null,null,null,"Waterfront",29]
[]
[null,null,"% of total cost required for retaining walls"]
{"$rows_left_out":59}
{"sheet":"BOARDWALK","index":21,"n_rows":43,"n_cols":18,"rows_kept":43,"cut":false,"hidden":true,"merged":[[12,16,13,16],[12,17,13,17],[42,5,42,7],[1,8,1,9],[2,8,2,9],[3,8,3,9],[6,3,6,8],[7,3,7,5]]}
[]
[null,null,"CALC'D BY:","KA","DATE:","2017-10-30",null,"CITY:",{"$f":"AREA!I2","v":0}]
[null,null,"CHK'D BY:","KR","DATE:","2017-11-15",null,"PROJECT:",{"$f":"AREA!I3","v":0}]
[]
[]
[]
[]
[null,null,995.1,"TIMBER BOARDWALK",null,null,1,"LS",{"$f":"H11","v":0},{"$f":"G8*I8","v":0}]
[]
[null,null,"COST PER LF",null,null,1500]
{"$rows_left_out":34}
{"sheet":"LIGHTING","index":22,"n_rows":64,"n_cols":10,"rows_kept":64,"cut":false,"hidden":true,"merged":[[1,8,1,9],[2,8,2,9],[3,8,3,9],[6,3,6,5],[63,5,63,7],[9,3,9,5],[14,3,14,5],[13,3,13,5],[30,3,30,5],[15,3,15,5],[16,3,16,5],[17,3,17,5],[18,3,18,5],[22,3,22,5],[26,3,26,5],[34,3,34,5],[37,3,37,5],[40,3,40,5],[43,3,43,5],[47,3,47,5],[48,3,48,5],[60,3,60,5],[49,3,49,5],[50,3,50,5],[51,3,51,5],[52,3,52,5],[56,3,56,5]]}
[]
[null,null,"CALC'D BY:","KA","DATE:","2018-02-22",null,"CITY:",{"$f":"AREA!I2","v":0}]
[null,null,"CHK'D BY:",null,"DATE:",null,null,"PROJECT:",{"$f":"AREA!I3","v":0}]
[]
[]
[]
[null,null,"Path Length:",{"$f":"AREA!$H$31","v":0},null,null,"OR","Lighting Length",null,{"$f":"'USER INTERFACE'!$I$44","v":0}]
[null,null,"Assume light every 50' of path."]
[]
[null,null,804.2,"2 INCH ELECTRICAL CONDUIT TYPE NM - PLASTIC (UL)",null,null,{"$f":"G12","v":0},"FT",{"$f":"IF(VLOOKUP(C10,PRICES!$B$2:$J$9998,9,FALSE)<>0,VLOOKUP(C10,PRICES!$B$2:$J$9998,9,FALSE),VLOOKUP(C10,PRICES!$B$2:$H$9998,7,FALSE))","v":28.43},{"$f":"G10*I10","v":0}]
{"$rows_left_out":55}
{"sheet":"SECURITY","index":23,"n_rows":43,"n_cols":10,"rows_kept":43,"cut":false,"hidden":true,"merged":[[1,8,1,9],[2,8,2,9],[3,8,3,9],[26,3,26,5],[30,3,30,5],[42,5,42,7],[16,3,16,5],[17,3,17,5],[18,3,18,5],[22,3,22,5]]}
[]
[null,null,"CALC'D BY:","KA","DATE:","2017-10-31",null,"CITY:",{"$f":"AREA!I2","v":0}]
[null,null,"CHK'D BY:","KR","DATE:","2017-11-15",null,"PROJECT:",{"$f":"AREA!I3","v":0}]
[]
[]
[]
[null,null,"Length Requiring Secuity:",null,{"$f":"IF('USER INTERFACE'!$I$45='USER INTERFACE'!$X$16,LIGHTING!$D$29,0)+IF(ISNUMBER(SEARCH(\"Partial\",'USER INTERFACE'!$I$45)),'USER INTERFACE'!$I$46,0)","v":0},"# Crossings Requiring Security:",null,null,{"$f":"IF(ISNUMBER(SEARCH(\"Crossings\",'USER INTERFACE'!$I$45)),'USER INTERFACE'!$I$31,0)","v":0}]
[]
[null,null,"Assume a camera every 500 feet of path."]
[null,null,"Assume a camera at each roadway crossing, if required by user inputs."]
{"$rows_left_out":34}
{"sheet":"DRAINAGE","index":24,"n_rows":43,"n_cols":10,"rows_kept":43,"cut":false,"hidden":true,"merged":[[1,8,1,9],[2,8,2,9],[3,8,3,9],[12,3,12,5],[27,3,27,5],[31,3,31,5],[42,5,42,7],[14,3,14,5],[25,3,25,5],[29,3,29,5],[30,3,30,5],[32,3,32,5],[17,3,17,5],[18,3,18,5],[19,3,19,5],[16,3,16,5],[36,3,36,5]]}
[]
[null,null,"CALC'D BY:","KA","DATE:","2017-10-13",null,"CITY:",{"$f":"AREA!I2","v":0}]
[null,null,"CHK'D BY:","KR","DATE:","2017-11-15",null,"PROJECT:",{"$f":"AREA!I3","v":0}]
[]
[]
[]
[null,null,"Sidepath Length:",{"$f":"SUMIF('USER INTERFACE'!$G$19:$J$19,'USER INTERFACE'!$U$29,'USER INTERFACE'!$G$17:$J$17)","v":0},"ft"]
[null,null,"Other SUP Length:",{"$f":"AREA!H31-AREA!H33-DRAINAGE!D7","v":0},"ft","excluding boardwalks"]
[]
[null,null,"If closed system…"]
{"$rows_left_out":34}
{"sheet":"LANDSCAPING","index":25,"n_rows":43,"n_cols":10,"rows_kept":43,"cut":false,"hidden":true,"merged":[[1,8,1,9],[2,8,2,9],[3,8,3,9],[7,3,7,5],[14,3,14,5],[25,3,25,5],[31,3,31,5],[16,3,16,5],[17,3,17,5],[18,3,18,5],[23,3,23,5]]}
[]
[null,null,"CALC'D BY:","KA","DATE:","2017-10-16",null,"CITY:",{"$f":"AREA!I2","v":0}]
[null,null,"CHK'D BY:","KR","DATE:","2017-11-15",null,"PROJECT:",{"$f":"AREA!I3","v":0}]
[]
[]
[]
[]
[null,null,102.99,"LANDSCAPING",null,null,1,"LS",{"$f":"C11*F13","v":0},{"$f":"G8*I8","v":0}]
[]
[null,null,"Construction Cost (without landscaping or structural)"]
{"$rows_left_out":34}
{"sheet":"PARKING","index":26,"n_rows":54,"n_cols":14,"rows_kept":54,"cut":false,"hidden":true,"merged":[[43,3,43,5],[45,3,45,5],[47,3,47,5],[48,3,48,5],[49,3,49,5],[40,3,40,5],[28,3,28,5],[32,3,32,5],[15,3,15,5],[19,3,19,5],[26,3,26,5],[36,3,36,5],[22,3,22,5],[6,3,6,5],[1,8,1,9],[2,8,2,9],[3,8,3,9],[11,3,11,5]]}
[]
[null,null,"CALC'D BY:","KA","DATE:","2018-04-11",null,"CITY:",{"$f":"AREA!I2","v":0}]
[null,null,"CHK'D BY:","DN","DATE:","2018-04-11",null,"PROJECT:",{"$f":"AREA!I3","v":0}]
[]
[]
[]
[null,null,"# Parking Spaces",{"$f":"'USER INTERFACE'!I40","v":0},null,null,"Porous?",{"$f":"'USER INTERFACE'!I41","v":0}]
[]
[null,null,"Area (SF)","Area (SY)","Depth (in.)","Ton/sy/in",null,"Tons"]
[null,null,{"$f":"D7*250","v":0},{"$f":"C10/9","v":0},4,5.6000000000000001E-2,null,{"$f":"C10*E10*F10","v":0}]
{"$rows_left_out":44}