{"text_format":"1","workbook":"xlsx","n_sheets":14,"sheets":["Instructions, Hints, Notes","Town-Wide Capital Planning","Summary-General Government","Summary-Water","Summary-Sewer","Water","Sewer","Highway","Municipal Complex","MIS","Police","Fire","Library","Existing Debt"],"not_rendered":{"charts":23,"images":0,"macros":1,"external_links":0,"defined_names":20,"comments":0,"pivot_tables":0},"unopened":[],"bounds":{"document_bytes":16777216,"sheet_cells":100000,"rows_first":2000,"rows_last":500,"rows_between":2000,"halvings":0,"cell_chars":16384,"cell_head_chars":4096},"cells_cut":0,"cells_raw":0,"read":"whole","date_system":"1900"}

{"sheet":"Instructions, Hints, Notes","index":0,"n_rows":23,"n_cols":1,"rows_kept":23,"cut":false,"hidden":false,"merged":[]}
["Instructions, Helpful Hints, and Notes"]
["For Support:  Matt Abrahams | bettergov2@aol.com | 617-240-3435"]
["Here are some helpful hints with using the file:"]
["-          Capital-planning selections are to be made on the “Town-Wide Capital Planning” tab."]
["-          Each of the items listed on the “Town-Wide Capital Planning” tab is from a detailed capital planning tab in the workbook.  The tab on which the item can be found is listed in column A.  If you are to tweak anything about an item, like the cost or the fiscal year, then do so on the individual tab and it will filter to the “Town-Wide Capital Planning” tab."]
["-          Cells in column G contain a drop-down box on whether the item should be included in the long-term capital plan or not.  Selecting “Yes” includes it and “No” does not.  If \"No\" is selected, the item remains in the plan, but the funding of it does not."]
["-          Cells in column H contain a drop-down box for the funding source.  If a debt option is selected, then, based on the borrowing assumptions, projected debt is presented over multiple years starting with the year after the fiscal year listed and the costs include interest costs (if the interest rate is greater than 0%).  Any non-debt selection has the cost listed in the long-term capital plan in the year it is to be purchased.  The list of options for funding sources is based on the options in the Funding Sources table on the \"Summary-General Government\" tab.  If changes need to be made, then adjust the funding sources in the list on that tab.  Once changes are made, ensure all options are available in the Funding Sources drop-down boxes on the \"Town-Wide Capital Planning\" tab.  If not, then adjust the Source cells for Data Validation on the Data menu in Excel and ensure the changes are made to each row on the tab."]
["-          The projected debt schedules rely on two selections for the calculations:  Term in column I (initially defaulted to 20 years for each borrowing) and Interest Rate in column J (initially defaulted to 4.00% for each borrowing).  Set them as you see fit.  If each borrowing is to have the same interest rate, then change the interest rate at the top in cell N1 to filter it throughout.  If not, then the rate can be changed on the individual rows.   "]
{"$rows_left_out":16}
{"sheet":"Town-Wide Capital Planning","index":1,"n_rows":204,"n_cols":45,"rows_kept":204,"cut":false,"hidden":false,"merged":[[197,11,197,12],[187,0,187,1],[186,3,186,4],[203,1,203,3],[202,1,202,2],[0,11,0,12],[0,15,0,44],[190,0,190,1],[190,3,190,4],[190,6,190,7],[0,0,0,1],[0,3,0,4],[0,6,0,7],[0,8,0,9],[1,11,1,12],[2,11,2,12]]}
["10-YEAR CAPITAL PLAN",null,"Columns A-E from individual tabs; update there","Estimated",null,null,"Capital Planning Selections",null,"Borrowing Selections",null,null,"Interest Rate:",null,0.04,null,"Capital Expenditures By Year ------------->"]
["Tab","Location/Dept/Group","Project/Purchase","Cost","FY",null,"Include?","Funding?","Term (Yrs)","Interest Rate",null,"Inflation Rate:",null,0,null,"FY 2020",{"$f":"\"FY \"&(RIGHT(P2,4)+1)","v":"FY 2021"},{"$f":"\"FY \"&(RIGHT(Q2,4)+1)","v":"FY 2022"},"FY 2023","FY 2024","FY 2025","FY 2026","FY 2027","FY 2028","FY 2029","FY 2030","FY 2031","FY 2032","FY 2033","FY 2034","FY 2035","FY 2036","FY 2037","FY 2038","FY 2039","FY 2040","FY 2041","FY 2042","FY 2043","FY 2044","FY 2045","FY 2046","FY 2047","FY 2048","FY 2049"]
[{"$f":"MID(CELL(\"filename\",Water!A22),FIND(\"]\",CELL(\"filename\",Water!A22))+1,256)","v":"Water"},{"$f":"Water!A22","v":"Water"},{"$f":"Water!B22","v":"Upgrades to Pump Station No. 1"},{"$f":"Water!C22","v":1500000},{"$f":"IF(Water!D22=0,\"\",Water!D22)","v":2021},null,"Yes",{"$f":"IF(D3>60000,IF(D3<=250000,\"Debt (Non-Excluded)\",\"Debt (Excluded)\"),IF(B3=\"Water\",\"Water Retained Earnings\",IF(B3=\"Sewer\",\"Sewer Retained Earnings\",\"Free Cash\")))","v":"Debt (Excluded)"},{"$f":"IF(LEFT(H3,4)=\"Debt\",20,\"\")","v":20},{"$f":"IF(LEFT(H3,4)=\"Debt\",N$1,\"\")","v":0.04},null,"$ Amounts as of:",null,2020,null,{"$f":"IF($G3=\"Yes\",IF(LEFT($H3,4)=\"Debt\",IF(AND(VALUE(RIGHT(P$2,4))>=($E3+1),VALUE(RIGHT(P$2,4))<=($E3+IF(ISNUMBER($I3),$I3,0)),$I3>0,ISNUMBER($J3)),(($D3*((1+$N$2)^($E3-$N$3)))/$I3)+((($D3*((1+$N$2)^($E3-$N$3)))-((($D3*((1+$N$2)^($E3-$N$3)))/$I3)*(VALUE(RIGHT(P$2,4))-($E3+1))))*$J3),\"\"),IF(\"FY \"&$E3=P$2,$D3*((1+$N$2)^((VALUE(RIGHT(P$2,4)))-$N$3)),\"\")),\"\")","v":""},{"$f":"IF($G3=\"Yes\",IF(LEFT($H3,4)=\"Debt\",IF(AND(VALUE(RIGHT(Q$2,4))>=($E3+1),VALUE(RIGHT(Q$2,4))<=($E3+IF(ISNUMBER($I3),$I3,0)),$I3>0,ISNUMBER($J3)),(($D3*((1+$N$2)^($E3-(VALUE(RIGHT($P$2,4))))))/$I3)+((($D3*((1+$N$2)^($E3-(VALUE(RIGHT($P$2,4))))))-((($D3*((1+$N$2)^($E3-(VALUE(RIGHT($P$2,4))))))/$I3)*(VALUE(RIGHT(Q$2,4))-($E3+1))))*$J3),\"\"),IF(\"FY \"&$E3=Q$2,$D3*((1+$N$2)^((VALUE(RIGHT(Q$2,4)))-(VALUE(RIGHT($P$2,4))))),\"\")),\"\")","v":""},135000,132000,129000,126000,123000,120000,117000,114000,111000,108000,105000,102000,99000,96000,93000,90000,87000,84000,81000,78000,"","","","","","","",""]
[{"$f":"MID(CELL(\"filename\",Water!A23),FIND(\"]\",CELL(\"filename\",Water!A23))+1,256)","v":"Water"},{"$f":"Water!A23","v":"Water"},{"$f":"Water!B23","v":"Upgrades to Pump Station No. 3"},{"$f":"Water!C23","v":470000},{"$f":"IF(Water!D23=0,\"\",Water!D23)","v":2021},null,"Yes",{"$f":"IF(D4>60000,IF(D4<=250000,\"Debt (Non-Excluded)\",\"Debt (Excluded)\"),IF(B4=\"Water\",\"Water Retained Earnings\",IF(B4=\"Sewer\",\"Sewer Retained Earnings\",\"Free Cash\")))","v":"Debt (Excluded)"},{"$f":"IF(LEFT(H4,4)=\"Debt\",20,\"\")","v":20},{"$f":"IF(LEFT(H4,4)=\"Debt\",N$1,\"\")","v":0.04},null,null,null,null,null,{"$f":"IF($G4=\"Yes\",IF(LEFT($H4,4)=\"Debt\",IF(AND(VALUE(RIGHT(P$2,4))>=($E4+1),VALUE(RIGHT(P$2,4))<=($E4+IF(ISNUMBER($I4),$I4,0)),$I4>0,ISNUMBER($J4)),(($D4*((1+$N$2)^($E4-$N$3)))/$I4)+((($D4*((1+$N$2)^($E4-$N$3)))-((($D4*((1+$N$2)^($E4-$N$3)))/$I4)*(VALUE(RIGHT(P$2,4))-($E4+1))))*$J4),\"\"),IF(\"FY \"&$E4=P$2,$D4*((1+$N$2)^((VALUE(RIGHT(P$2,4)))-$N$3)),\"\")),\"\")","v":""},{"$f":"IF($G4=\"Yes\",IF(LEFT($H4,4)=\"Debt\",IF(AND(VALUE(RIGHT(Q$2,4))>=($E4+1),VALUE(RIGHT(Q$2,4))<=($E4+IF(ISNUMBER($I4),$I4,0)),$I4>0,ISNUMBER($J4)),(($D4*((1+$N$2)^($E4-(VALUE(RIGHT($P$2,4))))))/$I4)+((($D4*((1+$N$2)^($E4-(VALUE(RIGHT($P$2,4))))))-((($D4*((1+$N$2)^($E4-(VALUE(RIGHT($P$2,4))))))/$I4)*(VALUE(RIGHT(Q$2,4))-($E4+1))))*$J4),\"\"),IF(\"FY \"&$E4=Q$2,$D4*((1+$N$2)^((VALUE(RIGHT(Q$2,4)))-(VALUE(RIGHT($P$2,4))))),\"\")),\"\")","v":""},42300,41360,40420,39480,38540,37600,36660,35720,34780,33840,32900,31960,31020,30080,29140,{"$f":"IF($G4=\"Yes\",IF(LEFT($H4,4)=\"Debt\",IF(AND(VALUE(RIGHT(AG$2,4))>=($E4+1),VALUE(RIGHT(AG$2,4))<=($E4+IF(ISNUMBER($I4),$I4,0)),$I4>0,ISNUMBER($J4)),(($D4*((1+$N$2)^($E4-(VALUE(RIGHT($P$2,4))))))/$I4)+((($D4*((1+$N$2)^($E4-(VALUE(RIGHT($P$2,4))))))-((($D4*((1+$N$2)^($E4-(VALUE(RIGHT($P$2,4))))))/$I4)*(VALUE(RIGHT(AG$2,4))-($E4+1))))*$J4),\"\"),IF(\"FY \"&$E4=AG$2,$D4*((1+$N$2)^((VALUE(RIGHT(AG$2,4)))-(VALUE(RIGHT($P$2,4))))),\"\")),\"\")","v":28200},27260,26320,25380,24440,"","","","","","","",""]
[{"$f":"MID(CELL(\"filename\",Water!A24),FIND(\"]\",CELL(\"filename\",Water!A24))+1,256)","v":"Water"},{"$f":"Water!A24","v":"Water"},{"$f":"Water!B24","v":"Upgrades to Pump Station No. 6"},{"$f":"Water!C24","v":310000},{"$f":"IF(Water!D24=0,\"\",Water!D24)","v":2021},null,"Yes","Debt (Excluded)",20,0.04,null,null,null,null,null,"","",27900,27280,26660,26040,25420,24800,24180,23560,22940,22320,21700,21080,20460,19840,19220,18600,17980,17360,16740,16120,"","","","","","","",""]
[{"$f":"MID(CELL(\"filename\",Water!A25),FIND(\"]\",CELL(\"filename\",Water!A25))+1,256)","v":"Water"},{"$f":"Water!A25","v":"Water"},{"$f":"Water!B25","v":"Dresser Hill WST Rehabilitation"},{"$f":"Water!C25","v":600000},{"$f":"IF(Water!D25=0,\"\",Water!D25)","v":2022},null,"Yes","Debt (Excluded)",20,0.04,null,null,null,null,null,"","","",54000,52800,51600,50400,49200,48000,46800,45600,44400,43200,42000,40800,39600,38400,37200,36000,34800,33600,32400,31200,"","","","","","",""]
[{"$f":"MID(CELL(\"filename\",Water!A26),FIND(\"]\",CELL(\"filename\",Water!A26))+1,256)","v":"Water"},{"$f":"Water!A26","v":"Water"},{"$f":"Water!B26","v":"Bates WST Rehabilitation"},{"$f":"Water!C26","v":180000},{"$f":"IF(Water!D26=0,\"\",Water!D26)","v":2022},null,"Yes","Debt (Non-Excluded)",20,0.04,null,null,null,null,null,"","","",16200,15840,15480,15120,14760,14400,14040,13680,13320,12960,12600,12240,11880,11520,11160,10800,10440,10080,9720,9360,"","","","","","",""]
[{"$f":"MID(CELL(\"filename\",Water!A27),FIND(\"]\",CELL(\"filename\",Water!A27))+1,256)","v":"Water"},{"$f":"Water!A27","v":"Water"},{"$f":"Water!B27","v":"Mason Road and Mason Road Extension Water Main Replacement"},{"$f":"Water!C27","v":3140000},{"$f":"IF(Water!D27=0,\"\",Water!D27)","v":2023},null,"Yes","Debt (Excluded)",20,0.04,null,null,null,null,null,"","","","",282600,276320,270040,263760,257480,251200,244920,238640,232360,226080,219800,213520,207240,200960,194680,188400,182120,175840,169560,163280,"","","","","",""]
{"$rows_left_out":197}
{"sheet":"Summary-General Government","index":2,"n_rows":187,"n_cols":13,"rows_kept":187,"cut":false,"hidden":false,"merged":[[186,0,186,1],[105,0,105,1],[106,0,106,1],[137,0,137,12],[108,0,108,1],[159,0,159,1],[161,0,161,1],[162,0,162,1],[165,0,165,1],[166,0,166,1],[167,0,167,1],[146,0,146,1],[147,0,147,1],[149,0,149,1],[150,0,150,1],[140,0,140,1],[172,0,172,1],[141,0,141,1],[142,0,142,1],[143,0,143,1],[154,0,154,1],[155,0,155,1],[0,1,0,8],[111,0,111,1],[112,0,112,1],[94,0,94,1],[107,0,107,1],[109,0,109,1],[110,0,110,1],[99,0,99,1],[100,0,100,1],[101,0,101,1],[102,0,102,1],[103,0,103,1],[104,0,104,1],[181,0,181,1],[185,0,185,1],[98,0,98,1],[91,0,91,12],[92,0,92,1],[93,0,93,1],[95,0,95,1],[96,0,96,1],[97,0,97,1],[177,0,177,1],[173,0,173,1],[148,0,148,1],[156,0,156,1],[160,0,160,1],[153,0,153,1],[168,0,168,1]]}
[null,"Departmental Totals from Capital Needs Lists"]
[null,"Year","Highway","Municipal Complex","MIS","Police","Fire","Library","Total"]
[null,2020,{"$f":"SUMIF(Highway!$C$3:$C$12,$B3,Highway!$D$3:$D$12)","v":244400},{"$f":"SUMIF('Municipal Complex'!$C$3:$C$12,$B3,'Municipal Complex'!$D$3:$D$12)","v":0},{"$f":"SUMIF(MIS!$C$3:$C$12,$B3,MIS!$D$3:$D$12)","v":25000},{"$f":"SUMIF(Police!$C$3:$C$12,$B3,Police!$D$3:$D$12)","v":100000},{"$f":"SUMIF(Fire!$C$3:$C$12,$B3,Fire!$D$3:$D$12)","v":0},{"$f":"SUMIF(Library!$C$3:$C$12,$B3,Library!$D$3:$D$12)","v":0},{"$f":"SUM(C3:H3)","v":369400}]
[null,{"$f":"B3+1","v":2021},{"$f":"SUMIF(Highway!$C$3:$C$12,$B4,Highway!$D$3:$D$12)","v":1060000},{"$f":"SUMIF('Municipal Complex'!$C$3:$C$12,$B4,'Municipal Complex'!$D$3:$D$12)","v":335000},{"$f":"SUMIF(MIS!$C$3:$C$12,$B4,MIS!$D$3:$D$12)","v":15000},{"$f":"SUMIF(Police!$C$3:$C$12,$B4,Police!$D$3:$D$12)","v":122000},{"$f":"SUMIF(Fire!$C$3:$C$12,$B4,Fire!$D$3:$D$12)","v":305000},{"$f":"SUMIF(Library!$C$3:$C$12,$B4,Library!$D$3:$D$12)","v":117500},1954500]
[null,{"$f":"B4+1","v":2022},{"$f":"SUMIF(Highway!$C$3:$C$12,$B5,Highway!$D$3:$D$12)","v":475000},{"$f":"SUMIF('Municipal Complex'!$C$3:$C$12,$B5,'Municipal Complex'!$D$3:$D$12)","v":320000},{"$f":"SUMIF(MIS!$C$3:$C$12,$B5,MIS!$D$3:$D$12)","v":0},{"$f":"SUMIF(Police!$C$3:$C$12,$B5,Police!$D$3:$D$12)","v":58500},{"$f":"SUMIF(Fire!$C$3:$C$12,$B5,Fire!$D$3:$D$12)","v":750000},{"$f":"SUMIF(Library!$C$3:$C$12,$B5,Library!$D$3:$D$12)","v":4000},1607500]
[null,2023,{"$f":"SUMIF(Highway!$C$3:$C$12,$B6,Highway!$D$3:$D$12)","v":317000},{"$f":"SUMIF('Municipal Complex'!$C$3:$C$12,$B6,'Municipal Complex'!$D$3:$D$12)","v":340000},{"$f":"SUMIF(MIS!$C$3:$C$12,$B6,MIS!$D$3:$D$12)","v":0},{"$f":"SUMIF(Police!$C$3:$C$12,$B6,Police!$D$3:$D$12)","v":62900},{"$f":"SUMIF(Fire!$C$3:$C$12,$B6,Fire!$D$3:$D$12)","v":60000},{"$f":"SUMIF(Library!$C$3:$C$12,$B6,Library!$D$3:$D$12)","v":256000},1035900]
[null,2024,{"$f":"SUMIF(Highway!$C$3:$C$12,$B7,Highway!$D$3:$D$12)","v":200000},{"$f":"SUMIF('Municipal Complex'!$C$3:$C$12,$B7,'Municipal Complex'!$D$3:$D$12)","v":54000},{"$f":"SUMIF(MIS!$C$3:$C$12,$B7,MIS!$D$3:$D$12)","v":0},{"$f":"SUMIF(Police!$C$3:$C$12,$B7,Police!$D$3:$D$12)","v":65500},{"$f":"SUMIF(Fire!$C$3:$C$12,$B7,Fire!$D$3:$D$12)","v":725000},{"$f":"SUMIF(Library!$C$3:$C$12,$B7,Library!$D$3:$D$12)","v":0},1044500]
[null,2025,{"$f":"SUMIF(Highway!$C$3:$C$12,$B8,Highway!$D$3:$D$12)","v":402000},{"$f":"SUMIF('Municipal Complex'!$C$3:$C$12,$B8,'Municipal Complex'!$D$3:$D$12)","v":66000},{"$f":"SUMIF(MIS!$C$3:$C$12,$B8,MIS!$D$3:$D$12)","v":31000},{"$f":"SUMIF(Police!$C$3:$C$12,$B8,Police!$D$3:$D$12)","v":81000},{"$f":"SUMIF(Fire!$C$3:$C$12,$B8,Fire!$D$3:$D$12)","v":0},{"$f":"SUMIF(Library!$C$3:$C$12,$B8,Library!$D$3:$D$12)","v":11000},591000]
{"$rows_left_out":180}
{"sheet":"Summary-Water","index":3,"n_rows":176,"n_cols":13,"rows_kept":176,"cut":false,"hidden":false,"merged":[[175,0,175,1],[0,1,0,4],[160,0,160,1],[161,0,161,1],[162,0,162,1],[166,0,166,1],[167,0,167,1],[171,0,171,1],[150,0,150,1],[153,0,153,1],[154,0,154,1],[155,0,155,1],[156,0,156,1],[159,0,159,1],[147,0,147,1],[148,0,148,1],[149,0,149,1],[141,0,141,1],[142,0,142,1],[143,0,143,1],[144,0,144,1],[138,0,138,12],[103,0,103,1],[104,0,104,1],[105,0,105,1],[106,0,106,1],[107,0,107,1],[108,0,108,1],[109,0,109,1],[110,0,110,1],[111,0,111,1],[112,0,112,1],[113,0,113,1],[102,0,102,1],[92,0,92,12],[93,0,93,1],[94,0,94,1],[95,0,95,1],[96,0,96,1],[97,0,97,1],[98,0,98,1],[99,0,99,1],[100,0,100,1],[101,0,101,1]]}
[null,"Departmental Totals from Capital Needs List"]
[null,"Year","Water"]
[null,2020,{"$f":"SUMIF(Water!$C$3:$C$12,$B3,Water!$D$3:$D$12)","v":300000}]
[null,{"$f":"B3+1","v":2021},{"$f":"SUMIF(Water!$C$3:$C$12,$B4,Water!$D$3:$D$12)","v":3025000}]
[null,{"$f":"B4+1","v":2022},{"$f":"SUMIF(Water!$C$3:$C$12,$B5,Water!$D$3:$D$12)","v":810000}]
[null,2023,{"$f":"SUMIF(Water!$C$3:$C$12,$B6,Water!$D$3:$D$12)","v":3140000}]
[null,2024,{"$f":"SUMIF(Water!$C$3:$C$12,$B7,Water!$D$3:$D$12)","v":3525000}]
[null,2025,{"$f":"SUMIF(Water!$C$3:$C$12,$B8,Water!$D$3:$D$12)","v":3175000}]
{"$rows_left_out":169}
{"sheet":"Summary-Sewer","index":4,"n_rows":176,"n_cols":13,"rows_kept":176,"cut":false,"hidden":false,"merged":[[171,0,171,1],[175,0,175,1],[159,0,159,1],[160,0,160,1],[161,0,161,1],[162,0,162,1],[166,0,166,1],[167,0,167,1],[156,0,156,1],[141,0,141,1],[142,0,142,1],[143,0,143,1],[144,0,144,1],[147,0,147,1],[148,0,148,1],[149,0,149,1],[150,0,150,1],[153,0,153,1],[154,0,154,1],[155,0,155,1],[138,0,138,12],[103,0,103,1],[104,0,104,1],[105,0,105,1],[106,0,106,1],[107,0,107,1],[108,0,108,1],[109,0,109,1],[110,0,110,1],[111,0,111,1],[112,0,112,1],[113,0,113,1],[102,0,102,1],[0,1,0,4],[92,0,92,12],[93,0,93,1],[94,0,94,1],[95,0,95,1],[96,0,96,1],[97,0,97,1],[98,0,98,1],[99,0,99,1],[100,0,100,1],[101,0,101,1]]}
[null,"Departmental Totals from Capital Needs List"]
[null,"Year","Sewer"]
[null,2020,{"$f":"SUMIF(Sewer!$C$3:$C$12,$B3,Sewer!$D$3:$D$12)","v":130000}]
[null,{"$f":"B3+1","v":2021},{"$f":"SUMIF(Sewer!$C$3:$C$12,$B4,Sewer!$D$3:$D$12)","v":80000}]
[null,{"$f":"B4+1","v":2022},{"$f":"SUMIF(Sewer!$C$3:$C$12,$B5,Sewer!$D$3:$D$12)","v":200000}]
[null,2023,{"$f":"SUMIF(Sewer!$C$3:$C$12,$B6,Sewer!$D$3:$D$12)","v":100000}]
[null,2024,{"$f":"SUMIF(Sewer!$C$3:$C$12,$B7,Sewer!$D$3:$D$12)","v":240000}]
[null,2025,{"$f":"SUMIF(Sewer!$C$3:$C$12,$B8,Sewer!$D$3:$D$12)","v":80000}]
{"$rows_left_out":169}
{"sheet":"Water","index":5,"n_rows":55,"n_cols":5,"rows_kept":55,"cut":false,"hidden":false,"merged":[[0,2,0,3],[19,0,19,1]]}
[null,null,"Totals from Capital Plan"]
[null,null,"Year","Total"]
[null,null,{"$f":"'Summary-General Government'!B3","v":2020},{"$f":"SUMIF(D$22:D$46,C3,C$22:C$46)","v":300000}]
[null,null,{"$f":"'Summary-General Government'!B4","v":2021},3025000]
[null,null,{"$f":"'Summary-General Government'!B5","v":2022},810000]
[null,null,{"$f":"'Summary-General Government'!B6","v":2023},3140000]
[null,null,{"$f":"'Summary-General Government'!B7","v":2024},3525000]
[null,null,{"$f":"'Summary-General Government'!B8","v":2025},3175000]
{"$rows_left_out":48}
{"sheet":"Sewer","index":6,"n_rows":43,"n_cols":5,"rows_kept":43,"cut":false,"hidden":false,"merged":[[0,2,0,3],[19,0,19,1]]}
[null,null,"Totals from Capital Plan"]
[null,null,"Year","Total"]
[null,null,{"$f":"'Summary-General Government'!B3","v":2020},{"$f":"SUMIF(D$22:D$39,C3,C$22:C$39)","v":130000}]
[null,null,{"$f":"'Summary-General Government'!B4","v":2021},80000]
[null,null,{"$f":"'Summary-General Government'!B5","v":2022},200000]
[null,null,{"$f":"'Summary-General Government'!B6","v":2023},100000]
[null,null,{"$f":"'Summary-General Government'!B7","v":2024},240000]
[null,null,{"$f":"'Summary-General Government'!B8","v":2025},80000]
{"$rows_left_out":36}
{"sheet":"Highway","index":7,"n_rows":77,"n_cols":5,"rows_kept":77,"cut":false,"hidden":false,"merged":[[0,2,0,3],[19,0,19,1]]}
[null,null,"Totals from Capital Plan"]
[null,null,"Year","Total"]
[null,null,{"$f":"'Summary-General Government'!B3","v":2020},{"$f":"SUMIF(D$22:D$61,C3,C$22:C$61)","v":244400}]
[null,null,{"$f":"'Summary-General Government'!B4","v":2021},1060000]
[null,null,{"$f":"'Summary-General Government'!B5","v":2022},475000]
[null,null,{"$f":"'Summary-General Government'!B6","v":2023},317000]
[null,null,{"$f":"'Summary-General Government'!B7","v":2024},200000]
[null,null,{"$f":"'Summary-General Government'!B8","v":2025},402000]
{"$rows_left_out":70}
{"sheet":"Municipal Complex","index":8,"n_rows":76,"n_cols":5,"rows_kept":76,"cut":false,"hidden":false,"merged":[[0,2,0,3],[19,0,19,1]]}
[null,null,"Totals from Capital Plan"]
[null,null,"Year","Total"]
[null,null,{"$f":"'Summary-General Government'!B3","v":2020},{"$f":"SUMIF(D$22:D$49,C3,C$22:C$49)","v":0}]
[null,null,{"$f":"'Summary-General Government'!B4","v":2021},335000]
[null,null,{"$f":"'Summary-General Government'!B5","v":2022},320000]
[null,null,{"$f":"'Summary-General Government'!B6","v":2023},340000]
[null,null,{"$f":"'Summary-General Government'!B7","v":2024},54000]
[null,null,{"$f":"'Summary-General Government'!B8","v":2025},66000]
{"$rows_left_out":69}
{"sheet":"MIS","index":9,"n_rows":30,"n_cols":5,"rows_kept":30,"cut":false,"hidden":false,"merged":[[0,2,0,3],[19,0,19,1]]}
[null,null,"Totals from Capital Plan"]
[null,null,"Year","Total"]
[null,null,{"$f":"'Summary-General Government'!B3","v":2020},{"$f":"SUMIF(D$22:D$25,C3,C$22:C$25)","v":25000}]
[null,null,{"$f":"'Summary-General Government'!B4","v":2021},15000]
[null,null,{"$f":"'Summary-General Government'!B5","v":2022},0]
[null,null,{"$f":"'Summary-General Government'!B6","v":2023},0]
[null,null,{"$f":"'Summary-General Government'!B7","v":2024},0]
[null,null,{"$f":"'Summary-General Government'!B8","v":2025},31000]
{"$rows_left_out":23}
{"sheet":"Police","index":10,"n_rows":75,"n_cols":5,"rows_kept":75,"cut":false,"hidden":false,"merged":[[0,2,0,3],[19,0,19,1]]}
[null,null,"Totals from Capital Plan"]
[null,null,"Year","Total"]
[null,null,{"$f":"'Summary-General Government'!B3","v":2020},{"$f":"SUMIF(D$22:D$60,C3,C$22:C$60)","v":100000}]
[null,null,{"$f":"'Summary-General Government'!B4","v":2021},122000]
[null,null,{"$f":"'Summary-General Government'!B5","v":2022},58500]
[null,null,{"$f":"'Summary-General Government'!B6","v":2023},62900]
[null,null,{"$f":"'Summary-General Government'!B7","v":2024},65500]
[null,null,{"$f":"'Summary-General Government'!B8","v":2025},81000]
{"$rows_left_out":68}
{"sheet":"Fire","index":11,"n_rows":59,"n_cols":5,"rows_kept":59,"cut":false,"hidden":false,"merged":[[0,2,0,3],[19,0,19,1]]}
[null,null,"Totals from Capital Plan"]
[null,null,"Year","Total"]
[null,null,{"$f":"'Summary-General Government'!B3","v":2020},{"$f":"SUMIF(D$22:D$35,C3,C$22:C$35)","v":0}]
[null,null,{"$f":"'Summary-General Government'!B4","v":2021},305000]
[null,null,{"$f":"'Summary-General Government'!B5","v":2022},750000]
[null,null,{"$f":"'Summary-General Government'!B6","v":2023},60000]
[null,null,{"$f":"'Summary-General Government'!B7","v":2024},725000]
[null,null,{"$f":"'Summary-General Government'!B8","v":2025},0]
{"$rows_left_out":52}
{"sheet":"Library","index":12,"n_rows":59,"n_cols":5,"rows_kept":59,"cut":false,"hidden":false,"merged":[[0,2,0,3],[19,0,19,1]]}
[null,null,"Totals from Capital Plan"]
[null,null,"Year","Total"]
[null,null,{"$f":"'Summary-General Government'!B3","v":2020},{"$f":"SUMIF(D$22:D$36,C3,C$22:C$36)","v":0}]
[null,null,{"$f":"'Summary-General Government'!B4","v":2021},117500]
[null,null,{"$f":"'Summary-General Government'!B5","v":2022},4000]
[null,null,{"$f":"'Summary-General Government'!B6","v":2023},256000]
[null,null,{"$f":"'Summary-General Government'!B7","v":2024},0]
[null,null,{"$f":"'Summary-General Government'!B8","v":2025},11000]
{"$rows_left_out":52}
{"sheet":"Existing Debt","index":13,"n_rows":38,"n_cols":58,"rows_kept":38,"cut":false,"hidden":false,"merged":[]}
[]
["Updated",null,null,"2019-02-27"]
[null,null,null,null,null,"Fiscal Yr:",null,null,null,null,null,null,null,null,2020,2020,{"$f":"O3+1","v":2021},{"$f":"P3+1","v":2021},{"$f":"Q3+1","v":2022},2022,2023,2023,2024,2024,2025,2025,2026,2026,2027,2027,2028,2028,2029,2029]
[]
["Fund",null,"Description","Issue Date","Article","Ending","Principal 16","Interest 16","Principal 17","Interest 17","Principal 18","Interest 18","Principal 19","Interest 19","Principal 20","Interest 20","Principal 21","Interest 21","Principal 22","Interest 22","Principal 23","Interest 23","Principal 24","Interest 24","Principal 25","Interest 25","Principal 26","Interest 26","Principal 27","Interest 27","Principal 28","Interest 28","Principal 29","Interest 29","Principal 30","Interest 30","Principal 31","Interest 31","Principal 32","Interest 32","Principal 33","Interest 33","Principal 34","Interest 34","Principal 35","Interest 35","Principal 36","Interest 36","Principal 37","Interest 37","Principal 38","Interest 38","Principal 35","Interest 35","Principal 36","Interest 36"]
["Sewer",12,"Phase I","1998-03-15","-",2018,60000,9000,60000,6000,60000,3000,0,0,0,0,0,0,0,0,0,0,0,0,0,0,0,0,0,0,0,0,0,0,0,0,0,0,0,0,0,0,0,0,0,0,0,0,0,0,0,0,0,0,0,0]
["Water 13",13,"Corrosion Control MWPAT","1999-10-01","-",2020,40000,10712.5,31242.66,315,40000,6212.5,45000,3768.75,45000,1237.5,0,0,0,0,0,0,0,0,0,0,0,0,0,0,0,0,0,0,0,0,0,0,0,0,0,0,0,0,0,0,0,0,0,0,0,0,0,0,0,0]
["Water ",0,"DudleyOxford/Healy Rds","2012-10-15","-",2023,130000,19500,130000,16900,130000,14300,130000,11700,130000,9100,130000,6500,130000,3900,130000,1300,0,0,0,0,0,0,0,0,0,0,0,0,0,0,0,0,0,0,0,0,0,0,0,0,0,0,0,0,0,0,0,0,0,0]
{"$rows_left_out":30}