{"text_format":"1","workbook":"xlsx","n_sheets":5,"sheets":["Guide to EJ Ref List","Project EJ Ref List","PrintExport Friendly","MA_Muni","Complete_CBOList"],"not_rendered":{"charts":0,"images":0,"macros":1,"external_links":0,"defined_names":7,"comments":0,"pivot_tables":0},"unopened":[],"bounds":{"document_bytes":16777216,"sheet_cells":100000,"rows_first":2000,"rows_last":500,"rows_between":2000,"halvings":0,"cell_chars":16384,"cell_head_chars":4096},"cells_cut":0,"cells_raw":0,"read":"whole","date_system":"1900"}

{"sheet":"Guide to EJ Ref List","index":0,"n_rows":32,"n_cols":3,"rows_kept":32,"cut":false,"hidden":false,"merged":[[19,2,19,3],[7,1,8,1],[10,2,10,3],[6,2,6,3],[5,2,5,3],[16,2,16,3],[17,2,17,3],[18,2,18,3],[4,2,4,3],[7,2,7,3],[8,2,8,3],[9,2,9,3],[15,2,15,3],[12,2,12,3],[11,2,11,3]]}
[]
[null,"Massachusetts Environmental Policy Act (MEPA) EJ Reference List Form"]
[null,"Instructions for Creating/Updating Project-Specific EJ Reference List"]
[]
[null,"1.","Download the current version of the MEPA EJ Reference List on the MEPA website: https://www.mass.gov/info-details/environmental-justice-ej-reference-list-form."]
[null,"2.","Once the workbook is downloaded, start populating the \"Project EJ Ref List\" tab with information about the project and project site. Proponents must populate: the project name, the project address, the date when the list was generated/updated, and the filing type (ENF, DEIR, etc.) for which the list was generated/updated.  "]
[null,"3.","Once the project information is populated, the list will automatically populate with organizational contacts serving the entire state."]
[null,"4.","Next, identify any MA Municipalities contained in-part or entirely within your project's designated geographic area (DGA) using the drop-down selection menu. Instructions on determining a project's DGA are available on the MEPA website: https://www.mass.gov/guides/environmental-justice-protocols-and-resources."]
[null,null,"- Note that projects with Boston in their DGA should always select \"Boston - any neighborhood\". In addition, if a project is located in any of the following Boston neighborhoods, these neighborhoods should separately be selected as a MA municipality: Charlestown, Chinatown, Dorchester, East Boston, Hyde Park, Mattapan, Roslindale, and/or Roxbury."]
[null,"5.","The Proponent is encouraged to supplement the project-specific EJ Reference List by conducting its own research to identify any additional local stakeholders who may have interest in the project. Any contacts identified through supplemental research should be added to the left-most table titled \"Supplemental Community Contacts\"."]
[null,null,"- Examples of supplemental local contacts include: neighborhood associations, faith-based ministries, social service organizations, watershed conservation organizations, cultural centers serving immigrant or ethnic communities, mutual aid groups, youth and family programs, community health centers, and/or local small business associations."]
[null,"6.","When all the above steps are completed, click the red button \"Email MEPA-EJ@mass.gov\". An automatic email window should pop-up containing a pre-addressed and pre-titled email. The Proponent must attach a copy of their populated project-specific EJ Reference List to the MEPA EJ inbox (MEPA-EJ@mass.gov) in Excel Workbook format (.xlsx/.xls). The Proponent must send a copy of their project-specific EJ Reference List to the MEPA-EJ@mass.gov account whenever they update the list. "]
[null,"7.","As the \"Project EJ Ref List\" tab is populated, the \"PrintExport Friendly\" tab will automatically generate a printer friendly version of the project-specific EJ Reference List. This tab should be utilized to physically print the EJ Reference List and/or to export the EJ Reference List into a PDF format for inclusion in project documentation. Prior to printing/exporting ensure that all \"blanks\" are filtered from the contact name column in the Project-Specific EJ Reference List Table."]
[null,"Additional guidance on EJ Reference List and distributing project advanced notifications"]
[]
[null,"a.","The EJ Reference List should be utilized as a starting point, not as a “definitive” contact list, for purpose of conducting public involvement activities. The list should be expanded as needed or requested over time, as the project conducts community engagement activities."]
[null,"b.","If the Proponent is developing a distribution list to provide advance notification of the project under 301 CMR 11.05(4), the Proponent must send the EJ Screening Form, to those listed on the \"Project EJ Ref List\" tab. Please see https://www.mass.gov/guides/environmental-justice-protocols-and-resources#-advanced-notification- for additional guidance on providing advanced notification, including guidance on how to proceed if more than 90 days has elapsed since the initial advanced notification was distributed."]
[null,"c.","The EJ Screening Form must be translated into all applicable languages, as discussed here: https://www.mass.gov/guides/environmental-justice-protocols-and-resources#-language-translation-and-interpretation-. The EJ Screening Form and translated versions of the document (as applicable) should be combined in a single document and sent concurrently to MEPA-EJ@mass.gov and to all contacts on the project-specific EJ Reference List. The project name, location, and succinct (3-4 sentence) description of the project should be included in the body of the email along with the following verbiage:"]
[null,null,"\"Community-based organizations and tribal organizations are receiving this notification in accordance with the MEPA Public Involvement Protocol for Environmental Justice Populations, which took effect on January 1, 2022. More information is available on the MEPA website.\""]
[null,"d.","In the event that the Proponent receives requests to be removed from the project-specific EJ Reference List or of any automatic replies that indicate a contact may no longer be at one of the identified organizations, please indicate contact modifications in the \"Proponent Notes\" column on the project-specific EJ Reference List, notify MEPA-EJ@mass.gov of the modification, and await a revised project-specific EJ Reference List from the MEPA-EJ@mass.gov account."]
{"$rows_left_out":13}
{"sheet":"Project EJ Ref List","index":1,"n_rows":122,"n_cols":18,"rows_kept":122,"cut":false,"hidden":false,"merged":[[13,18,13,19],[7,16,11,17],[13,1,13,2],[61,2,63,2]]}
[]
[null,"Project-Specific EJ Reference List"]
[null,"Please populate all items in the grey boxes. Your Project-Specific EJ Reference List will auto-populate in the table below."]
[null,"Add any supplemental contacts identified through additional research to the right table titled \"Supplemental Community Contacts\"."]
[]
[null,"Project Name: "]
[]
[null,"Project Address:",null,null,null,null,null,null,null,null,null,null,null,null,null,null,"Click below to email MEPA and be sure to attach this completed project-specific EJ Reference List Excel file\n¯"]
[]
[null,"Date Generated: "]
[]
[null,"Filing Type:"]
[]
[null,"MA Municipalities in Project's DGA: ",null,"Blank","All","Blank","Blank","Blank","Blank","Blank"]
[null,null,null,"Blank","All","Blank","Blank","Blank","Blank","Blank"]
[null,null,null,"Note: if there are more than six municipalities in the project DGA, unhide row 14 above. If the DGA contains more than 12 municipalities, contact"]
[null,null,null,"MEPA-EJ@mass.gov for further instructions."]
[null,null,null,{"$f":"IF(OR(D14=\"Boston - Any Neighborhood\",F14=\"Boston - Any Neighborhood\",G14=\"Boston - Any Neighborhood\",H14=\"Boston - Any Neighborhood\",I14=\"Boston - Any Neighborhood\", J14=\"Boston - Any Neighborhood\",D15=\"Boston - Any Neighborhood\",F15=\"Boston - Any Neighborhood\",G15=\"Boston - Any Neighborhood\",H15=\"Boston - Any Neighborhood\",I15=\"Boston - Any Neighborhood\",J15=\"Boston - Any Neighborhood\"),\"☆ If DGA contains any of the following Boston neighborhoods, add them to the MA Muncipalities list: Chinatown, Dorchester, East Boston, Hyde Park, Mattapan, Roslindale, or Roxbury\",\"\")","v":""},null,null,null,null,null,null,null,null,{"$f":"IF(D14=\"Blank\",\"\",IF(COUNTIF(J21:J87,\"Local CBO\")=0,\"☆ No Local CBOs are identified in your project DGA, it is highly encouraged to conduct additional research to find supplemental local contacts\",\"\"))","v":""}]
[null,null,null,"Project-Specific EJ Reference List (auto-populates)",null,null,null,null,null,null,null,null,"Supplemental Community Contacts"]
[null,null,null,"Contact Name ","Intentionally Blank","Title","Phone","Email","Affiliation","Contact Type","Proponent Notes\n(contact status, removal requests, updates)",null,"Contact Name ","Intentionally Blank","Title","Affiliation","Email","Phone"]
{"$rows_left_out":103}
{"sheet":"PrintExport Friendly","index":2,"n_rows":117,"n_cols":17,"rows_kept":117,"cut":false,"hidden":false,"merged":[[60,2,62,2],[8,15,11,16],[14,1,14,2],[14,17,14,18]]}
[]
[]
[null,"Printer/Export Friendly Project-Specific EJ Reference List"]
[null,"Populate the \"Project EJ Ref List\" tab to generate a printer friendly format of the list"]
[null,"Before printing, ensure any \"blanks\" are filtered from the \"Contact Name\" column in the table below."]
[]
[null,"Project Name: ",null,{"$f":"IF('Project EJ Ref List'!$D$6=0,\"\",'Project EJ Ref List'!$D$6)","v":""}]
[]
[null,"Project Address:",null,{"$f":"IF('Project EJ Ref List'!D8=0,\"\", 'Project EJ Ref List'!D8)","v":""}]
[]
[null,"Date Generated: ",null,{"$f":"IF('Project EJ Ref List'!D10=0,\"\",'Project EJ Ref List'!D10)","v":""}]
[]
[null,null,null,{"$f":"'Project EJ Ref List'!D14","v":"Blank"},{"$f":"'Project EJ Ref List'!F14","v":"Blank"},{"$f":"'Project EJ Ref List'!G14","v":"Blank"},{"$f":"'Project EJ Ref List'!H14","v":"Blank"},{"$f":"'Project EJ Ref List'!I14","v":"Blank"},{"$f":"'Project EJ Ref List'!J14","v":"Blank"}]
[null,null,null,{"$f":"'Project EJ Ref List'!D15","v":"Blank"},{"$f":"'Project EJ Ref List'!F15","v":"Blank"},{"$f":"'Project EJ Ref List'!G15","v":"Blank"},{"$f":"'Project EJ Ref List'!H15","v":"Blank"},{"$f":"'Project EJ Ref List'!I15","v":"Blank"},{"$f":"'Project EJ Ref List'!J15","v":"Blank"}]
[null,"Municipalities in Project's DGA: ",null,{"$f":"_xlfn.TEXTJOIN(\", \",TRUE, IF(D13:I14<>\"Blank\",D13:I14,\"\"))","v":""}]
[]
[]
[null,null,null,"Project-Specific EJ Reference List",null,null,null,null,null,null,null,{"$f":"IF(L20=\"\",\"No supplemental community contacts were identified\",'Project EJ Ref List'!M19)","v":"No supplemental community contacts were identified"}]
[null,null,null,"Contact Name ","Title","Phone","Email","Affiliation","Contact Type","Proponent Notes\n(contact status, removal requests, updates)",null,"Contact Name ","Intentionally Blank","Title","Affiliation","Email","Phone"]
[null,null,null,{"$f":"IF('Project EJ Ref List'!D21=0,\"\",'Project EJ Ref List'!D21)","v":""},{"$f":"_xlfn.IFNA(IF(D20=\"\",\"\",VLOOKUP(D20,Table2[],2,0)),\"\")","v":""},{"$f":"_xlfn.IFNA(IF(D20=\"\",\"\",VLOOKUP(D20,Table2[],3,0)),\"\")","v":""},{"$f":"_xlfn.IFNA(IF(D20=\"\",\"\",VLOOKUP(D20,Table2[],4,0)),\"\")","v":""},{"$f":"_xlfn.IFNA(IF(D20=\"\",\"\",VLOOKUP(D20,Table2[],5,0)),\"\")","v":""},{"$f":"_xlfn.IFNA(IF(D20=\"\",\"\",VLOOKUP(D20,Table2[],7,0)),\"\")","v":""},{"$f":"IF(Table1[[#This Row],[Contact Name ]]=\"\",\"\",IF('Project EJ Ref List'!K21=0,\"none\",'Project EJ Ref List'!K21))","v":""},null,{"$f":"IF('Project EJ Ref List'!M21=0,\"\",'Project EJ Ref List'!M21)","v":""},null,{"$f":"IF(IF($L20=\"\",\"\",'Project EJ Ref List'!O21)=0,\"NA\",IF($L20=\"\",\"\",'Project EJ Ref List'!O21))","v":""},{"$f":"IF(IF($L20=\"\",\"\",'Project EJ Ref List'!P21)=0,\"NA\",IF($L20=\"\",\"\",'Project EJ Ref List'!P21))","v":""},{"$f":"IF(IF($L20=\"\",\"\",'Project EJ Ref List'!Q21)=0,\"NA\",IF($L20=\"\",\"\",'Project EJ Ref List'!Q21))","v":""},{"$f":"IF(IF($L20=\"\",\"\",'Project EJ Ref List'!R21)=0,\"NA\",IF($L20=\"\",\"\",'Project EJ Ref List'!R21))","v":""}]
{"$rows_left_out":98}
{"sheet":"MA_Muni","index":3,"n_rows":361,"n_cols":1,"rows_kept":361,"cut":false,"hidden":true,"merged":[]}
["MA Municipalities"]
["Blank"]
["Boston - Any Neighborhood"]
["Boston - Charlestown"]
["Boston - Chinatown"]
["Boston - Dorchester"]
["Boston - East Boston"]
["Boston - Hyde Park"]
["Boston - Mattapan"]
["Boston - Roslindale"]
["Boston - Roxbury"]
["Worcester"]
["Springfield "]
["Cambridge"]
["Lowell"]
["Brockton"]
["Quincy"]
["Lynn"]
["New Bedford"]
["Fall River"]
{"$rows_left_out":342}
{"sheet":"Complete_CBOList","index":4,"n_rows":119,"n_cols":7,"rows_kept":119,"cut":false,"hidden":true,"merged":[]}
["Name","Title","Phone","Email","Affiliation","Municipality","Contact Type"]
["Jane Winn","Executive Director","(413) 464-9402 ","team@thebeatnews.org","Berkshire Environmental Action Team","Adams , Alford, Becket, Cheshire, Clarksburg, Dalton, Egermont, Florida, Great Barrington, Hancock, Hinsdale, Lanesborough, Lee, Lenox, Monterey, Mount Washington, New Ashford, New Marlborough, North Adams, Otis, Peru, Pittsfield, Richmond, Sandisfield, Savoy, Sheffield, Springfield , Stockbridge , Tyringham, Washington, West Stockbridge, Williamstown, Windsor ","Local CBO"]
["Courteny Morehouse","Principal Planner","(413) 442-1512 x26","cmorehouse@berkshireplanning.org","Berkshire Regional Planning Commission (BRPC)","Adams , Alford, Becket, Cheshire, Clarksburg, Dalton, Egremont, Florida,  Great Barrington, Hancock, Hinsdale, Lanesborough, Lee, Lenox, Monterey, Mount Washington, New Ashford, New Marlborough, North Adams, Otis, Peru, Pittsfield, Richmond, Sandisfield, Savoy, Sheffield, Stockbridge , Tyringham, Washington, West Stockbridge, Williamstown, Windsor","Local CBO"]
["Erin O'Brien","Communications","(856) 304-8703","eobrien@berkshirehabitat.org","Central Berkshire Habitat for Humanity","Adams , Alford, Becket, Clarksburg, Dalton, Great Barrington, Hinsdale, Lanesborough, Lee, Lenox, Mount Washington, Otis, Pittsfield, Williamstown","Local CBO"]
["Arianna Collins","Executive Director","Not Provided","a.collins@hoorwa.org","Hoosic River Watershed Association (HooRWA)","Adams , Berkshire, Cheshire, Clarksburg, Hancock, Lanesboro, New Ashford, North Adams, Savoy, Williamstown. ","Local CBO"]
["Mark Wamsley","Conservation Director","Not Provided","mark@kestreltrust.org","Kestrel Land Trust","Agawam, Amherst , Belchertown, Chicopee, Easthampton, Granby, Hadley , Hatfield, Holyoke, Leverett, Ludlow, North Amherst, Northampton, Pelham, Shutesbury, South Hadley, Southampton, Springfield , Sunderland, Westhampton, West Springfield, Whately, Williamsburg","Local CBO"]
["Sarita Hudson","Director Programs & Development","(413) 794-7739","shudson@publichealthwm.org","Public Health Institute of Western Mass","Agawam, Amherst, Buckland, Charlemont, Chicopee, Easthampton, Greenfield, Hadley , Holyoke, Huntington, Ludlow, Monroe, Northampton, Orange, Palmer, Rowe, Southwick, Springfield , Sunderland, Ware, West Springfield, Westfield, Wendell","Local CBO"]
["Erik Reardon","Berkshire Watershed Director ","978-914-3634","ereardon@hvatoday.org\nhva@hvatoday.org","Housatonic Valley Association (HVA)","Alford, Becket, Dalton, Egremont, Great Barrington, Lee, Lenox, Monterey, Mount Washington, New Marlborough, North Adams, Otis, Pittsfield, Richmond, Sandisfield, Sheffield, Stockbridge , Tyringham, Washington, and West Stockbridge","Local CBO"]
["Claire B.W. Muller","Movement Building Director","(508) 308-9261","claire@uumassaction.org ","Unitarian Universalist Mass Action Network","All","Statewide CBO"]
["Julia Blatt","Executive Director","(617) 714-4272","juliablatt@massriversalliance.org","Mass Rivers Alliance","All","Statewide CBO"]
["Jodi  Valenta","Massachusetts State Director","(617) 367-6200","Jodi.Valenta@tpl.org","The Trust for Public Land","All","Statewide CBO"]
["Kerry Bowie","Board President","Not Provided","kerry@msaadapartners.com ","Browning the GreenSpace","All","Statewide CBO"]
["Sylvia Broude","Executive Director","(617) 292-4821","sylvia@communityactionworks.org","Community Action Works","All","Statewide CBO"]
["Britteny Jenkins","Vice President ","Not Provided","Bjenkins@clf.org","Conservation Law Foundation ","All","Statewide CBO"]
["Alex  St. Pierre","Director of Communities & Toxics","Not Provided","aestpierre@clf.org","Conservation Law Foundation ","All","Statewide CBO"]
["Paulina Muratore","Director of Transportation Justice and Infrastructure","Not Provided","pmuratore@clf.org","Conservation Law Foundation ","All","Statewide CBO"]
["Breanne Frank","Associate Attorney","Not Provided","bfrank@clf.org","Conservation Law Foundation ","All","Statewide CBO"]
["Amy  Boyd Rabin","Vice President of Policy","(617) 221-8258","aboydrabin@environmentalleague.org","Environmental  League of Massachusetts","All","Statewide CBO"]
["Ben Hellerstein","MA State Director","(617) 747-4368","ben@environmentmassachusetts.org ","Environment Massachusetts","All","Statewide CBO"]
["Robb Johnson","Executive Director","(978) 443-2233","robb@massland.org","Mass Land Trust Coalition","All","Statewide CBO"]
{"$rows_left_out":99}