{"text_format":"1","workbook":"xlsx","n_sheets":10,"sheets":["I. IPLEFrontpage","II. Fund Use Parameters","III. Fund Allocation_Narrative","IV. SchA_Form","V. Agency Contact Form ","VI. Programmatic Questions A","AM1Form._AmendmentCover","Amend Details_III","FFR1_ Final Report","tydings_details"],"not_rendered":{"charts":0,"images":0,"macros":1,"external_links":3,"defined_names":126,"comments":0,"pivot_tables":0},"unopened":[],"bounds":{"document_bytes":16777216,"sheet_cells":100000,"rows_first":2000,"rows_last":500,"rows_between":2000,"halvings":0,"cell_chars":16384,"cell_head_chars":4096},"cells_cut":0,"cells_raw":0,"read":"whole","date_system":"1900"}

{"sheet":"I. IPLEFrontpage","index":0,"n_rows":48,"n_cols":16,"rows_kept":48,"cut":false,"hidden":false,"merged":[[47,9,47,10],[46,1,46,15],[44,1,44,15],[45,1,45,15],[16,1,16,2],[17,1,17,2],[20,1,20,13],[20,14,20,15],[19,14,19,15],[23,14,23,15],[16,8,16,11],[23,3,23,13],[32,1,32,15],[16,3,17,7],[16,14,16,15],[26,3,26,13],[1,1,1,15],[2,1,2,15],[29,1,29,15],[16,12,16,13],[4,12,4,14],[15,8,15,13],[17,14,17,15],[26,14,26,15],[17,8,17,11],[7,4,7,5],[11,12,11,15],[4,3,4,5],[6,4,6,7],[5,12,5,15],[6,12,7,15],[7,7,7,10],[34,3,34,12],[9,12,9,15],[17,12,17,13],[9,3,9,5],[40,19,40,33],[28,19,35,33],[30,1,30,15],[35,1,35,15],[38,1,38,15],[37,1,37,15],[33,1,33,15],[36,19,36,33],[36,1,36,15],[31,1,31,15],[37,19,37,33],[39,19,39,33]]}
[]
[null,"MASSACHUSETTS DEPARTMENT OF EARLY EDUCATION AND CARE"]
[null,"FY2014 INCLUSIVE PRESCHOOL LEARNING ENVIRONMENTS RENEWAL GRANT (Fund Code 391)"]
[]
[null,"A. APPLICANT",null,"Lead Agency Name:",null,null,null,3,null,null,null,null,"Org Code:",null,null,{"$f":"LEFT(VLOOKUP('I. IPLEFrontpage'!$H$5,tydings_details!A1:O100,6,FALSE), 10)","v":"Lead Agenc"}]
[null,null,null,null,null,null,null,null,null,null,null,null,"Communities Served:"]
[null,null,null,"Address: ",{"$f":"VLOOKUP('I. IPLEFrontpage'!$H$5,tydings_details!A1:O100,7,FALSE)","v":"Legal Address"},null,null,null,null,null,null,null,"Enter Names of Communities Served:City/town, City/town, City/town, etc"]
[null,null,null,null,{"$f":"VLOOKUP('I. IPLEFrontpage'!$H$5,tydings_details!A1:O100,9,FALSE)","v":"City"},null,null,{"$f":"VLOOKUP('I. IPLEFrontpage'!$H$5,tydings_details!A1:O100,11,FALSE)","v":"TIN_Zip_Code"}]
[]
[null,"Grant Contact Name: ",null,"Enter Contact Name ",null,null,null,"Contact Telephone:",null,null,null,null,"Enter Contact Phone "]
[]
[null,null,null,null,null,null,null,"Contact Email:",null,null,null,null,"enter email "]
[]
[]
[null,"B. GRANT APPLICATION BUDGET WORKBOOK "]
[null,null,null,null,null,null,null,null,"PROJECT DURATION"]
[null,"Fund Code 391 ",null,"INCLUSIVE PRESCHOOL LEARNING ENVIRONMENTS ",null,null,null,null,"FROM",null,null,null,"TO",null,"Allocation Amount"]
[null,"Program Name:",null,null,null,null,null,null,"7/1/2013 or Upon Approval",null,null,null,"2014-06-30",null,{"$f":"VLOOKUP('I. IPLEFrontpage'!$H$5,tydings_details!A1:O100,12,FALSE)","v":"FY14 Eligibility Amount"}]
[]
[null,"C.  ASSIGNMENT THROUGH SCHEDULE A",null,null,null,null,null,null,null,null,null,null,null,null,"Amount Assigned "]
{"$rows_left_out":29}
{"sheet":"II. Fund Use Parameters","index":1,"n_rows":7,"n_cols":3,"rows_kept":7,"cut":false,"hidden":false,"merged":[[0,0,0,2],[1,0,1,2]]}
[]
["FY2014 Inclusive Preschool Learning Environments Renewal Grant "]
["Line #"," Category","Fund Use Parameters"]
[1,"Inclusive Preschool Teacher Salaries","Only applicable for funding employed teachers providing direct services to preschool aged children in classrooms that meet the definition of Inclusive Learning Environments.  Such positions must be funded from the grantee’s Inclusive Learning Environment Allocation only (See Appendix C for allocation amounts). Fund use is limited to teacher and/or paraprofessional positions which are in direct relation to maintaining the required adult/child ratios and can not be used to fund additional persons in the classroom.  Please note: salaries in public school settings must be proportionate to the number of preschool aged peer models served; special education funds should be used to serve children with IEPs."]
[2,"Inclusive Paraprofessional Salaries","Only applicable for funding employed paraprofessionals providing direct services to preschool aged children in classrooms that meet the definition of Inclusive Learning Environments.  Such positions must be funded from the grantee’s Inclusive Learning Environment Allocation only (See Appendix C).  Fund use is limited to paraprofessional positions which are in direct relation to maintaining the required adult/child ratios and can not be used to fund additional persons in the classroom.  Please note: salaries in public school settings must be proportionate to the number of preschool aged peer models served; special education funds should be used to serve children with IEPs."]
[3,"Preschool Direct Services Staff Fringe Benefits","Only applicable for funding fringe benefit costs for teacher and paraprofessional positions funded through the teacher and paraprofessional salaries lines of this grant.  Fringe costs may only be funded using a grantee’s Inclusive Learning Environment Allocation (See Appendix C).  MTRS IS NOT AN ALLOWABLE FRINGE EXPENSE FOR FUND CODE 391"]
[4,"Transportation","Costs associated with providing transportation for children, including subcontracted staff for transportations services (exclusive of transportation required by children’s IEPs). "]

{"sheet":"III. Fund Allocation_Narrative","index":2,"n_rows":23,"n_cols":8,"rows_kept":23,"cut":false,"hidden":false,"merged":[[19,6,19,7],[9,5,9,7],[11,5,11,7],[17,5,17,7],[15,5,15,7],[10,5,10,7],[18,5,18,7],[14,5,14,7],[16,5,16,7],[12,5,12,7],[13,5,13,7],[17,2,17,3],[15,2,15,4],[2,5,2,6],[4,2,4,3],[5,0,5,7],[3,2,3,3],[6,0,7,1],[6,2,6,4],[7,2,7,4],[6,5,7,7],[8,5,8,7]]}
[]
["Fund Allocation and Budget Narrative",null,null,null,"Fund Code 391",null,null,"Inclusive Preschool Learning Environments "]
[{"$f":"'I. IPLEFrontpage'!$P$5","v":"Lead Agenc"},"Lead Agency Name:",{"$f":"VLOOKUP('I. IPLEFrontpage'!$H$5,tydings_details!A1:O100,5,FALSE)","v":"Select FY14 Lead Agency Name "},null,null,"Grant Contact Name: ",null,{"$f":"'I. IPLEFrontpage'!$D$10","v":"Enter Contact Name "}]
[null,"Address:",{"$f":"'I. IPLEFrontpage'!$E$7","v":"Legal Address"},null,null,null,"Email: ",{"$f":"'I. IPLEFrontpage'!$M$12","v":"enter email "}]
[null,"City, Zip:",{"$f":"'I. IPLEFrontpage'!$E$8","v":"City"},null,{"$f":"'I. IPLEFrontpage'!$H$8","v":"TIN_Zip_Code"},null,"Phone: ",{"$f":"'I. IPLEFrontpage'!$M$10","v":"Enter Contact Phone "}]
["FY2014 INCLUSIVE PRESCHOOL LEARNING ENVIRONMENTS RENEWAL GRANT (Fund Code 391)"]
["Expenditure Category ",null,"Performance Period",null,null,"Budget Narrative"]
[null,null,"July 1, 2013- June 30, 2014"]
[null,"Funding to Support Inclusive Preschool Settings","Number of Staff ","Total Number of FTEs","Proposed FY14 Expenditures","Please give a brief explaination of each expediture and how it aligns with the specific activities of the grant. Please included the Number of Staff (column A) and Number of FTEs (column B) for Line Items 1 and 2.                                                                                                                                                                          "]
[null,"Line Items","Column A","Column B","Column C","Column D (255 character limit per line item)"]
[1,"Inclusive Preschool Teacher Salaries",0,0,0]
[2,"Inclusive Paraprofessional Salaries",0,0,0]
[3,"Preschool Direct Services Staff Fringe Benefits",0,0,0]
[null,"Subtotal Salaries and Fringe ",{"$f":"SUM(C11:C12)","v":0},{"$f":"SUM(D11:D12)","v":0},{"$f":"SUM(E11:E13)","v":0}]
[]
[null,"Transportation ",null,null,null,"Please indicate the projected total number of children that will receive transportation in FY2014 through Fund Code 391 and the estimated cost per child in the budget narrative section below. "]
[4,"Transportation",null,null,0]
[null,"Subtotal Transportation ",null,null,{"$f":"SUM(E17)","v":0}]
[null,"FY14 Inclusive Preschool Learning Environments Budget TOTAL",null,null,{"$f":"SUM(E18+E14)","v":0},"If your total is displayed in orange text, you have exceeded your total eligibility amount amount, please adjust your budget accordingly. ALL REQUEST FOR FUNDS MUST BE IN WHOLE DOLLAR AMOUNTS "]
[null,{"$f":"$C$3","v":"Select FY14 Lead Agency Name "},"Budget Check",null,"Approved by (int)",null,"    "]
{"$rows_left_out":4}
{"sheet":"IV. SchA_Form","index":3,"n_rows":40,"n_cols":10,"rows_kept":40,"cut":false,"hidden":false,"merged":[[25,0,25,4],[23,0,23,4],[24,0,24,4],[9,0,12,0],[14,4,15,5],[13,0,15,0],[9,1,12,3],[13,1,15,3],[18,0,18,9],[19,5,20,5],[19,0,20,4],[22,6,22,9],[22,0,22,4],[30,6,30,9],[27,6,27,9],[28,6,28,9],[0,0,0,9],[1,0,1,9],[3,0,3,9],[4,0,4,9],[6,1,8,9],[6,0,8,0],[17,0,17,9],[21,0,21,4],[21,6,21,9],[26,0,26,4],[23,6,23,9],[25,6,25,9],[24,6,24,9],[39,0,39,9],[37,0,37,9],[26,6,26,9],[19,6,20,9],[33,1,33,4],[33,6,33,9],[27,0,27,4],[32,6,32,9],[28,0,28,4],[32,0,32,4],[31,6,31,9],[30,0,30,4],[31,0,31,4],[35,0,36,9],[29,0,29,4],[29,6,29,9]]}
["MASSACHUSETTS DEPARTMENT OF EARLY EDUCATION AND CARE"]
["FY2014 INCLUSIVE PRESCHOOL LEARNING ENVIRONMENTS RENEWAL GRANT (Fund Code 391)"]
[]
["SCHEDULE A"]
["(Consolidated Assignment Schedule)"]
[]
[1,"Schedule A is to be completed if the applicant agency operates and administers a grant project using funds assigned from more than one agency. Only agencies listed in Appendix C: FY14 Eligiblity List may be considered as \"Particpating Agencies\""]
[]
[]
[2,"Agency operating and administering the project:               (Legal Name of Agency)"]
[]
[null,null,null,null,{"$f":"'III. Fund Allocation_Narrative'!C3","v":"Select FY14 Lead Agency Name "},null,"Org Code: ",{"$f":"'I. IPLEFrontpage'!P5","v":"Lead Agenc"}]
[]
[3,"Name of grant program/\nSource of funds:"]
[null,null,null,null,"INCLUSIVE PRESCHOOL LEARNING ENVIRONMENTS ",null,null,"Fund Code: ",null,391]
[]
[]
["Please list all other participating agencies that have assigned their FY14 IPLE funds, and the amount of funds assigned by that entity. If not applicable, this form should be left blank. "]
["ONE (1) ORIGINAL ASSIGNMENT SCHEDULE (SCHEDULE A FORM) SIGNED BY EACH PARTICIPATING AGENCY’s AUTHORIZED SIGNITORY MUST BE SUBMITTED VIA MAIL AS PART OF THE GRANT RENEWAL APPLICATION  "]
["Name of Participating Agency",null,null,null,null,"Amount of Assigned Funds","* Authorized Signature (in blue ink)"]
{"$rows_left_out":21}
{"sheet":"V. Agency Contact Form ","index":4,"n_rows":14,"n_cols":11,"rows_kept":14,"cut":false,"hidden":false,"merged":[[1,5,1,6],[1,7,1,8],[3,6,3,7],[13,2,13,4],[2,0,2,1],[5,0,5,10],[6,0,6,10],[13,8,13,10],[4,2,4,3],[3,2,3,3],[2,6,2,7],[4,6,4,7],[2,8,2,10],[3,8,3,10],[4,8,4,10],[2,2,2,5]]}
[]
["PART V - Agency Contact Information Form ",null,null,null,null,"Fund Code 391",null,{"$f":"VLOOKUP('I. IPLEFrontpage'!H5,tydings_details!A1:P100,6,FALSE)","v":"Lead Agency Organization ID"},null,null,"FY2014"]
["Grant Lead Agency Name:",null,{"$f":"VLOOKUP('I. IPLEFrontpage'!$H$5,tydings_details!A1:O100,5,FALSE)","v":"Select FY14 Lead Agency Name "},null,null,null,"Grant Coordinator Name: ",null,{"$f":"'I. IPLEFrontpage'!$D$10","v":"Enter Contact Name "}]
[null,"Address:",{"$f":"'I. IPLEFrontpage'!$E$7","v":"Legal Address"},null,null,null,"Email: ",null,{"$f":"'I. IPLEFrontpage'!$M$12","v":"enter email "}]
[null,"City, Zip:",{"$f":"VLOOKUP('I. IPLEFrontpage'!$H$5,tydings_details!A1:O100,9,FALSE)","v":"City"},null,{"$f":"VLOOKUP('I. IPLEFrontpage'!$H$5,tydings_details!A1:O100,11,FALSE)","v":"TIN_Zip_Code"},null,"Phone: ",null,{"$f":"'I. IPLEFrontpage'!$M$10","v":"Enter Contact Phone "}]
["Complete the contact sheet below to ensure EEC has current contact information for each position listed, as this information is used throughout the grant. performance period.   "]
[" Please note that it is the responsibility of the grantee to notify EEC if there are any changes to the information provided below."]
[null,"Job Function ","Position Title","First Name ","Last Name ","Address ","City/Town ","Zip Code ","Phone: ","Fax:  ","Email "]
[1,"Early Childhood Coordinator             (Special Education)\n"]
[2,"Special Education Director"]
[3,"Superintendent/ Executive Director of Lead Agency "]
[4,"Fiscal Contact "]
[5,"Summer Contact*"]
[null,null,null,null,null,null,"Updated (int)",null,"Part V Agency Contact Form    "]

{"sheet":"VI. Programmatic Questions A","index":5,"n_rows":44,"n_cols":10,"rows_kept":44,"cut":false,"hidden":false,"merged":[[44,2,44,5],[34,2,34,5],[27,7,27,8],[36,1,36,10],[39,2,39,5],[41,2,41,5],[41,7,41,8],[32,1,32,10],[37,1,37,9],[43,2,43,5],[29,2,29,5],[31,1,31,10],[30,2,30,5],[20,2,20,5],[28,2,28,5],[18,2,18,10],[17,1,17,10],[12,1,12,5],[23,1,23,10],[27,2,27,5],[13,2,13,5],[14,2,14,5],[25,2,25,5],[21,2,21,5],[19,2,19,8],[5,1,5,10],[0,1,0,10],[1,1,1,10],[15,2,15,5],[10,2,10,10],[6,1,6,10],[9,2,9,10],[7,1,7,5],[7,6,7,10]]}
[null,"FY2014 PROGRAMMATIC QUESTIONS 1-7 (Section A)"]
[null,"FY2014 INCLUSIVE PRESCHOOL LEARNING ENVIRONMENTS RENEWAL GRANT(Fund Code 391)"]
[]
[null,{"$f":"'III. Fund Allocation_Narrative'!C3","v":"Select FY14 Lead Agency Name "},null,null,null,null,null,"Org Code: ",{"$f":"'I. IPLEFrontpage'!P5","v":"Lead Agenc"}]
[]
[null,"To address how IPLE funded programs and schools will continue to meet the grant priority and requirements listed in the FY2014 Inclusive Preschool Learning Environments Renewal Grant, please respond to the questions below."]
[null,"A response is required for each question in the corresponding yellow boxes."]
[null,"Number Funded Programs and Schools "]
[]
[null,1,"How many programs and public school received IPLE grant funding  through your lead agency for FY 2013 (July 1, 2012- June 30, 2013)?"]
[null,null,"How many programs and public school will receive IPLE renewal grant funding  through your lead agency for FY 2014 (July 1, 2013- June 30, 2014)?"]
[]
[null,"Program Type:",null,null,null,null,"FY13",null,"FY14","Anticipated "]
[null,"a. ","Number of EEC-Licensed Center-based programs",null,null,null,0,null,0]
[null,"b.","Number of Public Schools ",null,null,null,0,null,0]
[null,"c.","Number of  Schools w/EEC-License",null,null,null,0,null,0]
[null,null,null,null,null,null,{"$f":"SUM(G14:G16)","v":0},null,{"$f":"SUM(I14:I16)","v":0}]
[null,"Number of Classrooms  (This is the number of classrooms where the funded Preschool teachers and Paraprofessionals work)"]
[null,2,"How many preschool classrooms received IPLE funding in FY13 (July 1, 2012- June 30, 2013)?"]
[null,null,"How many preschool classrooms will receive IPLE funding in FY14 (July 1, 2013- June 30, 2014)?"]
{"$rows_left_out":25}
{"sheet":"AM1Form._AmendmentCover","index":6,"n_rows":60,"n_cols":8,"rows_kept":60,"cut":false,"hidden":false,"merged":[[25,5,25,7],[28,4,28,5],[29,4,29,5],[28,1,28,2],[29,1,29,2],[26,5,26,7],[26,2,26,3],[24,2,25,3],[22,1,23,1],[22,4,23,7],[24,5,24,7],[22,2,22,3],[23,2,23,3],[54,5,54,7],[30,1,30,3],[52,2,52,4],[51,2,51,4],[52,5,52,7],[51,5,51,7],[53,2,53,4],[54,2,54,4],[50,1,50,7],[53,5,53,7],[36,2,36,3],[19,2,19,3],[15,2,15,7],[21,4,21,7],[20,2,20,3],[20,4,20,5],[18,2,18,3],[21,2,21,3],[19,4,19,7],[60,5,60,7],[58,4,58,5],[57,4,57,5],[59,4,59,7],[57,6,57,7],[58,6,58,7],[10,2,10,7],[14,1,14,7],[16,1,16,7],[17,4,17,6],[13,2,13,7],[17,2,17,3],[11,2,11,4],[11,5,11,7],[12,2,12,7],[9,2,9,7],[1,1,1,7],[2,1,2,7],[4,1,4,7],[5,1,5,7],[8,1,8,7],[7,2,7,7]]}
[]
[null,"MASSACHUSETTS DEPARTMENT OF EARLY EDUCATION AND CARE       "]
[null,"FY2014 Inclusive Preschool Learning Environments Grant"]
[]
[null,"FORM AM 1"]
[null,"(AMENDMENT REQUEST FORM)"]
[]
[null,null,"EEC must be in receipt of all Budget Amendment Request Forms, no later than April 15, 2014. "]
[null,"PART I:"]
[null,"1.","Fill in the yellow highlighted sections  on the AMENDMENT REQUEST FORM (Amendment Cover tab)  and the Amendment Budget Justification (Budget Amend Tab). Do NOT change the file name."]
[null,"2. ","Email this entire workbook to EEC to the following email address with the subject line FY14 391 Budget Amendment Request and your agency name.  "]
[null,null,"Please send your Amendment Request Form to: ",null,null,"EECSubmission@massmail.state.ma.us"]
[null,"3.","EEC will review and approve (fiscally and programmaticaly) your electronic request via email. "]
[null,"4","Upon receipt of EEC's emailed response, the AM-1 form requires the  original signature of lead agency authorized representative) and the entire Budget Amendment Request Form (AM1 Form Amendment Cover page and the Budget Amendment Justification - Detail Information) must be be mailed to EEC. All signed Budget Amendment Requests Forms should be mailed to: "]
[null,"                Jessica Fix, MA Department of Early Education and Care, 51 Sleeper Street, 4th Floor, Boston, MA 02210.                               "]
[null,null,"Please Note: All amendment requests must be approved in writing by an authorized representative of the MA Department of Early Education and Care prior to implementation."]
[null,"GRANTEE INFORMATION:"]
[null,"A.","Grant Recipient:",null,{"$f":"VLOOKUP('I. IPLEFrontpage'!$H$5,tydings_details!A1:O100,5,FALSE)","v":"Select FY14 Lead Agency Name "},null,null,"FY14 IPLE"]
[null,"B.","(Legal Name of Agency)",null,{"$f":"VLOOKUP('I. IPLEFrontpage'!$H$5,tydings_details!A1:O100,14,FALSE)","v":"391FY14_LegalName"}]
[null,"C.","Address:",null,{"$f":"VLOOKUP('I. IPLEFrontpage'!$H$5,tydings_details!A1:O100,7,FALSE)","v":"Legal Address"}]
{"$rows_left_out":41}
{"sheet":"Amend Details_III","index":7,"n_rows":27,"n_cols":11,"rows_kept":27,"cut":false,"hidden":false,"merged":[[5,8,5,9],[3,8,3,10],[7,1,7,6],[8,2,8,6],[4,3,4,4],[3,3,3,5],[3,6,3,7],[4,8,4,10],[26,2,26,8],[14,1,14,2],[26,9,26,10],[15,8,15,10],[19,8,19,10],[20,8,20,10],[22,8,22,10],[23,8,23,10],[24,8,24,10],[14,8,14,10],[25,1,25,2],[25,8,25,10],[16,8,16,10],[17,8,17,10],[18,8,18,10],[9,2,9,6],[10,2,10,6],[13,8,13,10],[11,2,11,9],[13,4,13,7]]}
[]
[]
[null,"Part  III. BUDGET AMENDMENT JUSTIFICATIONS - DETAIL INFORMATION",null,null,null,null,null,null,null,"Fund Code 391","FY14 Amendment"]
[null,{"$f":"'I. IPLEFrontpage'!$P$5","v":"Lead Agenc"},"Grant Lead Agency Name:",{"$f":"VLOOKUP('I. IPLEFrontpage'!$H$5,tydings_details!A1:O100,5,FALSE)","v":"Select FY14 Lead Agency Name "},null,null,"Grant Contact Name: ",null,{"$f":"'I. IPLEFrontpage'!$D$10","v":"Enter Contact Name "}]
[null,null,"Address:",{"$f":"'I. IPLEFrontpage'!$E$7","v":"Legal Address"},null,null,null,"Email: ",{"$f":"'I. IPLEFrontpage'!$M$12","v":"enter email "}]
[null,null,"City, Zip",{"$f":"'I. IPLEFrontpage'!$E$8","v":"City"},null,null,null,"Phone: ",{"$f":"'I. IPLEFrontpage'!$M$10","v":"Enter Contact Phone "}]
[]
[]
[null,"A.","Column A will be filled in automatically as provided in the originally approved budget."]
[null,"B. ","Column B should be be completed by GRANTEE for AM1  and Column D for AM2"]
[null,"C. ","Column C will be filled in automatically as line item changes are made in Column B and Column E will be filled out automatically for AM2"]
[null,"D.","Column F should be completed by GRANTEE outlining amendment justifications and related changes to activities for each line item and how the budgetary changes impact the deliverly of the require services."]
[]
[null,null,null,null,"Budget Amendment Request",null,null,null,"Amendment Justification"]
[null,"Expenditure Category ",null,"Originally Approved Budget  ","Amendment Request 1","Revised Budget 1","Amendment Request 2","Revised Budget 2","Explain and justify why the proposed adjustments should be implemented and specify how budget changes impact the implementation of grant related activities. Include any adjustments to staff and number of FTEs for Line Items 1- 2, if applicable.                                                                                                                                                            "]
[null,null,"Line Items","Column A","Column B","Column C","Column D","Column E","Column F "]
[]
[null,1,"Inclusive Preschool Teacher Salaries",{"$f":"'III. Fund Allocation_Narrative'!$E$11","v":0},0,{"$f":"SUM(D18:E18)","v":0},0,{"$f":"SUM(F18+G18)","v":0}]
[null,2,"Paraprofessional Salaries",{"$f":"'III. Fund Allocation_Narrative'!$E$12","v":0},0,{"$f":"SUM(D19:E19)","v":0},0,{"$f":"SUM(F19+G19)","v":0}]
[null,3,"Preschool Direct Services Staff Fringe Benefits",{"$f":"'III. Fund Allocation_Narrative'!$E$13","v":0},0,{"$f":"SUM(D20:E20)","v":0},0,{"$f":"SUM(F20+G20)","v":0}]
{"$rows_left_out":8}
{"sheet":"FFR1_ Final Report","index":8,"n_rows":56,"n_cols":10,"rows_kept":56,"cut":false,"hidden":false,"merged":[[40,2,40,8],[1,1,1,9],[3,1,3,9],[21,4,21,6],[23,4,23,6],[26,5,26,8],[22,4,22,7],[19,4,19,7],[4,1,4,8],[8,2,8,6],[7,2,7,7],[9,2,9,6],[12,4,12,6],[24,2,24,3],[25,5,25,8],[39,2,39,8],[38,2,38,8],[37,2,37,8],[33,1,33,7],[35,1,35,7],[24,5,24,8],[43,2,43,5],[44,2,44,5],[45,2,45,5],[51,1,51,4],[50,1,50,4],[46,2,46,5],[47,2,47,5],[50,5,50,9],[49,1,49,9],[51,5,51,9],[52,5,52,9],[53,5,53,9],[53,1,53,4],[48,2,48,5],[52,1,52,4]]}
[]
[null,"MASSACHUSETTS DEPARTMENT OF EARLY EDUCATION AND CARE       "]
[]
[null,"(FY14 Fund Code 391 FINAL FINANCIAL REPORT)"]
[]
[null,"PART I:  GENERAL INSTRUCTIONS"]
[]
[null,"1.","All sections of this report highlighted in yellow must be completed, and the report submitted within 60 days of full liquidation but no later than August 31, 2014."]
[null,"2. ","A check made payable to the \"Commonwealth of Massachusetts\" must be returned for any unexpended funds with this FINAL FINANCIAL REPORT."]
[null,"3.","Complete and return to the following address:                   "]
[]
[null,null,null,null,"Department of Early Education and Care     "]
[null,null,null,null,"51 Sleeper Street, 4th Floor    "]
[null,null,null,null,"Boston, MA 02210 "]
[null,null,null,null,"ATTENTION:  GLORIA HICKEY"]
[]
[]
[null,"A.","Grant Recipient:",null,{"$f":"VLOOKUP('I. IPLEFrontpage'!$H$5,tydings_details!A1:O100,5,FALSE)","v":"Select FY14 Lead Agency Name "},null,null,"FY14 IPLE"]
[null,"B.","(Legal Name of Agency)",null,{"$f":"AM1Form._AmendmentCover!$E$19","v":"391FY14_LegalName"}]
[null,null,"Address:",null,{"$f":"VLOOKUP('I. IPLEFrontpage'!$H$5,tydings_details!A1:O100,7,FALSE)","v":"Legal Address"}]
{"$rows_left_out":37}
{"sheet":"tydings_details","index":9,"n_rows":100,"n_cols":16,"rows_kept":100,"cut":false,"hidden":true,"merged":[]}
[1,"FUNCTION","FIRST NAME","Last Name ","ORGANIZATION NAME","ORGANIZATION CODE","ADDRESS LINE 1","ADDRESS LINE 2","CITY/TOWN","STATE","ZIP CODE","Eligibility_Amount","Communities Served (DS)","FY12 login_legal_name","Fund Code","DOCID"]
[2,2,3,4,5,"6",7,8,9,10,11,12,13,14,"15","16"]
[3,"FUNCTION","FIRST NAME","Last Name ","Select FY14 Lead Agency Name ","Lead Agency Organization ID","Legal Address","ADDRESS LINE 2","City","MA","TIN_Zip_Code","FY14 Eligibility Amount","Communities Served (DS)","391FY14_LegalName","Fund Code","39114 DOCID"]
[4,null,null,null,"Action  for Boston Community Development","2000000","178 TREMONT STREET",null,"BOSTON","MA","02111",49805,null,"ACTION FOR BOSTON COMMUNITY",391,"39114ACTIONBOSTONCOM"]
[5,null,null,null,"Agawam Public Schools","0005","36 MAIN ST",null,"AGAWAM","MA","01001-1801",11853,null,"TOWN OF AGAWAM",391,"39114AGAWAMPUBLICSCH"]
[6,null,null,null,"Amherst Public Schools","0008","4 BOLTWOOD WALK",null,"AMHERST","MA","01002-2113",72591,null,"TOWN OF AMHERST",391,"39114AMHERSTPUBLICSC"]
[7,null,null,null,"Attleboro Public Schools","0016","77 PARK ST",null,"ATTLEBORO","MA","02703-2334",82067,null,"CITY OF ATTLEBORO",391,"39114ATTLEBOROPUBLIC"]
[8,null,null,null,"Ayer-Shirley RSD","0616","1 MAIN ST",null,"AYER","MA","01432-1365",66423,null,"TOWN OF AYER",391,"39114AYERPUBLICSCHO1"]
[9,null,null,null,"Blackstone-Millville RSD","0622","175 LINCOLN STREET",null,"BLACKSTONE","MA","01504",11036,null,"BLACKSTONE MILLVILLE",391,"39114BLACKSTONEMILLV"]
[10,null,null,null,"Boston Public Schools","0035","CITY HALL PLZ ROOM M-5",null,"BOSTON","MA","02201-0001",309201,null,"CITY OF BOSTON",391,"39114BOSTONPUBLICSCH"]
[11,null,null,null,"Bourne Public Schools","0036","24 PERRY AVE",null,"BOURNE","MA","02532-3441",24808,null,"TOWN OF BOURNE",391,"39114BOURNEPUBLICSCH"]
[12,null,null,null,"Brimfield Public Schools (Union 61)","0043","21 MAIN ST",null,"BRIMFIELD","MA","01010-9744",81311,null,"TOWN OF BRIMFIELD",391,"39114BRIMFIELDPUBLIC"]
[13,null,null,null,"Brockton Public Schools","0044","45 SCHOOL ST",null,"BROCKTON","MA","02301-4049",481800,null,"CITY OF BROCKTON, TREASURER",391,"39114BROCKTONPUBLICS"]
[14,null,null,null,"Brookline Public Schools","0046","333 WASHINGTON STREET",null,"BROOKLINE","MA","02146",126712,null,"TOWN OF BROOKLINE",391,"39114BROOKLINEPUBLIC"]
[15,null,null,null,"Cape Cod Child Development Program, Inc",1201061,"83 PEARL ST",null,"HYANNIS","MA","02601-3922",159769,null,"Cape Cod Child Development Program, Inc",391,"39114CAPECODCHILDDEV"]
[16,null,null,null,"Cape Cod Children's Place, Inc.","1471202","10 BALLWIC ROAD",null,"N EASTHAM","MA","02651",69438,null,"CAPE COD CHILDREN S PLACE INC",391,"39114CAPECODCHILDREN"]
[17,null,null,null,"Central Berkshire RSD","0635","20 CLEVELAND RD PO BOX 299",null,"DALTON","MA","01227",81265,null,"CENTRAL BERKSHIRE REGIONAL",391,"39114CENTRALBERKRSD0"]
[18,null,null,null,"Chicopee Public Schools","0061","274 FRONT ST",null,"CHICOPEE","MA","01013-2899",161754,null,"CITY OF CHICOPEE",391,"39114CHICOPEEPUBLICS"]
[19,null,null,null,"Clinton Public Schools","0064","242 CHURCH STREET",null,"CLINTON","MA","01510",26123,null,"TOWN OF CLINTON",391,"39114CLINTONPUBLICSC"]
[20,null,null,null,"Community Action, Inc.","1200217","145 ESSEX ST",null,"HAVERHILL","MA","01832-5528",24121,null,"COMMUNITY ACTION INC",391,"39114COMMACTAMESBURY"]
{"$rows_left_out":80}