{"text_format":"1","workbook":"xlsx","n_sheets":12,"sheets":["select","selections","LOGO","selectprg","JURCODES","Community Summary","New growth","levy limit base","GRS","Local Receipts","MRGF Calculation","Module1"],"not_rendered":{"charts":0,"images":0,"macros":1,"external_links":0,"defined_names":25,"comments":0,"pivot_tables":0},"unopened":[{"sheet":"select","index":0,"reason":"not_a_worksheet"},{"sheet":"selections","index":1,"reason":"not_a_worksheet"},{"sheet":"selectprg","index":3,"reason":"part_missing"},{"sheet":"Module1","index":11,"reason":"part_missing"}],"bounds":{"document_bytes":16777216,"sheet_cells":100000,"rows_first":2000,"rows_last":500,"rows_between":2000,"halvings":0,"cell_chars":16384,"cell_head_chars":4096},"cells_cut":0,"cells_raw":0,"read":"whole","date_system":"1900"}

{"sheet":"LOGO","index":2,"n_rows":13,"n_cols":1,"rows_kept":13,"cut":false,"hidden":false,"merged":[]}
["FY2021 Preliminary MRGF Calculation"]
[]
[]
["This file produces a detailed description of the calculation of any community's FY2021"]
["municipal revenue growth factor, which is a key component of the Chapter 70 state aid to"]
["education formula.  The growth factors contained in this workbook were used by the"]
["Department of Elementary and Secondary Education's Office of School Finance in calculating"]
["FY2021 Chapter 70 estimates."]
[]
[]
[]
["If you have any problems with this file or questions regarding the MRGF calculations, contact"]
["Local Aid at localaid@dor.state.ma.us."]

{"sheet":"JURCODES","index":4,"n_rows":353,"n_cols":4,"rows_kept":353,"cut":false,"hidden":true,"merged":[]}
["COD","JURNAME","JUR","SELECT"]
[1,"ABINGTON            ",null,1]
[2,"ACTON               "]
[3,"ACUSHNET            "]
[4,"ADAMS               "]
[5,"AGAWAM              "]
[6,"ALFORD              "]
[7,"AMESBURY            "]
[8,"AMHERST             "]
[9,"ANDOVER             "]
[10,"ARLINGTON           "]
[11,"ASHBURNHAM          "]
[12,"ASHBY               "]
[13,"ASHFIELD            "]
[14,"ASHLAND             "]
[15,"ATHOL               "]
[16,"ATTLEBORO           "]
[17,"AUBURN              "]
[18,"AVON                "]
[19,"AYER                "]
[20,"BARNSTABLE          "]
[21,"BARRE               "]
[22,"BECKET              "]
[23,"BEDFORD             "]
[24,"BELCHERTOWN         "]
[25,"BELLINGHAM          "]
[26,"BELMONT             "]
[27,"BERKLEY             "]
[28,"BERLIN              "]
[29,"BERNARDSTON         "]
[30,"BEVERLY             "]
[31,"BILLERICA           "]
[32,"BLACKSTONE          "]
[33,"BLANDFORD           "]
[34,"BOLTON              "]
[35,"BOSTON              "]
[36,"BOURNE              "]
[37,"BOXBOROUGH          "]
[38,"BOXFORD             "]
[39,"BOYLSTON            "]
[40,"BRAINTREE           "]
[41,"BREWSTER            "]
[42,"BRIDGEWATER         "]
[43,"BRIMFIELD           "]
[44,"BROCKTON            "]
[45,"BROOKFIELD          "]
[46,"BROOKLINE           "]
[47,"BUCKLAND            "]
[48,"BURLINGTON          "]
[49,"CAMBRIDGE           "]
[50,"CANTON              "]
[51,"CARLISLE            "]
[52,"CARVER              "]
[53,"CHARLEMONT          "]
[54,"CHARLTON            "]
[55,"CHATHAM             "]
[56,"CHELMSFORD          "]
[57,"CHELSEA             "]
[58,"CHESHIRE            "]
[59,"CHESTER             "]
[60,"CHESTERFIELD        "]
[61,"CHICOPEE            "]
[62,"CHILMARK            "]
[63,"CLARKSBURG          "]
[64,"CLINTON             "]
[65,"COHASSET            "]
[66,"COLRAIN             "]
[67,"CONCORD             "]
[68,"CONWAY              "]
[69,"CUMMINGTON          "]
[70,"DALTON              "]
[71,"DANVERS             "]
[72,"DARTMOUTH           "]
[73,"DEDHAM              "]
[74,"DEERFIELD           "]
[75,"DENNIS              "]
[76,"DIGHTON             "]
[77,"DOUGLAS             "]
[78,"DOVER               "]
[79,"DRACUT              "]
[80,"DUDLEY              "]
[81,"DUNSTABLE           "]
[82,"DUXBURY             "]
[83,"EAST BRIDGEWATER    "]
[84,"EAST BROOKFIELD     "]
[85,"EAST LONGMEADOW     "]
[86,"EASTHAM             "]
[87,"EASTHAMPTON         "]
[88,"EASTON              "]
[89,"EDGARTOWN           "]
[90,"EGREMONT            "]
[91,"ERVING              "]
[92,"ESSEX               "]
[93,"EVERETT             "]
[94,"FAIRHAVEN           "]
[95,"FALL RIVER          "]
[96,"FALMOUTH            "]
[97,"FITCHBURG           "]
[98,"FLORIDA             "]
[99,"FOXBOROUGH          "]
[100,"FRAMINGHAM          "]
[101,"FRANKLIN            "]
[102,"FREETOWN            "]
[103,"GARDNER             "]
[104,"GAY HEAD            "]
[105,"GEORGETOWN          "]
[106,"GILL                "]
[107,"GLOUCESTER          "]
[108,"GOSHEN              "]
[109,"GOSNOLD             "]
[110,"GRAFTON             "]
[111,"GRANBY              "]
[112,"GRANVILLE           "]
[113,"GREAT BARRINGTON    "]
[114,"GREENFIELD          "]
[115,"GROTON              "]
[116,"GROVELAND           "]
[117,"HADLEY              "]
[118,"HALIFAX             "]
[119,"HAMILTON            "]
[120,"HAMPDEN             "]
[121,"HANCOCK             "]
[122,"HANOVER             "]
[123,"HANSON              "]
[124,"HARDWICK            "]
[125,"HARVARD             "]
[126,"HARWICH             "]
[127,"HATFIELD            "]
[128,"HAVERHILL           "]
[129,"HAWLEY              "]
[130,"HEATH               "]
[131,"HINGHAM             "]
[132,"HINSDALE            "]
[133,"HOLBROOK            "]
[134,"HOLDEN              "]
[135,"HOLLAND             "]
[136,"HOLLISTON           "]
[137,"HOLYOKE             "]
[138,"HOPEDALE            "]
[139,"HOPKINTON           "]
[140,"HUBBARDSTON         "]
[141,"HUDSON              "]
[142,"HULL                "]
[143,"HUNTINGTON          "]
[144,"IPSWICH             "]
[145,"KINGSTON            "]
[146,"LAKEVILLE           "]
[147,"LANCASTER           "]
[148,"LANESBOROUGH        "]
[149,"LAWRENCE            "]
[150,"LEE                 "]
[151,"LEICESTER           "]
[152,"LENOX               "]
[153,"LEOMINSTER          "]
[154,"LEVERETT            "]
[155,"LEXINGTON           "]
[156,"LEYDEN              "]
[157,"LINCOLN             "]
[158,"LITTLETON           "]
[159,"LONGMEADOW          "]
[160,"LOWELL              "]
[161,"LUDLOW              "]
[162,"LUNENBURG           "]
[163,"LYNN                "]
[164,"LYNNFIELD           "]
[165,"MALDEN              "]
[166,"MANCHESTER          "]
[167,"MANSFIELD           "]
[168,"MARBLEHEAD          "]
[169,"MARION              "]
[170,"MARLBOROUGH         "]
[171,"MARSHFIELD          "]
[172,"MASHPEE             "]
[173,"MATTAPOISETT        "]
[174,"MAYNARD             "]
[175,"MEDFIELD            "]
[176,"MEDFORD             "]
[177,"MEDWAY              "]
[178,"MELROSE             "]
[179,"MENDON              "]
[180,"MERRIMAC            "]
[181,"METHUEN             "]
[182,"MIDDLEBOROUGH       "]
[183,"MIDDLEFIELD         "]
[184,"MIDDLETON           "]
[185,"MILFORD             "]
[186,"MILLBURY            "]
[187,"MILLIS              "]
[188,"MILLVILLE           "]
[189,"MILTON              "]
[190,"MONROE              "]
[191,"MONSON              "]
[192,"MONTAGUE            "]
[193,"MONTEREY            "]
[194,"MONTGOMERY          "]
[195,"MOUNT WASHINGTON    "]
[196,"NAHANT              "]
[197,"NANTUCKET           "]
[198,"NATICK              "]
[199,"NEEDHAM             "]
[200,"NEW ASHFORD         "]
[201,"NEW BEDFORD         "]
[202,"NEW BRAINTREE       "]
[203,"NEW MARLBOROUGH     "]
[204,"NEW SALEM           "]
[205,"NEWBURY             "]
[206,"NEWBURYPORT         "]
[207,"NEWTON              "]
[208,"NORFOLK             "]
[209,"NORTH ADAMS         "]
[210,"NORTH ANDOVER       "]
[211,"NORTH ATTLEBOROUGH  "]
[212,"NORTH BROOKFIELD    "]
[213,"NORTH READING       "]
[214,"NORTHAMPTON         "]
[215,"NORTHBOROUGH        "]
[216,"NORTHBRIDGE         "]
[217,"NORTHFIELD          "]
[218,"NORTON              "]
[219,"NORWELL             "]
[220,"NORWOOD             "]
[221,"OAK BLUFFS          "]
[222,"OAKHAM              "]
[223,"ORANGE              "]
[224,"ORLEANS             "]
[225,"OTIS                "]
[226,"OXFORD              "]
[227,"PALMER              "]
[228,"PAXTON              "]
[229,"PEABODY             "]
[230,"PELHAM              "]
[231,"PEMBROKE            "]
[232,"PEPPERELL           "]
[233,"PERU                "]
[234,"PETERSHAM           "]
[235,"PHILLIPSTON         "]
[236,"PITTSFIELD          "]
[237,"PLAINFIELD          "]
[238,"PLAINVILLE          "]
[239,"PLYMOUTH            "]
[240,"PLYMPTON            "]
[241,"PRINCETON           "]
[242,"PROVINCETOWN        "]
[243,"QUINCY              "]
[244,"RANDOLPH            "]
[245,"RAYNHAM             "]
[246,"READING             "]
[247,"REHOBOTH            "]
[248,"REVERE              "]
[249,"RICHMOND            "]
[250,"ROCHESTER           "]
[251,"ROCKLAND            "]
[252,"ROCKPORT            "]
[253,"ROWE                "]
[254,"ROWLEY              "]
[255,"ROYALSTON           "]
[256,"RUSSELL             "]
[257,"RUTLAND             "]
[258,"SALEM               "]
[259,"SALISBURY           "]
[260,"SANDISFIELD         "]
[261,"SANDWICH            "]
[262,"SAUGUS              "]
[263,"SAVOY               "]
[264,"SCITUATE            "]
[265,"SEEKONK             "]
[266,"SHARON              "]
[267,"SHEFFIELD           "]
[268,"SHELBURNE           "]
[269,"SHERBORN            "]
[270,"SHIRLEY             "]
[271,"SHREWSBURY          "]
[272,"SHUTESBURY          "]
[273,"SOMERSET            "]
[274,"SOMERVILLE          "]
[275,"SOUTH HADLEY        "]
[276,"SOUTHAMPTON         "]
[277,"SOUTHBOROUGH        "]
[278,"SOUTHBRIDGE         "]
[279,"SOUTHWICK           "]
[280,"SPENCER             "]
[281,"SPRINGFIELD         "]
[282,"STERLING            "]
[283,"STOCKBRIDGE         "]
[284,"STONEHAM            "]
[285,"STOUGHTON           "]
[286,"STOW                "]
[287,"STURBRIDGE          "]
[288,"SUDBURY             "]
[289,"SUNDERLAND          "]
[290,"SUTTON              "]
[291,"SWAMPSCOTT          "]
[292,"SWANSEA             "]
[293,"TAUNTON             "]
[294,"TEMPLETON           "]
[295,"TEWKSBURY           "]
[296,"TISBURY             "]
[297,"TOLLAND             "]
[298,"TOPSFIELD           "]
[299,"TOWNSEND            "]
[300,"TRURO               "]
[301,"TYNGSBOROUGH        "]
[302,"TYRINGHAM           "]
[303,"UPTON               "]
[304,"UXBRIDGE            "]
[305,"WAKEFIELD           "]
[306,"WALES               "]
[307,"WALPOLE             "]
[308,"WALTHAM             "]
[309,"WARE                "]
[310,"WAREHAM             "]
[311,"WARREN              "]
[312,"WARWICK             "]
[313,"WASHINGTON          "]
[314,"WATERTOWN           "]
[315,"WAYLAND             "]
[316,"WEBSTER             "]
[317,"WELLESLEY           "]
[318,"WELLFLEET           "]
[319,"WENDELL             "]
[320,"WENHAM              "]
[321,"WEST BOYLSTON       "]
[322,"WEST BRIDGEWATER    "]
[323,"WEST BROOKFIELD     "]
[324,"WEST NEWBURY        "]
[325,"WEST SPRINGFIELD    "]
[326,"WEST STOCKBRIDGE    "]
[327,"WEST TISBURY        "]
[328,"WESTBOROUGH         "]
[329,"WESTFIELD           "]
[330,"WESTFORD            "]
[331,"WESTHAMPTON         "]
[332,"WESTMINSTER         "]
[333,"WESTON              "]
[334,"WESTPORT            "]
[335,"WESTWOOD            "]
[336,"WEYMOUTH            "]
[337,"WHATELY             "]
[338,"WHITMAN             "]
[339,"WILBRAHAM           "]
[340,"WILLIAMSBURG        "]
[341,"WILLIAMSTOWN        "]
[342,"WILMINGTON          "]
[343,"WINCHENDON          "]
[344,"WINCHESTER          "]
[345,"WINDSOR             "]
[346,"WINTHROP            "]
[347,"WOBURN              "]
[348,"WORCESTER           "]
[349,"WORTHINGTON         "]
[350,"WRENTHAM            "]
[351,"YARMOUTH"]
[366]

{"sheet":"Community Summary","index":5,"n_rows":56,"n_cols":14,"rows_kept":56,"cut":false,"hidden":false,"merged":[]}
[" ","Massachusetts Department of Revenue"]
[null,"Division of Local Services"]
[null,"Preliminary Municipal Revenue Growth Factor (MRGF) Calculation, FY2021"]
[null,{"$f":"VLOOKUP(SELECT,jurcodes,2)","v":"ABINGTON            "}]
[]
[null,null,null,null,null,null,null,null,null,null,null,"Fiscal Year",null,"Fiscal Year"]
[null,null,null,null,null,null,null,null,null,null,null,2020,null,2021]
["1.","LEVY LIMIT BASE",null,null,null,null,"AMOUNT",null,null,"3.","CHANGE IN REVENUE SHARING","Cherry Sheet",null,"Estimates"]
[]
[null,{"$f":"IF(VLOOKUP(SELECT,levybase,9)>0,\"FY2020 Levy Limit Prior to Exclusions\",\"FY2019 Levy Limit Prior to Exclusions\")","v":"FY2020 Levy Limit Prior to Exclusions"},null,null,null,null,{"$f":"IF(VLOOKUP(SELECT,levybase,9)>0,VLOOKUP(SELECT,levybase,9),VLOOKUP(SELECT,levybase,3))","v":33620233}]
[null,{"$f":"IF(VLOOKUP(SELECT,levybase,9)>0,\"Impact of FY1994-FY2020 Overrides on FY2020 Limit\",\"Impact of FY1994-FY2019 Overrides on FY2019 Limit\")","v":"Impact of FY1994-FY2020 Overrides on FY2020 Limit"},null,null,null,null,{"$f":"IF(VLOOKUP(SELECT,levybase,9)>0,VLOOKUP(SELECT,levybase,11),VLOOKUP(SELECT,levybase,6))","v":832054}]
[null,{"$f":"IF(VLOOKUP(SELECT,levybase,9)>0,\"FY2020 Limit Adjusted for Overrides\",\"FY2019 Limit Adjusted for Overrides\")","v":"FY2020 Limit Adjusted for Overrides"},null,null,null,null,{"$f":"IF(VLOOKUP(SELECT,levybase,9)>0,VLOOKUP(SELECT,levybase,12),VLOOKUP(SELECT,levybase,7))","v":32788179},null,null,null,"Unrestricted General Government Aid",{"$f":"VLOOKUP(SELECT,GRS,3)","v":2088894},null,{"$f":"VLOOKUP(SELECT,GRS,8)","v":2147383}]
[null,{"$f":"IF(VLOOKUP(SELECT,levybase,9)>0,\"\",\"Estimated FY2013 Limit = FY2012*1.025 plus\")","v":""},null,null,null,null,null,null,null,null,"State Owned Land",{"$f":"VLOOKUP(SELECT,GRS,4)","v":138184},null,{"$f":"VLOOKUP(SELECT,GRS,9)","v":138184}]
[null,{"$f":"IF(VLOOKUP(SELECT,levybase,9)>0,\"\",\"New growth percentage (part 2) * adjusted 2012 Limit\")","v":""},null,null,null,null,{"$f":"IF(VLOOKUP(SELECT,levybase,9)>0,\"\",VLOOKUP(SELECT,levybase,8))","v":""},null,null,null,"TOTAL",{"$f":"VLOOKUP(SELECT,GRS,5)","v":2227078},null,{"$f":"VLOOKUP(SELECT,GRS,10)","v":2285567}]
[]
[null,null,null,null,null,null,null,null,null,null,null,{"$f":"CONCATENATE(\"FY\",TEXT(VLOOKUP(SELECT,LOCR,2),0))","v":"FY2019"},null,{"$f":"CONCATENATE(\"FY\",TEXT(VLOOKUP(SELECT,LOCR,12),0))","v":"FY2020"}]
["2.","INCREASE IN LEVY LIMIT GROWTH DUE TO NEW GROWTH",null,null,null,null,null,null,null,"4.","RECURRING LOCAL RECEIPTS","Budget",null,"Budget"]
[null,null,"Levy Limit",null,null,"New ","Percentage"]
[null,null,"Without",null,"Certified","Growth","of Previous ",null,null,null,"Motor Vehicle Excise",{"$f":"VLOOKUP(SELECT,LOCR,3)","v":2104723},null,{"$f":"VLOOKUP(SELECT,LOCR,13)","v":2531824}]
[null,"Fiscal","Exclusions,","CH","New","Adjusted","Year's",null,null,null,"Other Excise",{"$f":"VLOOKUP(SELECT,LOCR,4)","v":285000},null,{"$f":"VLOOKUP(SELECT,LOCR,14)","v":340000}]
[null,"Year","Overides",653,"Growth","for 653","Limit",null,null,null,"Penalties and Interest",{"$f":"VLOOKUP(SELECT,LOCR,5)","v":225000},null,{"$f":"VLOOKUP(SELECT,LOCR,15)","v":250000}]
[null,null,null,null,null,null,null,null,null,null,"Payments in Lieu",{"$f":"VLOOKUP(SELECT,LOCR,6)","v":0},null,{"$f":"VLOOKUP(SELECT,LOCR,16)","v":0}]
[null,"FY2015",{"$f":"VLOOKUP(SELECT,levygrowth,3)","v":27084671},null,null,null,null,null,null,null,"Fines and Forfeits",{"$f":"VLOOKUP(SELECT,LOCR,7)","v":40000},null,{"$f":"VLOOKUP(SELECT,LOCR,17)","v":50000}]
[null,"FY2016",{"$f":"VLOOKUP(SELECT,levygrowth,4)","v":28072153},{"$f":"IF(VLOOKUP(SELECT,levygrowth,8)=2007,2007,IF(VLOOKUP(SELECT,levygrowth,9)=2007,\"2007*\",\"\"))","v":""},{"$f":"VLOOKUP(SELECT,levygrowth,12)","v":310365},{"$f":"VLOOKUP(SELECT,levygrowth,17)","v":310365},{"$f":"VLOOKUP(SELECT,levygrowth,22)","v":1.15E-2},null,null,null,"Investment Income",{"$f":"VLOOKUP(SELECT,LOCR,8)","v":65000},null,{"$f":"VLOOKUP(SELECT,LOCR,18)","v":85000}]
[null,"FY2017",{"$f":"VLOOKUP(SELECT,levygrowth,5)","v":29102181},{"$f":"IF(VLOOKUP(SELECT,levygrowth,8)=2008,2008,IF(VLOOKUP(SELECT,levygrowth,9)=2008,\"2008*\",\"\"))","v":""},{"$f":"VLOOKUP(SELECT,levygrowth,13)","v":328224},{"$f":"VLOOKUP(SELECT,levygrowth,18)","v":328224},{"$f":"VLOOKUP(SELECT,levygrowth,23)","v":1.17E-2},null,null,null,"Miscellaneous Recurring",{"$f":"VLOOKUP(SELECT,LOCR,9)","v":25000},null,{"$f":"VLOOKUP(SELECT,LOCR,19)","v":245000}]
[null,"FY2018",{"$f":"VLOOKUP(SELECT,levygrowth,6)","v":30291788},{"$f":"IF(VLOOKUP(SELECT,levygrowth,8)=2009,2009,IF(VLOOKUP(SELECT,levygrowth,9)=2009,\"2009*\",\"\"))","v":""},{"$f":"VLOOKUP(SELECT,levygrowth,14)","v":462052},{"$f":"VLOOKUP(SELECT,levygrowth,19)","v":462052},{"$f":"VLOOKUP(SELECT,levygrowth,24)","v":1.5900000000000001E-2}]
[null,"FY2019",{"$f":"VLOOKUP(SELECT,levygrowth,7)","v":31592621},{"$f":"IF(VLOOKUP(SELECT,levygrowth,8)=2010,2010,IF(VLOOKUP(SELECT,levygrowth,9)=2010,\"2010*\",\"\"))","v":""},{"$f":"VLOOKUP(SELECT,levygrowth,15)","v":543538},{"$f":"VLOOKUP(SELECT,levygrowth,20)","v":543538},{"$f":"VLOOKUP(SELECT,levygrowth,25)","v":1.7899999999999999E-2},null,null,null,"TOTAL",{"$f":"VLOOKUP(SELECT,LOCR,10)","v":2744723},null,{"$f":"VLOOKUP(SELECT,LOCR,20)","v":3501824}]
[null,"FY2020",null,{"$f":"IF(VLOOKUP(SELECT,levygrowth,8)=2011,2011,IF(VLOOKUP(SELECT,levygrowth,9)=2011,\"2011*\",\"\"))","v":""},{"$f":"VLOOKUP(SELECT,levygrowth,16)","v":405742},{"$f":"VLOOKUP(SELECT,levygrowth,21)","v":405742},{"$f":"VLOOKUP(SELECT,levygrowth,26)","v":1.2800000000000001E-2}]
[null,null,null,null,null,null,null,null,null,"5.","SUMMARY","Amount",null,"Pct Chg"]
[null,"Average of Last Three Years",null,null,null,null,{"$f":"VLOOKUP(SELECT,levygrowth,28)","v":1.55E-2}]
[null,"Lowest Three of Last Four Years",null,null,null,null,{"$f":"VLOOKUP(SELECT,levygrowth,29)","v":1.35E-2},null,null,null,"FY2020 MRGF Levy Limit",{"$f":"VLOOKUP(SELECT,MRGF,2)","v":32788179}]
[null,"Maximum, Last Three Years",null,null,null,null,{"$f":"VLOOKUP(SELECT,levygrowth,31)","v":1.7899999999999999E-2},null,null,null,"FY2020 General Revenue Sharing",{"$f":"VLOOKUP(SELECT,MRGF,4)","v":2227078}]
[null,"Average of Two Smaller Years",null,null,null,null,{"$f":"VLOOKUP(SELECT,levygrowth,32)","v":1.44E-2},null,null,null,{"$f":"CONCATENATE(\"FY\",TEXT(VLOOKUP(SELECT,LOCR,2),0),\" Budgeted Recurring Local Receipts\")","v":"FY2019 Budgeted Recurring Local Receipts"},{"$f":"VLOOKUP(SELECT,MRGF,5)","v":2744723}]
[null,"Difference, Maximum Minus 2 Yr Average",null,null,null,null,{"$f":"VLOOKUP(SELECT,levygrowth,33)","v":3.4999999999999996E-3},null,null,null,"Total Base Municipal Revenues",{"$f":"VLOOKUP(SELECT,MRGF,7)","v":37759980}]
[]
[null,"Percent Increase in New Growth for MRGF",null,null,null,null,{"$f":"VLOOKUP(SELECT,levygrowth,35)","v":1.55E-2},null,null,null,"FY2021 Estimated Levy Ceiling",{"$f":"VLOOKUP(SELECT,levybase,17)","v":52381085}]
[null,null,null,null,null,null,null,null,null,null,"FY2020 Levy Limit * 1.025",{"$f":"VLOOKUP(SELECT,MRGF,9)","v":33607883}]
[null,null,null,null,null,null,null,null,null,null,"FY2021 Estimated New Growth",{"$f":"VLOOKUP(SELECT,MRGF,10)","v":508217}]
[null,null,null,null,null,null,null,null,null,null,"FY2021 Estimated Levy Limit",{"$f":"(VLOOKUP(SELECT,MRGF,9))+(VLOOKUP(SELECT,MRGF,10))","v":34116100},null,{"$f":"VLOOKUP(SELECT,MRGF,11)","v":4.0499992390550261}]
[null,null,null,null,null,null,null,null,null,null,"FY2021 General Revenue Sharing",{"$f":"VLOOKUP(SELECT,MRGF,12)","v":2285567},null,{"$f":"VLOOKUP(SELECT,MRGF,13)","v":2.6262663454086477}]
[null,null,null,null,null,null,null,null,null,null,{"$f":"CONCATENATE(\"FY\",TEXT(VLOOKUP(SELECT,LOCR,12),0),\" Budgeted Recurring Local Receipts\")","v":"FY2020 Budgeted Recurring Local Receipts"},{"$f":"VLOOKUP(SELECT,MRGF,14)","v":3501824},null,{"$f":"VLOOKUP(SELECT,MRGF,16)","v":27.583876405742949}]
[null,null,null,null,null,null,null,null,null,null,"Total Estimated Current Municipal Revenues",{"$f":"VLOOKUP(SELECT,MRGF,17)","v":39903491}]
[]
[null,{"$f":"IF(VLOOKUP(SELECT,levygrowth,9)>94,(\"*Adopted CH 653\"),\"\")","v":"*Adopted CH 653"},null,null,null,null,null,null,null,null,"Change, Base to Current Revenues",{"$f":"VLOOKUP(SELECT,MRGF,19)","v":2143511},null,{"$f":"VLOOKUP(SELECT,MRGF,20)","v":5.6800000000000006}]
[null,{"$f":"IF(VLOOKUP(SELECT,levygrowth,10)>93,CONCATENATE(\"Rescinded CH 653 in FY\",TEXT(VLOOKUP(SELECT,levygrowth,10),0)),\"\")","v":""}]
[]
[null,null,null,null,null,null,null,null,null,null,"FY2021 Preliminary Municipal Revenue Growth Factor",null,null,{"$f":"VLOOKUP(SELECT,MRGF,20)","v":5.6800000000000006}]
[]
[]
[]
[]
[]
[]
[]
[]
[{"$f":"TODAY()","v":"2026-07-16"}]

{"sheet":"New growth","index":6,"n_rows":362,"n_cols":36,"rows_kept":362,"cut":false,"hidden":true,"merged":[]}
[null,"Calculation of Increment in Levy Limit Due to New Growth",null,null,null,null,null,null,null,null,null,null,null,null,null,null,null,null,null,null,null," "]
[]
[]
[null,null,"FY2015","FY2016","FY2017","FY2018","FY2019","FY2020",null,null,null,"New","New","New","New","New"]
[null,null,"Limit Prior","Limit Prior","Limit Prior","Limit Prior","Limit Prior","Limit Prior"," ",null,null,"Growth","Growth","Growth","Growth","Growth","Adjusted","Adjusted","Adjusted","Adjusted","Adjusted",null,null,null,null,null,null,"Average,","Lowest",null,"Maximum","Avg of","Difference,",null,"Avg Pct","Estimated"]
[null,null,"to Exclusion","to Exclusion","to Exclusion","to Exclusion","to Exclusion","to Exclusion","Ch 653","Ch 653",null,"FY2016","FY2017","FY2018","FY2019","FY2020","New","New","New","New","New","FY2016","FY2017","FY2018","FY2019","FY2020",null,"Last ","Three of",null,"Percentage,","Two","Maximum",null,"Increase","New Growth"]
["DOR",null,"Adjusted","Adjusted","Adjusted","Adjusted","Adjusted","Adjusted","Growth","Growth",null,"Unadjusted","Unadjusted","Unadjusted","Unadjusted","Unadjusted","Growth","Growth","Growth","Growth","Growth","Growth %","Growth %","Growth %","Growth %","Growth %",null,"Three","Last Four",null,"Last 3","Smaller","Minus",null,"In Limit","FY2021, Before"]
["CDE","MUNICIPALITY  ","for Overrides","for Overrides","for Overrides","for Overrides","for Overrides","for Overrides","Begun","Ended",null,"for Ch 653","for Ch 653","for Ch 653","for Ch 653","for Ch 653","FY2016","FY2017","FY2018","FY2019","FY2020","Of PY Limit","Of PY Limit","Of PY Limit","Of PY Limit","Of PY Limit",null,"Years","Years",null,"Years","Years","2 Yr Avg",null,"From Growth","Ceiling Check"]
[]
[1,"ABINGTON      ",27084671,28072153,29102181,30291788,31592621,32788179,2005,0,null,310365,328224,462052,543538,405742,310365,328224,462052,543538,405742,1.15E-2,1.17E-2,1.5900000000000001E-2,1.7899999999999999E-2,1.2800000000000001E-2,null,1.55E-2,1.35E-2,null,1.7899999999999999E-2,1.44E-2,3.4999999999999996E-3,null,1.55E-2,508217]
[2,"ACTON         ",64051305,67059833,69908788,72522973,74990655,77655148,1991,0,null,1407246,1172459,866466,654608,789726,1407246,1172459,866466,654608,789726,2.1999999999999999E-2,1.7500000000000002E-2,1.24E-2,8.9999999999999993E-3,1.0500000000000001E-2,null,1.06E-2,1.06E-2,null,1.24E-2,9.7999999999999997E-3,2.5999999999999999E-3,null,1.06E-2,823145]
[3,"ACUSHNET      ",14748893,15350126,15936384,16601843,17237500,18027438,0,0,null,232511,202505,267049,220611,359000,232511,202505,267049,220611,359000,1.5800000000000002E-2,1.32E-2,1.6799999999999999E-2,1.3299999999999999E-2,2.0799999999999999E-2,null,1.7000000000000001E-2,1.44E-2,null,2.0799999999999999E-2,1.5100000000000001E-2,5.6999999999999985E-3,null,1.7000000000000001E-2,306466]
[4,"ADAMS         ",9812474,10226727,10578747,10984702,11356251,11708307,1991,0,null,145991,96352,141486,96931,68150,145991,96352,141486,96931,68150,1.49E-2,9.4000000000000004E-3,1.34E-2,8.8000000000000005E-3,6.0000000000000001E-3,null,9.4000000000000004E-3,8.0999999999999996E-3,null,1.34E-2,7.4000000000000003E-3,6.0000000000000001E-3,null,9.4000000000000004E-3,110058]
[5,"AGAWAM        ",63784154,65929345,68211393,70533487,73038831,76081914,1991,0,null,550587,608127,616809,668159,1217112,550587,608127,616809,668159,1217112,8.6E-3,9.1999999999999998E-3,8.9999999999999993E-3,9.4999999999999998E-3,1.67E-2,null,1.17E-2,9.1999999999999998E-3,null,1.67E-2,9.2999999999999992E-3,7.4000000000000003E-3,null,1.17E-2,890158]
[6,"ALFORD        ",1446267,1493722,1539276,1593842,1641470,1689068,0,0,null,11298,8211,16084,7782,6561,11298,8211,16084,7782,6561,7.7999999999999996E-3,5.4999999999999997E-3,1.04E-2,4.8999999999999998E-3,4.0000000000000001E-3,null,6.4000000000000003E-3,4.7999999999999996E-3,null,1.04E-2,4.4999999999999997E-3,5.8999999999999999E-3,null,6.4000000000000003E-3,10810]
[7,"AMESBURY      ",39136754,40582205,42109486,44116384,45766634,47359518,1991,0,null,467032,512726,954161,547340,448718,467032,512726,954161,547340,448718,1.1900000000000001E-2,1.26E-2,2.2700000000000001E-2,1.24E-2,9.7999999999999997E-3,null,1.4999999999999999E-2,1.1599999999999999E-2,null,2.2700000000000001E-2,1.11E-2,1.1600000000000001E-2,null,1.4999999999999999E-2,710393]
[8,"AMHERST       ",40521111,42158770,44225013,46061571,48033096,50089984,1991,0,null,624631,1012274,730933,819985,856060,624631,1012274,730933,819985,856060,1.54E-2,2.4E-2,1.6500000000000001E-2,1.78E-2,1.78E-2,null,1.7399999999999999E-2,1.7399999999999999E-2,null,1.78E-2,1.72E-2,5.9999999999999984E-4,null,1.7399999999999999E-2,871566]
[9,"ANDOVER       ",119797140,124996152,130709372,136417582,142600951,150531622,1991,0,null,2204083,2588316,2440476,2772929,4365647,2204083,2588316,2440476,2772929,4365647,1.84E-2,2.07E-2,1.8700000000000001E-2,2.0299999999999999E-2,3.0599999999999999E-2,null,2.3199999999999998E-2,1.9900000000000001E-2,null,3.0599999999999999E-2,1.95E-2,1.1099999999999999E-2,null,2.3199999999999998E-2,3492334]
[10,"ARLINGTON     ",84488187,87938058,91206653,94750632,98100604,106869736,1991,0,null,1337666,1070144,1263812,981206,816617,1337666,1070144,1263812,981206,816617,1.5800000000000002E-2,1.2200000000000001E-2,1.3899999999999999E-2,1.04E-2,8.3000000000000001E-3,null,1.09E-2,1.03E-2,null,1.3899999999999999E-2,9.4000000000000004E-3,4.4999999999999988E-3,null,1.09E-2,1164880]
[11,"ASHBURNHAM    ",8219690,8509098,8829961,9194733,9611263,9501460,2004,0,null,83916,108135,144023,186661,125572,83916,108135,144023,186661,125572,1.0200000000000001E-2,1.2699999999999999E-2,1.6299999999999999E-2,2.0299999999999999E-2,1.3100000000000001E-2,null,1.66E-2,1.4E-2,null,2.0299999999999999E-2,1.47E-2,5.5999999999999991E-3,null,1.66E-2,157724]
[12,"ASHBY         ",4975879,5131184,5291932,5470698,5668740,5884703,1991,0,null,30908,32468,46467,61274,74245,30908,32468,46467,61274,74245,6.1999999999999998E-3,6.3E-3,8.8000000000000005E-3,1.12E-2,1.3100000000000001E-2,null,1.0999999999999999E-2,8.8000000000000005E-3,null,1.3100000000000001E-2,0.01,3.1000000000000003E-3,null,1.0999999999999999E-2,64732]
[13,"ASHFIELD      ",3239947,3356836,3530903,3675687,3793195,3938120,0,0,null,35890,90146,56511,25616,50095,35890,90146,56511,25616,50095,1.11E-2,2.69E-2,1.6E-2,7.0000000000000001E-3,1.32E-2,null,1.21E-2,1.21E-2,null,1.6E-2,1.01E-2,5.9000000000000007E-3,null,1.21E-2,47651]
[14,"ASHLAND       ",36554361,38227209,39960022,42081316,44426174,46224897,0,0,null,758989,777133,1122293,1292825,688069,758989,777133,1122293,1292825,688069,2.0799999999999999E-2,2.0299999999999999E-2,2.81E-2,3.0700000000000002E-2,1.55E-2,null,2.4799999999999999E-2,2.1299999999999999E-2,null,3.0700000000000002E-2,2.18E-2,8.9000000000000017E-3,null,2.4799999999999999E-2,1146377]
[15,"ATHOL         ",9366583,9707230,10118920,10496033,11120241,11659210,2004,0,null,106483,169009,124140,361807,260963,106483,169009,124140,361807,260963,1.14E-2,1.7399999999999999E-2,1.23E-2,3.4500000000000003E-2,2.35E-2,null,2.3400000000000001E-2,1.77E-2,null,3.4500000000000003E-2,1.7899999999999999E-2,1.6600000000000004E-2,null,2.3400000000000001E-2,272826]
[16,"ATTLEBORO     ",62607068,64673256,67582586,70764061,73464173,76079548,2003,0,null,501011,1292499,1491910,931010,778771,501011,1292499,1491910,931010,778771,8.0000000000000002E-3,0.02,2.2100000000000002E-2,1.32E-2,1.06E-2,null,1.5299999999999999E-2,1.46E-2,null,2.2100000000000002E-2,1.1900000000000001E-2,1.0200000000000001E-2,null,1.5299999999999999E-2,1164017]
[17,"AUBURN        ",35318833,37066462,38860391,40442045,42109861,44093695,2013,0,null,864659,867267,610144,656765,931088,864659,867267,610144,656765,931088,2.4500000000000001E-2,2.3400000000000001E-2,1.5699999999999999E-2,1.6199999999999999E-2,2.2100000000000002E-2,null,1.7999999999999999E-2,1.7999999999999999E-2,null,2.2100000000000002E-2,1.6E-2,6.1000000000000013E-3,null,1.7999999999999999E-2,793687]
[18,"AVON          ",15511476,16156706,16989291,17874039,18708734,19542594,2013,0,null,257443,428667,460016,360022,366141,257443,428667,460016,360022,366141,1.66E-2,2.6499999999999999E-2,2.7099999999999999E-2,2.01E-2,1.9599999999999999E-2,null,2.23E-2,2.2100000000000002E-2,null,2.7099999999999999E-2,1.9900000000000001E-2,7.1999999999999981E-3,null,2.23E-2,435800]
[19,"AYER          ",18635179,19547769,20562898,22037327,23328753,24559228,1992,0,null,446710,526435,960356,740493,647256,446710,526435,960356,740493,647256,2.4E-2,2.69E-2,4.6699999999999998E-2,3.3599999999999998E-2,2.7699999999999999E-2,null,3.5999999999999997E-2,2.9399999999999999E-2,null,4.6699999999999998E-2,3.0700000000000002E-2,1.5999999999999997E-2,null,3.5999999999999997E-2,884132]
[20,"BARNSTABLE    ",104892708,108645163,112771807,116900171,121259225,125537222,2008,0,null,1130137,1410515,1309069,1436550,1246516,1130137,1410515,1309069,1436550,1246516,1.0800000000000001E-2,1.2999999999999999E-2,1.1599999999999999E-2,1.23E-2,1.03E-2,null,1.14E-2,1.14E-2,null,1.23E-2,1.0999999999999999E-2,1.3000000000000008E-3,null,1.14E-2,1431124]
[21,"BARRE         ",6754811,7191587,7457332,7805228,8087275,8401060,0,0,null,266427,85955,161463,86916,107090,266427,85955,161463,86916,107090,3.9399999999999998E-2,1.2E-2,2.1700000000000001E-2,1.11E-2,1.32E-2,null,1.5299999999999999E-2,1.21E-2,null,2.1700000000000001E-2,1.2200000000000001E-2,9.4999999999999998E-3,null,1.5299999999999999E-2,128536]
[22,"BECKET        ",4816180,4980022,5143432,5326608,5504297,5753200,0,0,null,43437,38909,54590,44523,77822,43437,38909,54590,44523,77822,8.9999999999999993E-3,7.7999999999999996E-3,1.06E-2,8.3999999999999995E-3,1.41E-2,null,1.0999999999999999E-2,8.8999999999999999E-3,null,1.41E-2,9.4999999999999998E-3,4.5999999999999999E-3,null,1.0999999999999999E-2,63285]
[23,"BEDFORD       ",56898024,59955561,63165951,66660425,69820484,72855273,1992,0,null,1621513,1647420,1915325,1493548,1289277,1621513,1647420,1915325,1493548,1289277,2.8500000000000001E-2,2.75E-2,3.0300000000000001E-2,2.24E-2,1.8499999999999999E-2,null,2.3699999999999999E-2,2.2800000000000001E-2,null,3.0300000000000001E-2,2.0500000000000001E-2,9.7999999999999997E-3,null,2.3699999999999999E-2,1726670]
[24,"BELCHERTOWN   ",23301205,24227554,25210235,26333465,27507359,28624718,2000,0,null,343819,376992,491348,515557,429675,343819,376992,491348,515557,429675,1.4800000000000001E-2,1.5599999999999999E-2,1.95E-2,1.9599999999999999E-2,1.5599999999999999E-2,null,1.8200000000000001E-2,1.6899999999999998E-2,null,1.9599999999999999E-2,1.7600000000000001E-2,1.9999999999999983E-3,null,1.8200000000000001E-2,520970]
[25,"BELLINGHAM    ",33703797,35170174,36672859,37954471,39837833,41820156,1995,0,null,623782,623431,364791,934500,986377,623782,623431,364791,934500,986377,1.8499999999999999E-2,1.77E-2,9.9000000000000008E-3,2.46E-2,2.4799999999999999E-2,null,1.9800000000000002E-2,1.7399999999999999E-2,null,2.4799999999999999E-2,1.7299999999999999E-2,7.4999999999999997E-3,null,1.9800000000000002E-2,828039]
[26,"BELMONT       ",65139389,67382653,69855490,73622285,76474758,79495329,0,0,null,614779,788271,2020408,1011916,1108702,614779,788271,2020408,1011916,1108702,9.4000000000000004E-3,1.17E-2,2.8899999999999999E-2,1.37E-2,1.4500000000000001E-2,null,1.9E-2,1.3299999999999999E-2,null,2.8899999999999999E-2,1.41E-2,1.4799999999999999E-2,null,1.9E-2,1510411]
[27,"BERKLEY       ",7236905,7492359,7812378,8151165,8536059,8929537,1992,0,null,74532,132710,143478,181115,180077,74532,132710,143478,181115,180077,1.03E-2,1.77E-2,1.84E-2,2.2200000000000001E-2,2.1100000000000001E-2,null,2.06E-2,1.9099999999999999E-2,null,2.2200000000000001E-2,1.9800000000000002E-2,2.3999999999999994E-3,null,2.06E-2,183948]
[28,"BERLIN        ",9156459,9914649,10358256,11013907,11548875,12051641,1993,0,null,529278,195741,396695,259621,214044,529278,195741,396695,259621,214044,5.7799999999999997E-2,1.9699999999999999E-2,3.8300000000000001E-2,2.3599999999999999E-2,1.8499999999999999E-2,null,2.6800000000000001E-2,2.06E-2,null,3.8300000000000001E-2,2.1100000000000001E-2,1.72E-2,null,2.6800000000000001E-2,322984]
[29,"BERNARDSTON   ",3774155,3950186,4081615,4202185,4355366,4570462,0,0,null,81677,32674,18530,48126,106212,81677,32674,18530,48126,106212,2.1600000000000001E-2,8.3000000000000001E-3,4.4999999999999997E-3,1.15E-2,2.4400000000000002E-2,null,1.35E-2,8.0999999999999996E-3,null,2.4400000000000002E-2,8.0000000000000002E-3,1.6400000000000001E-2,null,1.35E-2,61701]
[30,"BEVERLY       ",88212708,91261034,94850290,99407098,103596037,108035190,1991,0,null,843008,1307730,2185551,1703762,1849252,843008,1307730,2185551,1703762,1849252,9.5999999999999992E-3,1.43E-2,2.3E-2,1.7100000000000001E-2,1.7899999999999999E-2,null,1.9300000000000001E-2,1.6400000000000001E-2,null,2.3E-2,1.7500000000000002E-2,5.4999999999999979E-3,null,1.9300000000000001E-2,2085079]
[31,"BILLERICA     ",111794698,117139310,123003679,128919297,134931118,141531357,0,0,null,2523591,2606525,2811618,2502528,3226961,2523591,2606525,2811618,2502528,3226961,2.2599999999999999E-2,2.23E-2,2.29E-2,1.9400000000000001E-2,2.3900000000000001E-2,null,2.2100000000000002E-2,2.1499999999999998E-2,null,2.3900000000000001E-2,2.12E-2,2.700000000000001E-3,null,2.2100000000000002E-2,3127843]
[32,"BLACKSTONE    ",15939467,16530730,17202444,17959202,18738701,19444909,1991,0,null,192776,258446,326493,330519,237740,192776,258446,326493,330519,237740,1.21E-2,1.5599999999999999E-2,1.9E-2,1.84E-2,1.2699999999999999E-2,null,1.67E-2,1.5599999999999999E-2,null,1.9E-2,1.5599999999999999E-2,3.4000000000000002E-3,null,1.67E-2,324730]
[33,"BLANDFORD     ",2088296,2262733,2337974,2428306,2521152,2631588,0,0,null,122230,18673,31883,32139,47407,122230,18673,31883,32139,47407,5.8500000000000003E-2,8.3000000000000001E-3,1.3599999999999999E-2,1.32E-2,1.8800000000000001E-2,null,1.52E-2,1.17E-2,null,1.8800000000000001E-2,1.34E-2,5.4000000000000003E-3,null,1.52E-2,40000]
[34,"BOLTON        ",16240669,16845985,17565139,18382898,19148000,19992283,1991,0,null,199299,298005,378630,305529,365583,199299,298005,378630,305529,365583,1.23E-2,1.77E-2,2.1600000000000001E-2,1.66E-2,1.9099999999999999E-2,null,1.9099999999999999E-2,1.78E-2,null,2.1600000000000001E-2,1.7899999999999999E-2,3.7000000000000019E-3,null,1.9099999999999999E-2,381853]
[35,"BOSTON        ",1867957148,1962273860,2086846743,2216600850,2350783055,2509114748,0,0,null,47539508,74737096,76567353,77309352,98717191,47539508,74737096,76567353,77309352,98717191,2.5399999999999999E-2,3.8100000000000002E-2,3.6700000000000003E-2,3.49E-2,4.2000000000000003E-2,null,3.7900000000000003E-2,3.6600000000000001E-2,null,4.2000000000000003E-2,3.5799999999999998E-2,6.2000000000000041E-3,null,3.7900000000000003E-2,95095449]
[36,"BOURNE        ",37761009,39356518,40996131,42592137,44258927,45900739,2004,0,null,651484,650787,571102,601987,522773,651484,650787,571102,601987,522773,1.7299999999999999E-2,1.6500000000000001E-2,1.3899999999999999E-2,1.41E-2,1.18E-2,null,1.3299999999999999E-2,1.3299999999999999E-2,null,1.41E-2,1.29E-2,1.1999999999999997E-3,null,1.3299999999999999E-2,610480]
[37,"BOXBOROUGH    ",16574256,17188009,17875541,18974646,19840525,20576812,2000,0,null,199397,257831,652217,390015,240274,199397,257831,652217,390015,240274,1.2E-2,1.4999999999999999E-2,3.6499999999999998E-2,2.06E-2,1.21E-2,null,2.3099999999999999E-2,1.5900000000000001E-2,null,3.6499999999999998E-2,1.6400000000000001E-2,2.0099999999999996E-2,null,1.5900000000000001E-2,327171]
[38,"BOXFORD       ",20808077,21502898,22243994,23065137,23869311,24460487,1999,0,null,174619,203524,254879,227546,191761,174619,203524,254879,227546,191761,8.3999999999999995E-3,9.4999999999999998E-3,1.15E-2,9.9000000000000008E-3,8.0000000000000002E-3,null,9.7999999999999997E-3,9.1000000000000004E-3,null,1.15E-2,8.9999999999999993E-3,2.5000000000000005E-3,null,9.7999999999999997E-3,239713]
[39,"BOYLSTON      ",9332378,9814229,10267246,10822245,12000542,12718273,0,0,null,248541,207661,298317,907741,417718,248541,207661,298317,907741,417718,2.6599999999999999E-2,2.12E-2,2.9100000000000001E-2,8.3900000000000002E-2,3.4799999999999998E-2,null,4.9299999999999997E-2,2.8400000000000002E-2,null,8.3900000000000002E-2,3.2000000000000001E-2,5.1900000000000002E-2,null,2.8400000000000002E-2,361199]
[40,"BRAINTREE     ",80058826,82954706,86299839,89528431,92686291,96036025,2006,0,null,894409,1271265,1071096,919649,1032577,894409,1271265,1071096,919649,1032577,1.12E-2,1.5299999999999999E-2,1.24E-2,1.03E-2,1.11E-2,null,1.1299999999999999E-2,1.1299999999999999E-2,null,1.24E-2,1.0699999999999999E-2,1.7000000000000001E-3,null,1.1299999999999999E-2,1085207]
[41,"BREWSTER      ",24042906,24847621,25828023,26792809,27817378,29129227,0,0,null,203642,359212,319085,354749,309571,203642,359212,319085,354749,309571,8.5000000000000006E-3,1.4500000000000001E-2,1.24E-2,1.32E-2,1.11E-2,null,1.2200000000000001E-2,1.2200000000000001E-2,null,1.32E-2,1.18E-2,1.4000000000000002E-3,null,1.2200000000000001E-2,355377]
[42,"BRIDGEWATER   ",32361229,33912904,35666350,37341250,39152303,40927756,0,0,null,741118,905623,778434,872356,791546,741118,905623,778434,872356,791546,2.29E-2,2.6700000000000002E-2,2.18E-2,2.3400000000000001E-2,2.0199999999999999E-2,null,2.18E-2,2.18E-2,null,2.3400000000000001E-2,2.1000000000000001E-2,2.3999999999999994E-3,null,2.18E-2,892225]
[43,"BRIMFIELD     ",6485219,6730522,6992071,7237714,7485472,7716005,1991,0,null,83173,93286,70841,66815,43396,83173,93286,70841,66815,43396,1.2800000000000001E-2,1.3899999999999999E-2,1.01E-2,9.1999999999999998E-3,5.7999999999999996E-3,null,8.3999999999999995E-3,8.3999999999999995E-3,null,1.01E-2,7.4999999999999997E-3,2.5999999999999999E-3,null,8.3999999999999995E-3,64814]
[44,"BROCKTON      ",121079995,127045434,132480953,137859951,143674763,149036481,1991,0,null,2938439,2259383,2066974,2368313,1769849,2938439,2259383,2066974,2368313,1769849,2.4299999999999999E-2,1.78E-2,1.5599999999999999E-2,1.72E-2,1.23E-2,null,1.4999999999999999E-2,1.4999999999999999E-2,null,1.72E-2,1.4E-2,3.1999999999999997E-3,null,1.4999999999999999E-2,2235547]
[45,"BROOKFIELD    ",4621597,4792162,4956539,5191955,5449013,5668022,0,0,null,55025,44573,111503,127259,82784,55025,44573,111503,127259,82784,1.1900000000000001E-2,9.2999999999999992E-3,2.2499999999999999E-2,2.4500000000000001E-2,1.52E-2,null,2.07E-2,1.5699999999999999E-2,null,2.4500000000000001E-2,1.89E-2,5.6000000000000008E-3,null,2.07E-2,117328]
[46,"BROOKLINE     ",169407603,175733519,182838477,189673546,197016712,204707848,0,0,null,2090726,2711620,2264107,2601328,2765718,2090726,2711620,2264107,2601328,2765718,1.23E-2,1.54E-2,1.24E-2,1.37E-2,1.4E-2,null,1.34E-2,1.34E-2,null,1.4E-2,1.3100000000000001E-2,8.9999999999999976E-4,null,1.34E-2,2743085]
[47,"BUCKLAND      ",3152566,3281502,3423371,3529299,3641719,3755552,0,0,null,50122,59831,20343,24187,22790,50122,59831,20343,24187,22790,1.5900000000000001E-2,1.8200000000000001E-2,5.8999999999999999E-3,6.8999999999999999E-3,6.3E-3,null,6.4000000000000003E-3,6.4000000000000003E-3,null,6.8999999999999999E-3,6.1000000000000004E-3,7.999999999999995E-4,null,6.4000000000000003E-3,24036]
[48,"BURLINGTON    ",99908178,105612937,111067433,117266931,123645873,130007610,0,0,null,3207055,2814173,3422812,3447269,3270590,3207055,2814173,3422812,3447269,3270590,3.2099999999999997E-2,2.6599999999999999E-2,3.0800000000000001E-2,2.9399999999999999E-2,2.6499999999999999E-2,null,2.8899999999999999E-2,2.75E-2,null,3.0800000000000001E-2,2.8000000000000001E-2,2.8000000000000004E-3,null,2.8899999999999999E-2,3757220]
[49,"CAMBRIDGE     ",475410995,509472549,540959800,570550306,599170668,628478895,0,0,null,21321353,18282278,15405065,13973778,14436731,21321353,18282278,15405065,13973778,14436731,4.48E-2,3.5900000000000001E-2,2.8500000000000001E-2,2.4500000000000001E-2,2.41E-2,null,2.5700000000000001E-2,2.5700000000000001E-2,null,2.8500000000000001E-2,2.4299999999999999E-2,4.2000000000000023E-3,null,2.5700000000000001E-2,16151908]
[50,"CANTON        ",59069175,61858950,65010907,68009198,70624664,74125029,2005,0,null,1313045,1605483,1373018,915236,1734748,1313045,1605483,1373018,915236,1734748,2.2200000000000001E-2,2.5999999999999999E-2,2.1100000000000001E-2,1.35E-2,2.46E-2,null,1.9699999999999999E-2,1.9699999999999999E-2,null,2.46E-2,1.7299999999999999E-2,7.3000000000000009E-3,null,1.9699999999999999E-2,1460263]
[51,"CARLISLE      ",20092874,20927143,21722969,22539451,23365940,24396248,1997,0,null,331947,272648,273408,263002,446160,331947,272648,273408,263002,446160,1.6500000000000001E-2,1.2999999999999999E-2,1.26E-2,1.17E-2,1.9099999999999999E-2,null,1.4500000000000001E-2,1.24E-2,null,1.9099999999999999E-2,1.2200000000000001E-2,6.8999999999999981E-3,null,1.4500000000000001E-2,353746]
[52,"CARVER        ",21085057,21899430,22905353,23905837,24824537,25987764,1991,2001,null,287247,348249,424464,321054,542614,287247,348249,424464,321054,542614,1.3599999999999999E-2,1.5900000000000001E-2,1.8499999999999999E-2,1.34E-2,2.1899999999999999E-2,null,1.7899999999999999E-2,1.5900000000000001E-2,null,2.1899999999999999E-2,1.6E-2,5.899999999999999E-3,null,1.7899999999999999E-2,465181]
[53,"CHARLEMONT    ",2579666,2716985,2818202,2977962,3086335,3207212,0,0,null,72774,33292,89305,33924,42716,72774,33292,89305,33924,42716,2.8199999999999999E-2,1.23E-2,3.1699999999999999E-2,1.14E-2,1.38E-2,null,1.9E-2,1.2500000000000001E-2,null,3.1699999999999999E-2,1.26E-2,1.9099999999999999E-2,null,1.9E-2,60937]
[54,"CHARLTON      ",16410495,17277860,18009251,18894054,19851765,21031164,1996,0,null,457103,299444,434572,485359,683105,457103,299444,434572,485359,683105,2.7900000000000001E-2,1.7299999999999999E-2,2.41E-2,2.5700000000000001E-2,3.44E-2,null,2.81E-2,2.24E-2,null,3.44E-2,2.4899999999999999E-2,9.5000000000000015E-3,null,2.81E-2,590976]
[55,"CHATHAM       ",22805322,23677336,24793850,25912342,27004261,28160604,0,0,null,301881,524580,498646,444110,481911,301881,524580,498646,444110,481911,1.32E-2,2.2200000000000001E-2,2.01E-2,1.7100000000000001E-2,1.78E-2,null,1.83E-2,1.83E-2,null,2.01E-2,1.7500000000000002E-2,2.5999999999999981E-3,null,1.83E-2,515339]
[56,"CHELMSFORD    ",82024358,85490204,90161406,93668498,97520293,101789687,1991,0,null,1415237,2533947,1253057,1510083,1831387,1415237,2533947,1253057,1510083,1831387,1.7299999999999999E-2,2.9600000000000001E-2,1.3899999999999999E-2,1.61E-2,1.8800000000000001E-2,null,1.6299999999999999E-2,1.6299999999999999E-2,null,1.8800000000000001E-2,1.4999999999999999E-2,3.8000000000000013E-3,null,1.6299999999999999E-2,1659172]
[57,"CHELSEA       ",45869995,48322835,51980785,54878173,57906281,61485089,0,0,null,1306090,2449879,2056881,1656154,2221542,1306090,2449879,2056881,1656154,2221542,2.8500000000000001E-2,5.0700000000000002E-2,3.9600000000000003E-2,3.0200000000000001E-2,3.8399999999999997E-2,null,3.61E-2,3.61E-2,null,3.9600000000000003E-2,3.4299999999999997E-2,5.3000000000000061E-3,null,3.61E-2,2219612]
[58,"CHESHIRE      ",3067810,3173655,3284567,3395437,3510757,3613907,0,0,null,26063,31570,28755,30434,15381,26063,31570,28755,30434,15381,8.5000000000000006E-3,9.9000000000000008E-3,8.8000000000000005E-3,8.9999999999999993E-3,4.4000000000000003E-3,null,7.4000000000000003E-3,7.4000000000000003E-3,null,8.9999999999999993E-3,6.6E-3,2.3999999999999994E-3,null,7.4000000000000003E-3,26743]
[59,"CHESTER       ",2238326,2348314,2433506,2517629,2590373,2671146,2000,0,null,54030,26484,23286,9804,16014,54030,26484,23286,9804,16014,2.41E-2,1.1299999999999999E-2,9.5999999999999992E-3,3.8999999999999998E-3,6.1999999999999998E-3,null,6.6E-3,6.6E-3,null,9.5999999999999992E-3,5.1000000000000004E-3,4.4999999999999988E-3,null,6.6E-3,17630]
[60,"CHESTERFIELD  ",2762555,2857402,2952119,3055865,3165362,3301345,0,0,null,25783,22565,29943,33100,56849,25783,22565,29943,33100,56849,9.2999999999999992E-3,7.9000000000000008E-3,1.01E-2,1.0800000000000001E-2,1.7999999999999999E-2,null,1.2999999999999999E-2,9.5999999999999992E-3,null,1.7999999999999999E-2,1.0500000000000001E-2,7.499999999999998E-3,null,1.2999999999999999E-2,42917]
[61,"CHICOPEE      ",78940863,82085653,85085256,88297903,91689322,95030164,0,0,null,1171268,947462,1085516,1180831,1048609,1171268,947462,1085516,1180831,1048609,1.4800000000000001E-2,1.15E-2,1.2800000000000001E-2,1.34E-2,1.14E-2,null,1.2500000000000001E-2,1.1900000000000001E-2,null,1.34E-2,1.21E-2,1.3000000000000008E-3,null,1.2500000000000001E-2,1187877]
[62,"CHILMARK      ",4967272,5178743,5383064,5604232,5831027,6144147,1991,0,null,87289,74853,86591,86689,90766,87289,74853,86591,86689,90766,1.7600000000000001E-2,1.4500000000000001E-2,1.61E-2,1.55E-2,1.5599999999999999E-2,null,1.5699999999999999E-2,1.52E-2,null,1.61E-2,1.5599999999999999E-2,5.0000000000000044E-4,null,1.5699999999999999E-2,96463]
[63,"CLARKSBURG    ",1680025,1736349,1792235,1868756,1924899,2018524,0,0,null,14323,12477,31715,9424,45503,14323,12477,31715,9424,45503,8.5000000000000006E-3,7.1999999999999998E-3,1.77E-2,5.0000000000000001E-3,2.3599999999999999E-2,null,1.54E-2,0.01,null,2.3599999999999999E-2,1.14E-2,1.2199999999999999E-2,null,1.54E-2,31085]
[64,"CLINTON       ",19869665,20765696,21843211,24110850,25991616,27155562,2004,0,null,399289,558373,1721559,1277995,514156,399289,558373,1721559,1277995,514156,2.01E-2,2.69E-2,7.8799999999999995E-2,5.2999999999999999E-2,1.9800000000000002E-2,null,5.0500000000000003E-2,3.32E-2,null,7.8799999999999995E-2,3.6400000000000002E-2,4.2399999999999993E-2,null,3.32E-2,901565]
[65,"COHASSET      ",28806904,30048909,31552568,33053598,34680015,36056433,1991,0,null,521832,752436,712215,800077,509417,521832,752436,712215,800077,509417,1.8100000000000002E-2,2.5000000000000001E-2,2.2599999999999999E-2,2.4199999999999999E-2,1.47E-2,null,2.0500000000000001E-2,2.0500000000000001E-2,null,2.4199999999999999E-2,1.8700000000000001E-2,5.4999999999999979E-3,null,2.0500000000000001E-2,739157]
[66,"COLRAIN       ",3095132,3256677,3365278,3473748,3594737,3722805,0,0,null,84167,27184,24338,34145,38200,84167,27184,24338,34145,38200,2.7199999999999998E-2,8.3000000000000001E-3,7.1999999999999998E-3,9.7999999999999997E-3,1.06E-2,null,9.1999999999999998E-3,8.3999999999999995E-3,null,1.06E-2,8.5000000000000006E-3,2.0999999999999994E-3,null,9.1999999999999998E-3,34250]
[67,"CONCORD       ",64593711,67492558,70616837,73703588,76782131,79896943,2002,0,null,1284004,1412859,1321330,1235953,1195259,1284004,1412859,1321330,1235953,1195259,1.9900000000000001E-2,2.0899999999999998E-2,1.8700000000000001E-2,1.6799999999999999E-2,1.5599999999999999E-2,null,1.7000000000000001E-2,1.7000000000000001E-2,null,1.8700000000000001E-2,1.6199999999999999E-2,2.5000000000000022E-3,null,1.7000000000000001E-2,1358248]
[68,"CONWAY        ",4012945,4140284,4389163,4521189,4776510,4977761,0,0,null,27016,145372,22297,134040,81838,27016,145372,22297,134040,81838,6.7000000000000002E-3,3.5099999999999999E-2,5.1000000000000004E-3,2.9600000000000001E-2,1.7100000000000001E-2,null,1.7299999999999999E-2,1.7299999999999999E-2,null,2.9600000000000001E-2,1.11E-2,1.8500000000000003E-2,null,1.7299999999999999E-2,86115]
[69,"CUMMINGTON    ",1645075,1705754,1763064,1826663,1889349,1970288,0,0,null,19552,14666,19522,17019,33706,19552,14666,19522,17019,33706,1.1900000000000001E-2,8.6E-3,1.11E-2,9.2999999999999992E-3,1.78E-2,null,1.2699999999999999E-2,9.7000000000000003E-3,null,1.78E-2,1.0200000000000001E-2,7.5999999999999991E-3,null,1.2699999999999999E-2,25023]
[70,"DALTON        ",10993339,11329558,11666382,12035249,12481313,12984294,0,0,null,61386,53585,77207,145183,190948,61386,53585,77207,145183,190948,5.5999999999999999E-3,4.7000000000000002E-3,6.6E-3,1.21E-2,1.5299999999999999E-2,null,1.1299999999999999E-2,7.7999999999999996E-3,null,1.5299999999999999E-2,9.4000000000000004E-3,5.899999999999999E-3,null,1.1299999999999999E-2,146723]
[71,"DANVERS       ",67839074,70394408,72783734,75516164,78198964,80994021,1991,0,null,859357,629466,912837,794896,840083,859357,629466,912837,794896,840083,1.2699999999999999E-2,8.8999999999999999E-3,1.2500000000000001E-2,1.0500000000000001E-2,1.0699999999999999E-2,null,1.12E-2,0.01,null,1.2500000000000001E-2,1.06E-2,1.9000000000000006E-3,null,1.12E-2,907133]
[72,"DARTMOUTH     ",50324169,52962119,55137061,57341320,59346956,61564845,2004,0,null,1379845,842857,822352,572103,734215,1379845,842857,822352,572103,734215,2.7400000000000001E-2,1.5900000000000001E-2,1.49E-2,0.01,1.24E-2,null,1.24E-2,1.24E-2,null,1.49E-2,1.12E-2,3.7000000000000002E-3,null,1.24E-2,763404]
[73,"DEDHAM        ",79745732,82788288,86097851,89441008,93000263,96531276,0,0,null,1048913,1239856,1190711,1323230,1206006,1048913,1239856,1190711,1323230,1206006,1.32E-2,1.4999999999999999E-2,1.38E-2,1.4800000000000001E-2,1.2999999999999999E-2,null,1.3899999999999999E-2,1.3899999999999999E-2,null,1.4800000000000001E-2,1.34E-2,1.4000000000000002E-3,null,1.3899999999999999E-2,1341785]
[74,"DEERFIELD     ",8377481,8693118,9049716,9447838,9876075,10260285,1995,0,null,106200,139270,171879,192041,137308,106200,139270,171879,192041,137308,1.2699999999999999E-2,1.6E-2,1.9E-2,2.0299999999999999E-2,1.3899999999999999E-2,null,1.77E-2,1.6299999999999999E-2,null,2.0299999999999999E-2,1.6500000000000001E-2,3.7999999999999978E-3,null,1.77E-2,181607]
[75,"DENNIS        ",31974036,33151923,34387981,35560281,36714645,37932691,2011,0,null,378536,407260,312601,265357,300989,378536,407260,312601,265357,300989,1.18E-2,1.23E-2,9.1000000000000004E-3,7.4999999999999997E-3,8.2000000000000007E-3,null,8.3000000000000001E-3,8.3000000000000001E-3,null,9.1000000000000004E-3,7.9000000000000008E-3,1.1999999999999997E-3,null,8.3000000000000001E-3,314841]
[76,"DIGHTON       ",14246283,14874815,15832896,16682131,17533123,18525532,2012,0,null,267618,586211,453413,433758,554081,267618,586211,453413,433758,554081,1.8800000000000001E-2,3.9399999999999998E-2,2.86E-2,2.5999999999999999E-2,3.1600000000000003E-2,null,2.87E-2,2.87E-2,null,3.1600000000000003E-2,2.7300000000000001E-2,4.3000000000000017E-3,null,2.87E-2,531683]
[77,"DOUGLAS       ",11742883,12187036,12600831,13115418,13690916,14434360,1992,1998,null,150581,109119,199566,247612,400776,150581,109119,199566,247612,400776,1.2800000000000001E-2,8.9999999999999993E-3,1.5800000000000002E-2,1.89E-2,2.93E-2,null,2.1299999999999999E-2,1.46E-2,null,2.93E-2,1.7399999999999999E-2,1.1900000000000001E-2,null,2.1299999999999999E-2,307452]
[78,"DOVER         ",25315086,26509534,27705855,28915471,30145661,31203977,1993,0,null,561571,533583,516969,506809,304675,561571,533583,516969,506809,304675,2.2200000000000001E-2,2.01E-2,1.8700000000000001E-2,1.7500000000000002E-2,1.01E-2,null,1.54E-2,1.54E-2,null,1.8700000000000001E-2,1.38E-2,4.9000000000000016E-3,null,1.54E-2,480541]
[79,"DRACUT        ",40389103,41916775,43644368,45512281,47461299,49198678,1991,0,null,517944,679674,776804,811211,550847,517944,679674,776804,811211,550847,1.2800000000000001E-2,1.6199999999999999E-2,1.78E-2,1.78E-2,1.1599999999999999E-2,null,1.5699999999999999E-2,1.52E-2,null,1.78E-2,1.47E-2,3.1000000000000003E-3,null,1.5699999999999999E-2,772419]
[80,"DUDLEY        ",8313999,8628289,9022311,9351627,9822846,10178293,2003,0,null,106440,175336,103758,141313,109065,106440,175336,103758,141313,109065,1.2800000000000001E-2,2.0299999999999999E-2,1.15E-2,1.5100000000000001E-2,1.11E-2,null,1.26E-2,1.26E-2,null,1.5100000000000001E-2,1.1299999999999999E-2,3.8000000000000013E-3,null,1.26E-2,128246]
[81,"DUNSTABLE     ",6100979,6343733,6586801,6904150,7247368,7574022,2007,0,null,90230,84475,152679,170614,139356,90230,84475,152679,170614,139356,1.4800000000000001E-2,1.3299999999999999E-2,2.3199999999999998E-2,2.47E-2,1.9199999999999998E-2,null,2.24E-2,1.8599999999999998E-2,null,2.47E-2,2.12E-2,3.4999999999999996E-3,null,2.24E-2,169658]
[82,"DUXBURY       ",47190675,49001918,51143782,53293997,55206582,57123110,2005,0,null,631476,898607,845923,580235,536363,631476,898607,845923,580235,536363,1.34E-2,1.83E-2,1.6500000000000001E-2,1.09E-2,9.7000000000000003E-3,null,1.24E-2,1.24E-2,null,1.6500000000000001E-2,1.03E-2,6.2000000000000006E-3,null,1.24E-2,708327]
[83,"EAST BRIDGEWAT",23768544,24584612,25490345,26351353,27320944,28364047,2006,0,null,221733,291118,223749,310807,360079,221733,291118,223749,310807,360079,9.2999999999999992E-3,1.18E-2,8.8000000000000005E-3,1.18E-2,1.32E-2,null,1.1299999999999999E-2,1.0800000000000001E-2,null,1.32E-2,1.03E-2,2.8999999999999998E-3,null,1.1299999999999999E-2,320514]
[84,"EAST BROOKFIEL",3036075,3152603,3411993,3561821,3706310,3870757,0,0,null,40626,180575,64528,55443,71789,40626,180575,64528,55443,71789,1.34E-2,5.7299999999999997E-2,1.89E-2,1.5599999999999999E-2,1.9400000000000001E-2,null,1.7999999999999999E-2,1.7999999999999999E-2,null,1.9400000000000001E-2,1.7299999999999999E-2,2.1000000000000012E-3,null,1.7999999999999999E-2,69674]
[85,"EAST LONGMEADO",36882128,38368359,39748268,41170794,42778627,44321187,2013,0,null,564178,420700,428819,569443,473094,564178,420700,428819,569443,473094,1.5299999999999999E-2,1.0999999999999999E-2,1.0800000000000001E-2,1.38E-2,1.11E-2,null,1.1900000000000001E-2,1.0999999999999999E-2,null,1.38E-2,1.0999999999999999E-2,2.8000000000000004E-3,null,1.1900000000000001E-2,527422]
[86,"EASTHAM       ",15248233,15729783,16258185,16809439,17374730,17928494,0,0,null,100344,135158,144737,145119,119330,100344,135158,144737,145119,119330,6.6E-3,8.6E-3,8.8999999999999999E-3,8.6E-3,6.8999999999999999E-3,null,8.0999999999999996E-3,8.0000000000000002E-3,null,8.8999999999999999E-3,7.7999999999999996E-3,1.1000000000000003E-3,null,8.0999999999999996E-3,145221]
[87,"EASTHAMPTON   ",19731716,20448887,21287021,22058451,22869840,23717269,2004,0,null,223878,326911,239255,259927,275683,223878,326911,239255,259927,275683,1.1299999999999999E-2,1.6E-2,1.12E-2,1.18E-2,1.21E-2,null,1.17E-2,1.17E-2,null,1.21E-2,1.15E-2,5.9999999999999984E-4,null,1.17E-2,277492]
[88,"EASTON        ",42340443,44193109,45990719,48141698,50210978,52401801,0,0,null,794155,691445,1001211,865141,935548,794155,691445,1001211,865141,935548,1.8800000000000001E-2,1.5599999999999999E-2,2.18E-2,1.7999999999999999E-2,1.8599999999999998E-2,null,1.95E-2,1.7399999999999999E-2,null,2.18E-2,1.83E-2,3.4999999999999996E-3,null,1.95E-2,1021835]
[89,"EDGARTOWN     ",17801165,18621719,19499814,20425655,21357045,22745023,0,0,null,368696,411415,431088,417825,454051,368696,411415,431088,417825,454051,2.07E-2,2.2100000000000002E-2,2.2100000000000002E-2,2.0500000000000001E-2,2.1299999999999999E-2,null,2.1299999999999999E-2,2.1299999999999999E-2,null,2.2100000000000002E-2,2.0899999999999998E-2,1.2000000000000031E-3,null,2.1299999999999999E-2,484469]
[90,"EGREMONT      ",3813002,3936179,4075632,4209885,4349391,4485945,0,0,null,27852,41049,32362,34259,27819,27852,41049,32362,34259,27819,7.3000000000000001E-3,1.04E-2,7.9000000000000008E-3,8.0999999999999996E-3,6.4000000000000003E-3,null,7.4999999999999997E-3,7.4999999999999997E-3,null,8.0999999999999996E-3,7.1999999999999998E-3,8.9999999999999976E-4,null,7.4999999999999997E-3,33645]
[91,"ERVING        ",8760928,9144568,9444803,9689539,10620755,10909997,0,0,null,164617,71621,8616,688978,23723,164617,71621,8616,688978,23723,1.8800000000000001E-2,7.7999999999999996E-3,8.9999999999999998E-4,7.1099999999999997E-2,2.2000000000000001E-3,null,2.47E-2,3.5999999999999999E-3,null,7.1099999999999997E-2,1.6000000000000001E-3,6.9499999999999992E-2,null,3.5999999999999999E-3,39276]
[92,"ESSEX         ",8342502,8631578,8943941,9254379,9579362,9938252,0,0,null,78159,91522,86839,93623,119406,78159,91522,86839,93623,119406,9.4000000000000004E-3,1.06E-2,9.7000000000000003E-3,1.01E-2,1.2500000000000001E-2,null,1.0800000000000001E-2,1.01E-2,null,1.2500000000000001E-2,9.9000000000000008E-3,2.5999999999999999E-3,null,1.0800000000000001E-2,107333]
[93,"EVERETT       ",94510401,99542806,104642418,110457822,136743488,144152596,1991,2014,null,2669645,2611042,3199344,23524220,3990521,2669645,2611042,3199344,23524220,3990521,2.8199999999999999E-2,2.6200000000000001E-2,3.0599999999999999E-2,0.21299999999999999,2.92E-2,null,9.0899999999999995E-2,2.87E-2,null,0.21299999999999999,2.9899999999999999E-2,0.18309999999999998,null,2.87E-2,4137180]
[94,"FAIRHAVEN     ",23977759,24760441,25653486,26676342,27566372,28484856,0,0,null,176154,274034,381519,223121,229325,176154,274034,381519,223121,229325,7.3000000000000001E-3,1.11E-2,1.49E-2,8.3999999999999995E-3,8.3000000000000001E-3,null,1.0500000000000001E-2,9.2999999999999992E-3,null,1.49E-2,8.3999999999999995E-3,6.5000000000000006E-3,null,1.0500000000000001E-2,299091]
[95,"FALL RIVER    ",86422352,89857302,93644049,97454740,102122896,106816456,0,0,null,1274391,1540314,1469590,2231787,2140488,1274391,1540314,1469590,2231787,2140488,1.47E-2,1.7100000000000001E-2,1.5699999999999999E-2,2.29E-2,2.1000000000000001E-2,null,1.9900000000000001E-2,1.7899999999999999E-2,null,2.29E-2,1.84E-2,4.5000000000000005E-3,null,1.9900000000000001E-2,2125647]
[96,"FALMOUTH      ",79940771,82946698,85952903,89054950,92065051,95461519,2007,0,null,1007407,932538,953225,783727,1093012,1007407,932538,953225,783727,1093012,1.26E-2,1.12E-2,1.11E-2,8.8000000000000005E-3,1.1900000000000001E-2,null,1.06E-2,1.04E-2,null,1.1900000000000001E-2,0.01,1.9000000000000006E-3,null,1.06E-2,1011892]
[97,"FITCHBURG     ",45980026,47650217,49602326,51485090,53682908,55682046,1991,0,null,520690,760854,642706,857948,657065,520690,760854,642706,857948,657065,1.1299999999999999E-2,1.6E-2,1.2999999999999999E-2,1.67E-2,1.2200000000000001E-2,null,1.4E-2,1.37E-2,null,1.67E-2,1.26E-2,4.0999999999999995E-3,null,1.4E-2,779549]
[98,"FLORIDA       ",1980016,2040295,2097556,2158598,2399378,0,0,0,null,10779,6253,8603,186815,19893,10779,6253,8603,186815,19893,5.4000000000000003E-3,3.0999999999999999E-3,4.1000000000000003E-3,8.6499999999999994E-2,8.3000000000000001E-3,null,3.3000000000000002E-2,5.1999999999999998E-3,null,8.6499999999999994E-2,6.1999999999999998E-3,8.0299999999999996E-2,null,5.1999999999999998E-3,12854]
[99,"FOXBOROUGH    ",38563873,40615130,42582722,45237199,47576229,49768722,1991,0,null,1087160,952214,1589909,1208100,1003087,1087160,952214,1589909,1208100,1003087,2.8199999999999999E-2,2.3400000000000001E-2,3.73E-2,2.6700000000000002E-2,2.1100000000000001E-2,null,2.8400000000000002E-2,2.3699999999999999E-2,null,3.73E-2,2.3900000000000001E-2,1.3399999999999999E-2,null,2.8400000000000002E-2,1413432]
[100,"FRAMINGHAM    ",169222943,175527068,183070364,190849721,198845456,207062248,1991,0,null,2073552,3155119,3202598,3224492,3227115,2073552,3155119,3202598,3224492,3227115,1.23E-2,1.7999999999999999E-2,1.7500000000000002E-2,1.6899999999999998E-2,1.6199999999999999E-2,null,1.6899999999999998E-2,1.6899999999999998E-2,null,1.7500000000000002E-2,1.66E-2,9.0000000000000149E-4,null,1.6899999999999998E-2,3499352]
[101,"FRANKLIN      ",58724454,61012570,63723420,66796108,69981489,73595444,1996,0,null,820004,1185535,1479602,1515478,1864418,820004,1185535,1479602,1515478,1864418,1.4E-2,1.9400000000000001E-2,2.3199999999999998E-2,2.2700000000000001E-2,2.6599999999999999E-2,null,2.4199999999999999E-2,2.18E-2,null,2.6599999999999999E-2,2.3E-2,3.599999999999999E-3,null,2.4199999999999999E-2,1781010]
[102,"FREETOWN      ",16889666,17656495,18459630,19501997,20288107,21671372,0,0,null,344585,361725,580874,298562,876060,344585,361725,580874,298562,876060,2.0400000000000001E-2,2.0500000000000001E-2,3.15E-2,1.5299999999999999E-2,4.3200000000000002E-2,null,0.03,2.24E-2,null,4.3200000000000002E-2,2.3400000000000001E-2,1.9800000000000002E-2,null,0.03,650141]
[103,"GARDNER       ",22612309,23528443,24781672,25888215,27018062,28240124,2009,0,null,350826,659728,468194,482642,461042,350826,659728,468194,482642,461042,1.55E-2,2.8000000000000001E-2,1.89E-2,1.8599999999999998E-2,1.7100000000000001E-2,null,1.8200000000000001E-2,1.8200000000000001E-2,null,1.89E-2,1.7899999999999999E-2,1.0000000000000009E-3,null,1.8200000000000001E-2,513970]
[104,"GAY HEAD      ",2492418,2566119,2654425,2750062,2848266,3209351,0,0,null,11390,24153,29276,29452,24879,11390,24153,29276,29452,24879,4.5999999999999999E-3,9.4000000000000004E-3,1.0999999999999999E-2,1.0699999999999999E-2,8.6999999999999994E-3,null,1.01E-2,9.5999999999999992E-3,null,1.0999999999999999E-2,9.7000000000000003E-3,1.2999999999999991E-3,null,1.01E-2,32414]
[105,"GEORGETOWN    ",14591882,15120657,15743947,16457382,17026034,17663734,0,0,null,163978,245244,319837,157217,212049,163978,245244,319837,157217,212049,1.12E-2,1.6199999999999999E-2,2.0299999999999999E-2,9.5999999999999992E-3,1.2500000000000001E-2,null,1.41E-2,1.2800000000000001E-2,null,2.0299999999999999E-2,1.11E-2,9.1999999999999981E-3,null,1.41E-2,249059]
[106,"GILL          ",2212106,2328351,2458541,2552827,2665584,0,0,0,null,60943,71810,32823,48936,9879,60943,71810,32823,48936,9879,2.75E-2,3.0800000000000001E-2,1.34E-2,1.9199999999999998E-2,3.7000000000000002E-3,null,1.21E-2,1.21E-2,null,1.9199999999999998E-2,8.6E-3,1.0599999999999998E-2,null,1.21E-2,33450]
[107,"GLOUCESTER    ",67991888,70726400,73445650,76265313,79051706,82035573,0,0,null,1034715,951090,983522,879760,1006905,1034715,951090,983522,879760,1006905,1.52E-2,1.34E-2,1.34E-2,1.15E-2,1.2699999999999999E-2,null,1.2500000000000001E-2,1.2500000000000001E-2,null,1.34E-2,1.21E-2,1.3000000000000008E-3,null,1.2500000000000001E-2,1025445]
[108,"GOSHEN        ",2041414,2104870,2183303,2282872,2361373,2443882,0,0,null,12421,25811,44986,21429,23475,12421,25811,44986,21429,23475,6.1000000000000004E-3,1.23E-2,2.06E-2,9.4000000000000004E-3,9.9000000000000008E-3,null,1.3299999999999999E-2,1.0500000000000001E-2,null,2.06E-2,9.7000000000000003E-3,1.09E-2,null,1.3299999999999999E-2,32504]
[109,"GOSNOLD       ",457216,469093,480821,495762,511645,0,0,0,null,446,0,2921,3489,9,446,0,2921,3489,9,1E-3,0,6.1000000000000004E-3,7.0000000000000001E-3,0,null,4.4000000000000003E-3,2E-3,null,7.0000000000000001E-3,3.0999999999999999E-3,3.9000000000000003E-3,null,4.4000000000000003E-3,2317]
[110,"GRAFTON       ",29834675,31004015,32325594,33852142,35307865,37083854,2002,0,null,420911,546479,718408,609420,893293,420911,546479,718408,609420,893293,1.41E-2,1.7600000000000001E-2,2.2200000000000001E-2,1.7999999999999999E-2,2.53E-2,null,2.18E-2,1.9300000000000001E-2,null,2.53E-2,2.01E-2,5.1999999999999998E-3,null,2.18E-2,808428]
[111,"GRANBY        ",9330064,9689236,10075291,10481037,10946478,11354129,0,0,null,125920,143824,153863,203415,103989,125920,143824,153863,203415,103989,1.35E-2,1.4800000000000001E-2,1.5299999999999999E-2,1.9400000000000001E-2,9.4999999999999998E-3,null,1.47E-2,1.32E-2,null,1.9400000000000001E-2,1.24E-2,7.000000000000001E-3,null,1.47E-2,166906]
[112,"GRANVILLE     ",2855584,2958230,3074796,3167565,3261763,3402034,0,0,null,31256,42610,15899,15009,58727,31256,42610,15899,15009,58727,1.09E-2,1.44E-2,5.1999999999999998E-3,4.7000000000000002E-3,1.7999999999999999E-2,null,9.2999999999999992E-3,8.0999999999999996E-3,null,1.7999999999999999E-2,5.0000000000000001E-3,1.2999999999999998E-2,null,9.2999999999999992E-3,31639]
[113,"GREAT BARRINGT",19125974,19847630,20877814,21717815,22803152,23576289,0,0,null,243507,533993,318056,542392,194274,243507,533993,318056,542392,194274,1.2699999999999999E-2,2.69E-2,1.52E-2,2.5000000000000001E-2,8.5000000000000006E-3,null,1.6199999999999999E-2,1.6199999999999999E-2,null,2.5000000000000001E-2,1.1900000000000001E-2,1.3100000000000001E-2,null,1.6199999999999999E-2,381936]
[114,"GREENFIELD    ",29088817,30219063,31550523,33175019,34278055,35435096,2006,0,null,403026,575983,835733,273661,292164,403026,575983,835733,273661,292164,1.3899999999999999E-2,1.9099999999999999E-2,2.6499999999999999E-2,8.2000000000000007E-3,8.5000000000000006E-3,null,1.44E-2,1.1900000000000001E-2,null,2.6499999999999999E-2,8.3999999999999995E-3,1.8099999999999998E-2,null,1.44E-2,510265]
[115,"GROTON        ",23181809,24138372,25187945,26322587,27536957,28741001,2003,0,null,377018,446114,504944,556305,515620,377018,446114,504944,556305,515620,1.6299999999999999E-2,1.8499999999999999E-2,0.02,2.1100000000000001E-2,1.8700000000000001E-2,null,1.9900000000000001E-2,1.9099999999999999E-2,null,2.1100000000000001E-2,1.9400000000000001E-2,1.7000000000000001E-3,null,1.9900000000000001E-2,571946]
[116,"GROVELAND     ",10140481,10510707,10920875,11353165,11777343,12256841,1991,0,null,116714,147401,159268,140349,185065,116714,147401,159268,140349,185065,1.15E-2,1.4E-2,1.46E-2,1.24E-2,1.5699999999999999E-2,null,1.4200000000000001E-2,1.37E-2,null,1.5699999999999999E-2,1.35E-2,2.1999999999999988E-3,null,1.4200000000000001E-2,174047]
[117,"HADLEY        ",9359333,9718621,10157691,10576297,11032660,11621843,1992,0,null,125305,194694,164664,191930,294768,125305,194694,164664,191930,294768,1.34E-2,0.02,1.6199999999999999E-2,1.8100000000000002E-2,2.6700000000000002E-2,null,2.0299999999999999E-2,1.8100000000000002E-2,null,2.6700000000000002E-2,1.72E-2,9.5000000000000015E-3,null,2.0299999999999999E-2,235923]
[118,"HALIFAX       ",13027836,13561395,14187352,14711044,15242239,15758854,0,0,null,207863,286922,169008,163419,135559,207863,286922,169008,163419,135559,1.6E-2,2.12E-2,1.1900000000000001E-2,1.11E-2,8.8999999999999999E-3,null,1.06E-2,1.06E-2,null,1.1900000000000001E-2,0.01,1.9000000000000006E-3,null,1.06E-2,167044]
[119,"HAMILTON      ",17984227,18679090,19472979,20282884,20935674,21645646,1995,0,null,245257,326912,323081,145718,186580,245257,326912,323081,145718,186580,1.3599999999999999E-2,1.7500000000000002E-2,1.66E-2,7.1999999999999998E-3,8.8999999999999999E-3,null,1.09E-2,1.09E-2,null,1.66E-2,8.0999999999999996E-3,8.5000000000000006E-3,null,1.09E-2,235938]
[120,"HAMPDEN       ",9719362,10418493,10923139,11649278,12082323,12454681,0,0,null,456147,244184,453061,141813,70300,456147,244184,453061,141813,70300,4.6899999999999997E-2,2.3400000000000001E-2,4.1500000000000002E-2,1.2200000000000001E-2,5.7999999999999996E-3,null,1.9800000000000002E-2,1.38E-2,null,4.1500000000000002E-2,8.9999999999999993E-3,3.2500000000000001E-2,null,1.38E-2,171875]
[121,"HANCOCK       ",2056537,2117800,2180512,2281410,2348777,2410484,0,0,null,9850,9767,46385,10332,2988,9850,9767,46385,10332,2988,4.7999999999999996E-3,4.5999999999999999E-3,2.1299999999999999E-2,4.4999999999999997E-3,1.2999999999999999E-3,null,8.9999999999999993E-3,3.5000000000000001E-3,null,2.1299999999999999E-2,2.8999999999999998E-3,1.84E-2,null,8.9999999999999993E-3,21694]
[122,"HANOVER       ",33921736,35108968,36242613,37634174,39259975,40766305,0,0,null,339189,255920,485495,684946,524831,339189,255920,485495,684946,524831,0.01,7.3000000000000001E-3,1.34E-2,1.8200000000000001E-2,1.34E-2,null,1.4999999999999999E-2,1.14E-2,null,1.8200000000000001E-2,1.34E-2,4.8000000000000004E-3,null,1.4999999999999999E-2,611495]
[123,"HANSON        ",15915972,16687712,17577942,18408023,19298027,20106487,2011,0,null,373841,473037,390633,429803,326009,373841,473037,390633,429803,326009,2.35E-2,2.8299999999999999E-2,2.2200000000000001E-2,2.3300000000000001E-2,1.6899999999999998E-2,null,2.0799999999999999E-2,2.0799999999999999E-2,null,2.3300000000000001E-2,1.9599999999999999E-2,3.7000000000000019E-3,null,2.0799999999999999E-2,418215]
[124,"HARDWICK      ",3439606,3569620,3677514,3811640,3945989,4101377,0,0,null,44024,18653,40289,39058,56738,44024,18653,40289,39058,56738,1.2800000000000001E-2,5.1999999999999998E-3,1.0999999999999999E-2,1.0200000000000001E-2,1.44E-2,null,1.1900000000000001E-2,8.8000000000000005E-3,null,1.44E-2,1.06E-2,3.7999999999999996E-3,null,1.1900000000000001E-2,48806]
[125,"HARVARD       ",14037606,14547998,15045476,15580418,16151484,16667075,1993,0,null,159451,133779,158805,181556,111804,159451,133779,158805,181556,111804,1.14E-2,9.1999999999999998E-3,1.06E-2,1.17E-2,6.8999999999999999E-3,null,9.7000000000000003E-3,8.8999999999999999E-3,null,1.17E-2,8.8000000000000005E-3,2.8999999999999998E-3,null,9.7000000000000003E-3,161671]
[126,"HARWICH       ",34898040,36237130,37477829,38782332,40145509,41490683,2011,0,null,466639,334771,366280,393619,341536,466639,334771,366280,393619,341536,1.34E-2,9.1999999999999998E-3,9.7999999999999997E-3,1.01E-2,8.5000000000000006E-3,null,9.4999999999999998E-3,9.1999999999999998E-3,null,1.01E-2,9.1999999999999998E-3,8.9999999999999976E-4,null,9.4999999999999998E-3,394161]
[127,"HATFIELD      ",6309300,6530228,6777232,7034699,7276362,7623786,1991,0,null,63195,83749,88036,65796,165515,63195,83749,88036,65796,165515,0.01,1.2800000000000001E-2,1.2999999999999999E-2,9.4000000000000004E-3,2.2700000000000001E-2,null,1.4999999999999999E-2,1.17E-2,null,2.2700000000000001E-2,1.12E-2,1.1500000000000002E-2,null,1.4999999999999999E-2,114357]
[128,"HAVERHILL     ",90829283,94194099,97948608,101846990,105856629,110211975,2003,0,null,1094084,1399657,1449667,1463464,1708930,1094084,1399657,1449667,1463464,1708930,1.2E-2,1.49E-2,1.4800000000000001E-2,1.44E-2,1.61E-2,null,1.5100000000000001E-2,1.47E-2,null,1.61E-2,1.46E-2,1.4999999999999996E-3,null,1.5100000000000001E-2,1664201]
[129,"HAWLEY        ",787923,820658,851138,883598,916486,949471,1991,0,null,13037,9964,11182,10798,10073,13037,9964,11182,10798,10073,1.6500000000000001E-2,1.21E-2,1.3100000000000001E-2,1.2200000000000001E-2,1.0999999999999999E-2,null,1.21E-2,1.18E-2,null,1.3100000000000001E-2,1.1599999999999999E-2,1.5000000000000013E-3,null,1.21E-2,11489]
[130,"HEATH         ",1907474,2007125,2084464,2062326,2058608,2067685,1995,0,null,51965,28228,10700,3365,22570,51965,28228,10700,3365,22570,2.7199999999999998E-2,1.41E-2,5.1000000000000004E-3,1.6000000000000001E-3,1.0999999999999999E-2,null,5.8999999999999999E-3,5.8999999999999999E-3,null,1.0999999999999999E-2,3.3999999999999998E-3,7.5999999999999991E-3,null,5.8999999999999999E-3,12199]
[131,"HINGHAM       ",65889390,68715119,71019296,73331307,76169172,79423977,0,0,null,1178494,586299,536529,1004583,1350576,1178494,586299,536529,1004583,1350576,1.7899999999999999E-2,8.5000000000000006E-3,7.6E-3,1.37E-2,1.77E-2,null,1.2999999999999999E-2,9.9000000000000008E-3,null,1.77E-2,1.0699999999999999E-2,7.000000000000001E-3,null,1.2999999999999999E-2,1032512]
[132,"HINSDALE      ",4136791,4277270,4411000,4600942,4765580,4983986,0,0,null,37059,26798,79667,49614,99266,37059,26798,79667,49614,99266,8.9999999999999993E-3,6.3E-3,1.8100000000000002E-2,1.0800000000000001E-2,2.0799999999999999E-2,null,1.66E-2,1.17E-2,null,2.0799999999999999E-2,1.4500000000000001E-2,6.2999999999999983E-3,null,1.66E-2,82734]
[133,"HOLBROOK      ",18510496,19195012,19991275,20856620,21697680,22532031,1991,0,null,219779,316387,360698,319645,291909,219779,316387,360698,319645,291909,1.1900000000000001E-2,1.6500000000000001E-2,1.7999999999999999E-2,1.5299999999999999E-2,1.35E-2,null,1.5599999999999999E-2,1.5100000000000001E-2,null,1.7999999999999999E-2,1.44E-2,3.599999999999999E-3,null,1.5599999999999999E-2,351500]
[134,"HOLDEN        ",31677475,33258322,34780209,36468157,38179514,39897093,1991,0,null,788910,690429,818443,799653,763091,788910,690429,818443,799653,763091,2.4899999999999999E-2,2.0799999999999999E-2,2.35E-2,2.1899999999999999E-2,0.02,null,2.18E-2,2.0899999999999998E-2,null,2.35E-2,2.1000000000000001E-2,2.4999999999999988E-3,null,2.18E-2,869757]
[135,"HOLLAND       ",4316878,4487481,4645995,4807807,4976663,5160183,2009,0,null,62031,46327,43570,47037,59104,62031,46327,43570,47037,59104,1.44E-2,1.03E-2,9.4000000000000004E-3,9.7999999999999997E-3,1.1900000000000001E-2,null,1.04E-2,9.7999999999999997E-3,null,1.1900000000000001E-2,9.5999999999999992E-3,2.3000000000000017E-3,null,1.04E-2,53666]
[136,"HOLLISTON     ",34318250,36037552,37695559,39593837,41546606,43275822,1992,0,null,850223,757068,932198,962923,769038,850223,757068,932198,962923,769038,2.4799999999999999E-2,2.1000000000000001E-2,2.47E-2,2.4299999999999999E-2,1.8499999999999999E-2,null,2.2499999999999999E-2,2.1299999999999999E-2,null,2.47E-2,2.1399999999999999E-2,3.3000000000000008E-3,null,2.2499999999999999E-2,973706]
[137,"HOLYOKE       ",51236193,51422961,52231403,52427035,53918766,56039874,0,0,null,420504,320793,518516,407348,1219156,420504,320793,518516,407348,1219156,8.2000000000000007E-3,6.1999999999999998E-3,9.9000000000000008E-3,7.7999999999999996E-3,2.2599999999999999E-2,null,1.34E-2,8.0000000000000002E-3,null,2.2599999999999999E-2,8.8999999999999999E-3,1.3699999999999999E-2,null,1.34E-2,722511]
[138,"HOPEDALE      ",12375923,12802790,13345855,13802052,14339924,15361867,1991,0,null,117469,222995,118581,192821,233445,117469,222995,118581,192821,233445,9.4999999999999998E-3,1.7399999999999999E-2,8.8999999999999999E-3,1.4E-2,1.6299999999999999E-2,null,1.3100000000000001E-2,1.3100000000000001E-2,null,1.6299999999999999E-2,1.15E-2,4.7999999999999987E-3,null,1.3100000000000001E-2,201240]
[139,"HOPKINTON     ",45712397,48397350,51742794,54326021,57907756,0,2000,0,null,1542143,2135510,2789465,2219652,2316574,1542143,2135510,2789465,2219652,2316574,3.3700000000000001E-2,4.41E-2,5.3900000000000003E-2,4.0899999999999999E-2,0.04,null,4.4900000000000002E-2,4.1700000000000001E-2,null,5.3900000000000003E-2,4.0500000000000001E-2,1.3400000000000002E-2,null,4.4900000000000002E-2,2781802]
[140,"HUBBARDSTON   ",6026187,6267018,6518127,6774154,7032910,7273006,2002,0,null,90176,94434,93074,89402,64273,90176,94434,93074,89402,64273,1.4999999999999999E-2,1.5100000000000001E-2,1.43E-2,1.32E-2,9.1000000000000004E-3,null,1.2200000000000001E-2,1.2200000000000001E-2,null,1.43E-2,1.12E-2,3.1000000000000003E-3,null,1.2200000000000001E-2,88731]
[141,"HUDSON        ",41955423,43753564,45896901,47803174,49897596,51902188,1994,0,null,749255,1049498,758850,899343,757152,749255,1049498,758850,899343,757152,1.7899999999999999E-2,2.4E-2,1.6500000000000001E-2,1.8800000000000001E-2,1.52E-2,null,1.6799999999999999E-2,1.6799999999999999E-2,null,1.8800000000000001E-2,1.5900000000000001E-2,2.8999999999999998E-3,null,1.6799999999999999E-2,871957]
[142,"HULL          ",25520418,26286223,27146406,28040403,28951146,29976106,1992,0,null,127795,203027,215337,209733,301181,127795,203027,215337,209733,301181,5.0000000000000001E-3,7.7000000000000002E-3,7.9000000000000008E-3,7.4999999999999997E-3,1.04E-2,null,8.6E-3,7.7000000000000002E-3,null,1.04E-2,7.7000000000000002E-3,2.6999999999999993E-3,null,8.6E-3,257795]
[143,"HUNTINGTON    ",3024501,3113221,3228495,3324121,3421189,3559687,2013,0,null,13108,37443,14914,13965,52968,13108,37443,14914,13965,52968,4.3E-3,1.2E-2,4.5999999999999999E-3,4.1999999999999997E-3,1.55E-2,null,8.0999999999999996E-3,6.8999999999999999E-3,null,1.55E-2,4.4000000000000003E-3,1.1099999999999999E-2,null,8.0999999999999996E-3,28833]
[144,"IPSWICH       ",29723896,30833571,32151255,33256900,34444947,35583750,1991,0,null,366577,546845,301864,356624,277679,366577,546845,301864,356624,277679,1.23E-2,1.77E-2,9.4000000000000004E-3,1.0699999999999999E-2,8.0999999999999996E-3,null,9.4000000000000004E-3,9.4000000000000004E-3,null,1.0699999999999999E-2,8.8000000000000005E-3,1.8999999999999989E-3,null,9.4000000000000004E-3,334487]
[145,"KINGSTON      ",25445146,26662726,27960783,29786464,30901535,32106154,0,0,null,581451,631489,1126662,370410,439025,581451,631489,1126662,370410,439025,2.29E-2,2.3699999999999999E-2,4.0300000000000002E-2,1.24E-2,1.4200000000000001E-2,null,2.23E-2,1.6799999999999999E-2,null,4.0300000000000002E-2,1.3299999999999999E-2,2.7000000000000003E-2,null,1.6799999999999999E-2,539383]
[146,"LAKEVILLE     ",15880947,16617996,17258380,18005858,18782364,19656669,2013,0,null,340026,224934,316018,326359,404745,340026,224934,316018,326359,404745,2.1399999999999999E-2,1.35E-2,1.83E-2,1.8100000000000002E-2,2.1499999999999998E-2,null,1.9300000000000001E-2,1.66E-2,null,2.1499999999999998E-2,1.8200000000000001E-2,3.2999999999999974E-3,null,1.9300000000000001E-2,379374]
[147,"LANCASTER     ",11904573,12395242,13026175,13523195,14109456,15064170,2000,0,null,193054,321052,171366,248181,601978,193054,321052,171366,248181,601978,1.6199999999999999E-2,2.5899999999999999E-2,1.32E-2,1.84E-2,4.2700000000000002E-2,null,2.4799999999999999E-2,1.9199999999999998E-2,null,4.2700000000000002E-2,1.5800000000000002E-2,2.69E-2,null,1.9199999999999998E-2,289232]
[148,"LANESBOROUGH  ",7573102,7823529,8079420,8343686,8618973,9002151,0,0,null,61099,60303,62280,66695,167704,61099,60303,62280,66695,167704,8.0999999999999996E-3,7.7000000000000002E-3,7.7000000000000002E-3,8.0000000000000002E-3,1.95E-2,null,1.17E-2,7.7999999999999996E-3,null,1.95E-2,7.9000000000000008E-3,1.1599999999999999E-2,null,1.17E-2,105325]
[149,"LAWRENCE      ",60555260,63711774,67210871,70661377,74107308,80249851,0,0,null,1642632,1883729,1749216,1674238,4270706,1642632,1883729,1749216,1674238,4270706,2.7099999999999999E-2,2.9600000000000001E-2,2.5999999999999999E-2,2.3699999999999999E-2,5.7599999999999998E-2,null,3.5799999999999998E-2,2.64E-2,null,5.7599999999999998E-2,2.4899999999999999E-2,3.27E-2,null,2.64E-2,2118596]
[150,"LEE           ",13398385,13915178,14417880,14987659,15602526,16278394,1991,0,null,181173,154823,209332,240175,285805,181173,154823,209332,240175,285805,1.35E-2,1.11E-2,1.4500000000000001E-2,1.6E-2,1.83E-2,null,1.6299999999999999E-2,1.3899999999999999E-2,null,1.83E-2,1.5299999999999999E-2,3.0000000000000009E-3,null,1.6299999999999999E-2,265338]
[151,"LEICESTER     ",12449284,12980784,13469075,14001857,14615965,15292785,0,0,null,220268,163771,196055,264062,311421,220268,163771,196055,264062,311421,1.77E-2,1.26E-2,1.46E-2,1.89E-2,2.1299999999999999E-2,null,1.83E-2,1.54E-2,null,2.1299999999999999E-2,1.6799999999999999E-2,4.5000000000000005E-3,null,1.83E-2,279858]
[152,"LENOX         ",14994894,15532903,16072857,16892223,17783155,18419626,2018,0,null,163137,151631,417545,456842,191892,163137,151631,278363,456842,191892,1.09E-2,9.7999999999999997E-3,1.7299999999999999E-2,2.7E-2,1.0800000000000001E-2,null,1.84E-2,1.26E-2,null,2.7E-2,1.41E-2,1.29E-2,null,1.84E-2,338921]
[153,"LEOMINSTER    ",65231774,68087327,71007742,74049153,77287086,80298856,1995,0,null,1224759,1218232,1266217,1375155,1079593,1224759,1218232,1266217,1375155,1079593,1.8800000000000001E-2,1.7899999999999999E-2,1.78E-2,1.8599999999999998E-2,1.4E-2,null,1.6799999999999999E-2,1.66E-2,null,1.8599999999999998E-2,1.5900000000000001E-2,2.6999999999999975E-3,null,1.6799999999999999E-2,1349021]
[154,"LEVERETT      ",4375166,4522541,4697238,4876132,5083837,5296674,1991,0,null,37995,61634,61463,85802,85741,37995,61634,61463,85802,85741,8.6999999999999994E-3,1.3599999999999999E-2,1.3100000000000001E-2,1.7600000000000001E-2,1.6899999999999998E-2,null,1.5900000000000001E-2,1.4500000000000001E-2,null,1.7600000000000001E-2,1.4999999999999999E-2,2.6000000000000016E-3,null,1.5900000000000001E-2,84217]
[155,"LEXINGTON     ",129101885,135104579,141804255,148706496,155730639,163232408,1991,0,null,2672134,3309344,3357135,3270004,3608503,2672134,3309344,3357135,3270004,3608503,2.07E-2,2.4500000000000001E-2,2.3699999999999999E-2,2.1999999999999999E-2,2.3199999999999998E-2,null,2.3E-2,2.3E-2,null,2.3699999999999999E-2,2.2599999999999999E-2,1.1000000000000003E-3,null,2.3E-2,3754345]
[156,"LEYDEN        ",1672733,1721853,1771804,1820724,1878027,1932264,1991,0,null,7302,6905,4625,11785,7286,7302,6905,4625,11785,7286,4.4000000000000003E-3,4.0000000000000001E-3,2.5999999999999999E-3,6.4999999999999997E-3,3.8999999999999998E-3,null,4.3E-3,3.5000000000000001E-3,null,6.4999999999999997E-3,3.3E-3,3.1999999999999997E-3,null,4.3E-3,8309]
[157,"LINCOLN       ",22073141,22912242,23823983,24580535,25224589,25937914,1996,0,null,287273,338935,160953,29541,82710,287273,338935,160953,29541,82710,1.2999999999999999E-2,1.4800000000000001E-2,6.7999999999999996E-3,1.1999999999999999E-3,3.3E-3,null,3.8E-3,3.8E-3,null,6.7999999999999996E-3,2.3E-3,4.4999999999999997E-3,null,3.8E-3,98564]
[158,"LITTLETON     ",26559206,28472409,31286005,33270386,35938075,37973455,0,0,null,1249222,1987105,1202231,1835455,1136928,1249222,1987105,1202231,1835455,1136928,4.7E-2,6.9800000000000001E-2,3.8399999999999997E-2,5.5199999999999999E-2,3.1600000000000003E-2,null,4.1700000000000001E-2,4.1700000000000001E-2,null,5.5199999999999999E-2,3.5000000000000003E-2,2.0199999999999996E-2,null,4.1700000000000001E-2,1583493]
[159,"LONGMEADOW    ",37781176,38954003,40107569,41340174,42640565,44067400,1991,0,null,228298,179716,229916,266887,360075,228298,179716,229916,266887,360075,6.0000000000000001E-3,4.5999999999999999E-3,5.7000000000000002E-3,6.4999999999999997E-3,8.3999999999999995E-3,null,6.8999999999999999E-3,5.5999999999999999E-3,null,8.3999999999999995E-3,6.1000000000000004E-3,2.2999999999999991E-3,null,6.8999999999999999E-3,304065]
[160,"LOWELL        ",128838969,134307160,140808634,146747545,152560490,158905239,1991,0,null,2247217,3143795,2418695,2144212,2530737,2247217,3143795,2418695,2144212,2530737,1.7399999999999999E-2,2.3400000000000001E-2,1.72E-2,1.46E-2,1.66E-2,null,1.61E-2,1.61E-2,null,1.72E-2,1.5599999999999999E-2,1.6000000000000007E-3,null,1.61E-2,2558374]
[161,"LUDLOW        ",35290482,36551239,37886042,39450650,41088672,42772547,0,0,null,378495,421022,617457,651756,656658,378495,421022,617457,651756,656658,1.0699999999999999E-2,1.15E-2,1.6299999999999999E-2,1.6500000000000001E-2,1.6E-2,null,1.6299999999999999E-2,1.46E-2,null,1.6500000000000001E-2,1.6199999999999999E-2,3.0000000000000165E-4,null,1.6299999999999999E-2,697193]
[162,"LUNENBURG     ",19013813,19850014,20835908,21838302,22856796,23794447,0,0,null,360856,487955,481496,472536,366231,360856,487955,481496,472536,366231,1.9E-2,2.46E-2,2.3099999999999999E-2,2.1600000000000001E-2,1.6E-2,null,2.0199999999999999E-2,2.0199999999999999E-2,null,2.3099999999999999E-2,1.8800000000000001E-2,4.2999999999999983E-3,null,2.0199999999999999E-2,480648]
[163,"LYNN          ",112048550,117194784,121530630,126245456,131247559,136429137,1992,0,null,2345020,1405625,1674342,1845967,1884440,2345020,1405625,1674342,1845967,1884440,2.0899999999999998E-2,1.2E-2,1.38E-2,1.46E-2,1.44E-2,null,1.43E-2,1.34E-2,null,1.46E-2,1.41E-2,5.0000000000000044E-4,null,1.43E-2,1950937]
[164,"LYNNFIELD     ",30988312,32882789,34303700,35597066,36870564,38404725,1991,0,null,1119769,598841,435773,377843,612396,1119769,598841,435773,377843,612396,3.61E-2,1.8200000000000001E-2,1.2699999999999999E-2,1.06E-2,1.66E-2,null,1.3299999999999999E-2,1.3299999999999999E-2,null,1.66E-2,1.17E-2,4.8999999999999998E-3,null,1.3299999999999999E-2,510783]
[165,"MALDEN        ",75893339,79071792,83008386,86826081,90263355,94569307,1994,0,null,1281120,1959799,1742485,1266622,2049368,1281120,1959799,1742485,1266622,2049368,1.6899999999999998E-2,2.4799999999999999E-2,2.1000000000000001E-2,1.46E-2,2.2700000000000001E-2,null,1.9400000000000001E-2,1.9400000000000001E-2,null,2.2700000000000001E-2,1.78E-2,4.9000000000000016E-3,null,1.9400000000000001E-2,1834645]
[166,"MANCHESTER    ",18482626,19252684,20088508,20867145,21664958,22372852,1998,0,null,307992,354507,276127,276134,166271,307992,354507,276127,276134,166271,1.67E-2,1.84E-2,1.37E-2,1.32E-2,7.7000000000000002E-3,null,1.15E-2,1.15E-2,null,1.37E-2,1.0500000000000001E-2,3.1999999999999997E-3,null,1.15E-2,257288]
[167,"MANSFIELD     ",50550594,52997225,55476985,57822467,60338710,62548558,1993,0,null,1182866,1154830,958557,1070681,701381,1182866,1154830,958557,1070681,701381,2.3400000000000001E-2,2.18E-2,1.7299999999999999E-2,1.8499999999999999E-2,1.1599999999999999E-2,null,1.5800000000000002E-2,1.5800000000000002E-2,null,1.8499999999999999E-2,1.4500000000000001E-2,3.9999999999999983E-3,null,1.5800000000000002E-2,988267]
[168,"MARBLEHEAD    ",47963807,49584103,51331445,52983355,54625370,56294235,2006,0,null,421201,507739,368624,317431,303231,421201,507739,368624,317431,303231,8.8000000000000005E-3,1.0200000000000001E-2,7.1999999999999998E-3,6.0000000000000001E-3,5.5999999999999999E-3,null,6.3E-3,6.3E-3,null,7.1999999999999998E-3,5.7999999999999996E-3,1.4000000000000002E-3,null,6.3E-3,354654]
[169,"MARION        ",14379201,14884628,15433588,16033569,16606927,17620938,2005,0,null,145947,176844,214142,172518,178838,145947,176844,214142,172518,178838,1.01E-2,1.1900000000000001E-2,1.3899999999999999E-2,1.0800000000000001E-2,1.0800000000000001E-2,null,1.18E-2,1.12E-2,null,1.3899999999999999E-2,1.0800000000000001E-2,3.0999999999999986E-3,null,1.18E-2,207927]
[170,"MARLBOROUGH   ",113153270,119963736,124710450,131259954,138028167,144113359,0,0,null,3981634,2801390,3431743,3486714,2634488,3981634,2801390,3431743,3486714,2634488,3.5200000000000002E-2,2.3400000000000001E-2,2.75E-2,2.6599999999999999E-2,1.9099999999999999E-2,null,2.4400000000000002E-2,2.3E-2,null,2.75E-2,2.29E-2,4.5999999999999999E-3,null,2.4400000000000002E-2,3516366]
[171,"MARSHFIELD    ",52015146,53993189,56092990,58185898,60343478,62435562,1992,0,null,674854,742106,690583,702428,583497,674854,742106,690583,702428,583497,1.2999999999999999E-2,1.37E-2,1.23E-2,1.21E-2,9.7000000000000003E-3,null,1.14E-2,1.14E-2,null,1.23E-2,1.09E-2,1.4000000000000002E-3,null,1.14E-2,711765]
[172,"MASHPEE       ",40709631,42467181,44267702,46068055,48001741,49968699,0,0,null,739809,738841,693660,781985,766914,739809,738841,693660,781985,766914,1.8200000000000001E-2,1.7399999999999999E-2,1.5699999999999999E-2,1.7000000000000001E-2,1.6E-2,null,1.6199999999999999E-2,1.6199999999999999E-2,null,1.7000000000000001E-2,1.5900000000000001E-2,1.1000000000000003E-3,null,1.6199999999999999E-2,809493]
[173,"MATTAPOISETT  ",17115953,17837308,18531026,19244879,20041869,20842029,0,0,null,293456,212439,250577,314798,299113,293456,212439,250577,314798,299113,1.7100000000000001E-2,1.1900000000000001E-2,1.35E-2,1.6400000000000001E-2,1.49E-2,null,1.49E-2,1.34E-2,null,1.6400000000000001E-2,1.4200000000000001E-2,2.2000000000000006E-3,null,1.49E-2,310546]
[174,"MAYNARD       ",23691534,24712599,25611047,26682292,27639329,28986815,1991,0,null,428776,280633,430968,270176,656502,428776,280633,430968,270176,656502,1.8100000000000002E-2,1.14E-2,1.6799999999999999E-2,1.01E-2,2.3800000000000002E-2,null,1.6899999999999998E-2,1.2800000000000001E-2,null,2.3800000000000002E-2,1.35E-2,1.0300000000000002E-2,null,1.6899999999999998E-2,489877]
[175,"MEDFIELD      ",28785822,29884604,31065346,32226908,33405874,34793822,1995,0,null,379136,433627,384928,373294,552801,379136,433627,384928,373294,552801,1.32E-2,1.4500000000000001E-2,1.24E-2,1.1599999999999999E-2,1.6500000000000001E-2,null,1.35E-2,1.2800000000000001E-2,null,1.6500000000000001E-2,1.2E-2,4.5000000000000005E-3,null,1.35E-2,469717]
[176,"MEDFORD       ",96504325,100854325,105140200,109528185,113940518,118138663,0,0,null,1937392,1759225,1759480,1674128,1352288,1937392,1759225,1759480,1674128,1352288,2.01E-2,1.7399999999999999E-2,1.67E-2,1.5299999999999999E-2,1.1900000000000001E-2,null,1.46E-2,1.46E-2,null,1.67E-2,1.3599999999999999E-2,3.1000000000000003E-3,null,1.46E-2,1724824]
[177,"MEDWAY        ",27705648,28914951,30122519,31557264,37189189,38635928,0,0,null,516662,484694,681683,4842993,517009,516662,484694,681683,4842993,517009,1.8599999999999998E-2,1.6799999999999999E-2,2.2599999999999999E-2,0.1535,1.3899999999999999E-2,null,6.3299999999999995E-2,1.78E-2,null,0.1535,1.83E-2,0.13519999999999999,null,1.78E-2,687720]
[178,"MELROSE       ",49487204,51414034,53426783,55368833,57521943,64738724,2007,0,null,689650,727398,606380,768889,598732,689650,727398,606380,768889,598732,1.3899999999999999E-2,1.41E-2,1.1299999999999999E-2,1.3899999999999999E-2,1.04E-2,null,1.1900000000000001E-2,1.1900000000000001E-2,null,1.3899999999999999E-2,1.09E-2,2.9999999999999992E-3,null,1.1900000000000001E-2,770391]
[179,"MENDON        ",10218075,10751363,11202563,11863359,12521680,13093429,2014,0,null,277836,182416,380732,361737,258707,277836,182416,380732,361737,258707,2.7199999999999998E-2,1.7000000000000001E-2,3.4000000000000002E-2,3.0499999999999999E-2,2.07E-2,null,2.8400000000000002E-2,2.2700000000000001E-2,null,3.4000000000000002E-2,2.5600000000000001E-2,8.4000000000000012E-3,null,2.8400000000000002E-2,371853]
[180,"MERRIMAC      ",9091440,9471943,9908940,10376972,10864443,11229037,0,0,null,153217,200198,220308,228047,92983,153217,200198,220308,228047,92983,1.6899999999999998E-2,2.1100000000000001E-2,2.2200000000000001E-2,2.1999999999999999E-2,8.6E-3,null,1.7600000000000001E-2,1.72E-2,null,2.2200000000000001E-2,1.5299999999999999E-2,6.9000000000000016E-3,null,1.7600000000000001E-2,197631]
[181,"METHUEN       ",77798956,80592982,83578045,86698275,90014577,93348857,1991,0,null,849052,970238,1030779,1148845,1083916,849052,970238,1030779,1148845,1083916,1.09E-2,1.2E-2,1.23E-2,1.3299999999999999E-2,1.2E-2,null,1.2500000000000001E-2,1.21E-2,null,1.3299999999999999E-2,1.2200000000000001E-2,1.0999999999999985E-3,null,1.2500000000000001E-2,1166861]
[182,"MIDDLEBOROUGH ",35585189,37002975,38749307,40482738,42271292,44431811,0,0,null,528156,821258,764272,767330,1103737,528156,821258,764272,767330,1103737,1.4800000000000001E-2,2.2200000000000001E-2,1.9699999999999999E-2,1.9E-2,2.6100000000000002E-2,null,2.1600000000000001E-2,2.0299999999999999E-2,null,2.6100000000000002E-2,1.9400000000000001E-2,6.7000000000000011E-3,null,2.1600000000000001E-2,959727]
[183,"MIDDLEFIELD   ",1260822,1300881,1341436,1378983,1423245,1463886,1991,0,null,8538,8033,4011,9787,5060,8538,8033,4011,9787,5060,6.7999999999999996E-3,6.1999999999999998E-3,3.0000000000000001E-3,7.1000000000000004E-3,3.5999999999999999E-3,null,4.5999999999999999E-3,4.3E-3,null,7.1000000000000004E-3,3.3E-3,3.8000000000000004E-3,null,4.5999999999999999E-3,6734]
[184,"MIDDLETON     ",21697449,22759701,23800954,25068581,26268182,27689363,1991,0,null,519816,472261,672603,572886,764477,519816,472261,672603,572886,764477,2.4E-2,2.07E-2,2.8299999999999999E-2,2.29E-2,2.9100000000000001E-2,null,2.6800000000000001E-2,2.4E-2,null,2.9100000000000001E-2,2.5600000000000001E-2,3.4999999999999996E-3,null,2.6800000000000001E-2,742075]
[185,"MILFORD       ",60593474,62894398,65383458,67893461,70897896,73699324,2004,0,null,786087,904316,875417,1307098,1029887,786087,904316,875417,1307098,1029887,1.2999999999999999E-2,1.44E-2,1.34E-2,1.9300000000000001E-2,1.4500000000000001E-2,null,1.5699999999999999E-2,1.41E-2,null,1.9300000000000001E-2,1.4E-2,5.3000000000000009E-3,null,1.5699999999999999E-2,1157079]
[186,"MILLBURY      ",20747347,21667181,22934431,24012723,25332451,26788885,0,0,null,401150,725570,504931,719410,823123,401150,725570,504931,719410,823123,1.9300000000000001E-2,3.3500000000000002E-2,2.1999999999999999E-2,0.03,3.2500000000000001E-2,null,2.8199999999999999E-2,2.8199999999999999E-2,null,3.2500000000000001E-2,2.5999999999999999E-2,6.5000000000000023E-3,null,2.8199999999999999E-2,755447]
[187,"MILLIS        ",14468964,15128450,15974020,16838769,17911968,19041464,2003,0,null,297761,467359,465398,652230,681697,297761,467359,465398,652230,681697,2.06E-2,3.09E-2,2.9100000000000001E-2,3.8699999999999998E-2,3.8100000000000002E-2,null,3.5299999999999998E-2,3.27E-2,null,3.8699999999999998E-2,3.3599999999999998E-2,5.1000000000000004E-3,null,3.5299999999999998E-2,672164]
[188,"MILLVILLE     ",4211865,4347770,4521859,4659119,4850197,5015056,1991,0,null,30608,65395,24214,66786,43604,30608,65395,24214,66786,43604,7.3000000000000001E-3,1.4999999999999999E-2,5.4000000000000003E-3,1.43E-2,8.9999999999999993E-3,null,9.5999999999999992E-3,9.5999999999999992E-3,null,1.43E-2,7.1999999999999998E-3,7.1000000000000004E-3,null,9.5999999999999992E-3,48145]
[189,"MILTON        ",54555113,56655480,58756713,61038527,63462511,62709536,0,0,null,736489,684846,812896,898021,797727,736489,684846,812896,898021,797727,1.35E-2,1.21E-2,1.38E-2,1.47E-2,1.26E-2,null,1.37E-2,1.2800000000000001E-2,null,1.47E-2,1.32E-2,1.4999999999999996E-3,null,1.37E-2,859121]
[190,"MONROE        ",581932,598056,613522,622379,639015,655693,0,0,null,1576,515,1855,1077,703,1576,515,1855,1077,703,2.7000000000000001E-3,8.9999999999999998E-4,3.0000000000000001E-3,1.6999999999999999E-3,1.1000000000000001E-3,null,1.9E-3,1.1999999999999999E-3,null,3.0000000000000001E-3,1.4E-3,1.6000000000000001E-3,null,1.9E-3,1236]
[191,"MONSON        ",11630619,12083872,12508994,13027613,13492214,14084185,1991,0,null,162488,123026,205894,132856,253833,162488,123026,205894,132856,253833,1.4E-2,1.0200000000000001E-2,1.6500000000000001E-2,1.0200000000000001E-2,1.8800000000000001E-2,null,1.52E-2,1.23E-2,null,1.8800000000000001E-2,1.34E-2,5.4000000000000003E-3,null,1.52E-2,214080]
[192,"MONTAGUE      ",14020056,14514877,15143147,16133116,17056517,18037588,2010,0,null,144319,265398,611390,520073,564663,144319,265398,611390,520073,564663,1.03E-2,1.83E-2,4.0399999999999998E-2,3.2199999999999999E-2,3.3099999999999997E-2,null,3.5200000000000002E-2,2.7900000000000001E-2,null,4.0399999999999998E-2,3.27E-2,7.6999999999999985E-3,null,3.5200000000000002E-2,634923]
[193,"MONTEREY      ",2694274,2784941,2873936,2978977,3080282,3196706,0,0,null,23310,19371,33193,26830,39417,23310,19371,33193,26830,39417,8.6999999999999994E-3,7.0000000000000001E-3,1.15E-2,8.9999999999999993E-3,1.2800000000000001E-2,null,1.11E-2,9.1999999999999998E-3,null,1.2800000000000001E-2,1.03E-2,2.5000000000000005E-3,null,1.11E-2,35483]
[194,"MONTGOMERY    ",1499033,1564838,1613435,1659121,1708335,1775205,1991,0,null,28329,9476,5350,7736,24162,28329,9476,5350,7736,24162,1.89E-2,6.1000000000000004E-3,3.3E-3,4.7000000000000002E-3,1.41E-2,null,7.4000000000000003E-3,4.7000000000000002E-3,null,1.41E-2,4.0000000000000001E-3,1.01E-2,null,7.4000000000000003E-3,13137]
[195,"MOUNT WASHINGT",401516,415445,430563,445386,461618,479619,1991,0,null,3891,4732,4059,5097,6460,3891,4732,4059,5097,6460,9.7000000000000003E-3,1.14E-2,9.4000000000000004E-3,1.14E-2,1.4E-2,null,1.1599999999999999E-2,1.0699999999999999E-2,null,1.4E-2,1.04E-2,3.6000000000000008E-3,null,1.1599999999999999E-2,5564]
[196,"NAHANT        ",7095066,7321680,7549216,7783161,8038795,8896456,1991,1998,null,48941,44494,45214,61055,56691,48941,44494,45214,61055,56691,6.8999999999999999E-3,6.1000000000000004E-3,6.0000000000000001E-3,7.7999999999999996E-3,7.1000000000000004E-3,null,7.0000000000000001E-3,6.4000000000000003E-3,null,7.7999999999999996E-3,6.6E-3,1.1999999999999997E-3,null,7.0000000000000001E-3,62275]
[197,"NANTUCKET     ",56662729,59219382,61970547,64771578,67673866,70423348,0,0,null,1140085,1270680,1251767,1282998,1057635,1140085,1270680,1251767,1282998,1057635,2.01E-2,2.1499999999999998E-2,2.0199999999999999E-2,1.9800000000000002E-2,1.5599999999999999E-2,null,1.8499999999999999E-2,1.8499999999999999E-2,null,2.0199999999999999E-2,1.77E-2,2.4999999999999988E-3,null,1.8499999999999999E-2,1302832]
[198,"NATICK        ",87548549,90478492,94247300,97775327,101764896,106193025,0,0,null,741229,1506846,1171844,1545185,1884006,741229,1506846,1171844,1545185,1884006,8.5000000000000006E-3,1.67E-2,1.24E-2,1.5800000000000002E-2,1.8499999999999999E-2,null,1.5599999999999999E-2,1.4999999999999999E-2,null,1.8499999999999999E-2,1.41E-2,4.3999999999999994E-3,null,1.5599999999999999E-2,1656611]
[199,"NEEDHAM       ",97235640,103353659,108859598,116424769,123730790,131526186,2005,0,null,3684955,2919417,4841774,4394835,4697667,3684955,2919417,4841774,4394835,4697667,3.7900000000000003E-2,2.8199999999999999E-2,4.4499999999999998E-2,3.7699999999999997E-2,3.7999999999999999E-2,null,4.0099999999999997E-2,3.4599999999999999E-2,null,4.4499999999999998E-2,3.7900000000000003E-2,6.5999999999999948E-3,null,4.0099999999999997E-2,5274200]
[200,"NEW ASHFORD   ",399535,413539,427503,441983,456886,471713,0,0,null,4016,3625,3792,3854,3405,4016,3625,3792,3854,3405,1.01E-2,8.8000000000000005E-3,8.8999999999999999E-3,8.6999999999999994E-3,7.4999999999999997E-3,null,8.3999999999999995E-3,8.3000000000000001E-3,null,8.8999999999999999E-3,8.0999999999999996E-3,8.0000000000000036E-4,null,8.3999999999999995E-3,3962]
[201,"NEW BEDFORD   ",110181767,114137930,118972217,123961220,129211894,134165825,0,0,null,1201619,1980839,2014698,2151643,1723634,1201619,1980839,2014698,2151643,1723634,1.09E-2,1.7399999999999999E-2,1.6899999999999998E-2,1.7399999999999999E-2,1.3299999999999999E-2,null,1.5900000000000001E-2,1.5900000000000001E-2,null,1.7399999999999999E-2,1.5100000000000001E-2,2.2999999999999982E-3,null,1.5900000000000001E-2,2133237]
[202,"NEW BRAINTREE ",1716243,1770809,1831515,1916946,1986818,2068476,0,0,null,11660,16436,39643,21948,31988,11660,16436,39643,21948,31988,6.7999999999999996E-3,9.2999999999999992E-3,2.1600000000000001E-2,1.14E-2,1.61E-2,null,1.6400000000000001E-2,1.23E-2,null,2.1600000000000001E-2,1.38E-2,7.8000000000000014E-3,null,1.6400000000000001E-2,33923]
[203,"NEW MARLBOROUG",3929759,4058798,4191787,4337766,4501548,4676430,0,0,null,30795,31519,41184,55338,62344,30795,31519,41184,55338,62344,7.7999999999999996E-3,7.7999999999999996E-3,9.7999999999999997E-3,1.2800000000000001E-2,1.38E-2,null,1.21E-2,1.01E-2,null,1.38E-2,1.1299999999999999E-2,2.5000000000000005E-3,null,1.21E-2,56585]
[204,"NEW SALEM     ",1377625,1425795,1482644,1532627,1598850,1652039,0,0,null,13729,21204,12916,27907,13218,13729,21204,12916,27907,13218,0.01,1.49E-2,8.6999999999999994E-3,1.8200000000000001E-2,8.3000000000000001E-3,null,1.17E-2,1.06E-2,null,1.8200000000000001E-2,8.5000000000000006E-3,9.7000000000000003E-3,null,1.17E-2,19329]
[205,"NEWBURY       ",12498118,12961414,13522323,14061923,14589424,15135430,1992,0,null,149557,194795,201542,175953,181270,149557,194795,201542,175953,181270,1.2E-2,1.4999999999999999E-2,1.49E-2,1.2500000000000001E-2,1.24E-2,null,1.3299999999999999E-2,1.3299999999999999E-2,null,1.49E-2,1.2500000000000001E-2,2.3999999999999994E-3,null,1.3299999999999999E-2,201301]
[206,"NEWBURYPORT   ",46062191,47847641,49834938,52014405,54300695,56390995,1991,0,null,633895,791106,933594,985930,732783,633895,791106,933594,985930,732783,1.38E-2,1.6500000000000001E-2,1.8700000000000001E-2,1.9E-2,1.35E-2,null,1.7100000000000001E-2,1.6199999999999999E-2,null,1.9E-2,1.61E-2,2.8999999999999998E-3,null,1.7100000000000001E-2,964286]
[207,"NEWTON        ",267928435,279763291,291557071,304419021,317791878,331342536,0,0,null,5136645,4799698,5573023,5762382,5605861,5136645,4799698,5573023,5762382,5605861,1.9199999999999998E-2,1.72E-2,1.9099999999999999E-2,1.89E-2,1.7600000000000001E-2,null,1.8499999999999999E-2,1.7899999999999999E-2,null,1.9099999999999999E-2,1.83E-2,7.9999999999999863E-4,null,1.8499999999999999E-2,6129837]
[208,"NORFOLK       ",22298067,23546056,24707393,25835807,27154211,28416056,1994,0,null,690537,572686,510729,672509,569520,690537,572686,510729,672509,569520,3.1E-2,2.4299999999999999E-2,2.07E-2,2.5999999999999999E-2,2.1000000000000001E-2,null,2.2599999999999999E-2,2.1999999999999999E-2,null,2.5999999999999999E-2,2.0899999999999998E-2,5.1000000000000004E-3,null,2.2599999999999999E-2,642203]
[209,"NORTH ADAMS   ",15019976,15745723,16317472,16996148,17777170,18814731,1994,0,null,350248,178106,270739,356118,593132,350248,178106,270739,356118,593132,2.3300000000000001E-2,1.1299999999999999E-2,1.66E-2,2.1000000000000001E-2,3.3399999999999999E-2,null,2.3699999999999999E-2,1.6299999999999999E-2,null,3.3399999999999999E-2,1.8800000000000001E-2,1.4599999999999998E-2,null,2.3699999999999999E-2,429755]
[210,"NORTH ANDOVER ",57066098,59123365,61172222,63568793,66285640,69283431,1991,0,null,630615,570773,867266,1127627,1340650,630615,570773,867266,1127627,1340650,1.11E-2,9.7000000000000003E-3,1.4200000000000001E-2,1.77E-2,2.0199999999999999E-2,null,1.7399999999999999E-2,1.3899999999999999E-2,null,2.0199999999999999E-2,1.6E-2,4.1999999999999989E-3,null,1.7399999999999999E-2,1205532]
[211,"NORTH ATTLEBOR",45350568,46801317,48404137,50026771,51795294,53714829,2003,0,null,316985,432787,412531,514911,624653,316985,432787,412531,514911,624653,7.0000000000000001E-3,9.1999999999999998E-3,8.5000000000000006E-3,1.03E-2,1.21E-2,null,1.03E-2,9.2999999999999992E-3,null,1.21E-2,9.4000000000000004E-3,2.6999999999999993E-3,null,1.03E-2,553263]
[212,"NORTH BROOKFIE",5011761,5224934,5433144,5665509,5879516,6092243,1991,1995,null,87879,77587,96536,72369,65739,87879,77587,96536,72369,65739,1.7500000000000002E-2,1.4800000000000001E-2,1.78E-2,1.2800000000000001E-2,1.12E-2,null,1.3899999999999999E-2,1.29E-2,null,1.78E-2,1.2E-2,5.7999999999999996E-3,null,1.3899999999999999E-2,84682]
[213,"NORTH READING ",36418214,37952950,39395666,40973829,42751903,44897945,1991,0,null,624281,493892,593271,753728,1077244,624281,493892,593271,753728,1077244,1.7100000000000001E-2,1.2999999999999999E-2,1.5100000000000001E-2,1.84E-2,2.52E-2,null,1.9599999999999999E-2,1.55E-2,null,2.52E-2,1.6799999999999999E-2,8.4000000000000012E-3,null,1.9599999999999999E-2,880000]
[214,"NORTHAMPTON   ",45427725,47501659,49422277,51621463,53843628,56252803,2000,0,null,938241,733076,963629,931482,1063084,938241,733076,963629,931482,1063084,2.07E-2,1.54E-2,1.95E-2,1.7999999999999999E-2,1.9699999999999999E-2,null,1.9099999999999999E-2,1.7600000000000001E-2,null,1.9699999999999999E-2,1.8800000000000001E-2,8.9999999999999802E-4,null,1.9099999999999999E-2,1074429]
[215,"NORTHBOROUGH  ",42462819,44053909,45849412,47578856,49406952,51381434,1991,0,null,529520,694155,583208,638625,768364,529520,694155,583208,638625,768364,1.2500000000000001E-2,1.5800000000000002E-2,1.2699999999999999E-2,1.34E-2,1.5599999999999999E-2,null,1.3899999999999999E-2,1.3899999999999999E-2,null,1.5599999999999999E-2,1.3100000000000001E-2,2.4999999999999988E-3,null,1.3899999999999999E-2,714202]
[216,"NORTHBRIDGE   ",18343481,19121428,19900889,20730783,21523768,22299325,1993,0,null,319360,301426,327943,274715,237463,319360,301426,327943,274715,237463,1.7399999999999999E-2,1.5800000000000002E-2,1.6500000000000001E-2,1.3299999999999999E-2,1.0999999999999999E-2,null,1.3599999999999999E-2,1.34E-2,null,1.6500000000000001E-2,1.2200000000000001E-2,4.3E-3,null,1.3599999999999999E-2,303271]
[217,"NORTHFIELD    ",5641592,5986755,6456545,6829097,7621572,7959062,0,0,null,204123,320121,211138,621747,146951,204123,320121,211138,621747,146951,3.6200000000000003E-2,5.3499999999999999E-2,3.27E-2,9.0999999999999998E-2,1.9300000000000001E-2,null,4.7699999999999999E-2,3.5200000000000002E-2,null,9.0999999999999998E-2,2.5999999999999999E-2,6.5000000000000002E-2,null,3.5200000000000002E-2,280159]
[218,"NORTON        ",30299731,31493229,32979406,34510608,36577459,38391163,2000,0,null,436005,698846,706717,1204086,899268,436005,698846,706717,1204086,899268,1.44E-2,2.2200000000000001E-2,2.1399999999999999E-2,3.49E-2,2.46E-2,null,2.7E-2,2.2700000000000001E-2,null,3.49E-2,2.3E-2,1.1900000000000001E-2,null,2.7E-2,1036561]
[219,"NORWELL       ",36127529,37580511,39036095,40555652,42096210,43541859,0,0,null,549794,512899,543655,516377,393244,549794,512899,543655,516377,393244,1.52E-2,1.3599999999999999E-2,1.3899999999999999E-2,1.2699999999999999E-2,9.2999999999999992E-3,null,1.2E-2,1.1900000000000001E-2,null,1.3899999999999999E-2,1.0999999999999999E-2,2.8999999999999998E-3,null,1.2E-2,522502]
[220,"NORWOOD       ",62846997,65319412,68098582,71002135,73656770,83324094,1991,0,null,901240,1146185,1201088,879582,1849602,901240,1146185,1201088,879582,1849602,1.43E-2,1.7500000000000002E-2,1.7600000000000001E-2,1.24E-2,2.5100000000000001E-2,null,1.84E-2,1.5800000000000002E-2,null,2.5100000000000001E-2,1.4999999999999999E-2,1.0100000000000001E-2,null,1.84E-2,1533163]
[221,"OAK BLUFFS    ",16743835,17332792,17957327,18624587,19375589,20082735,0,0,null,170361,191215,218326,285387,222259,170361,191215,218326,285387,222259,1.0200000000000001E-2,1.0999999999999999E-2,1.2200000000000001E-2,1.5299999999999999E-2,1.15E-2,null,1.2999999999999999E-2,1.1599999999999999E-2,null,1.5299999999999999E-2,1.1900000000000001E-2,3.3999999999999985E-3,null,1.2999999999999999E-2,261076]
[222,"OAKHAM        ",2422264,2497475,2574775,2656564,2770022,2792471,0,0,null,14654,14863,17419,47044,28199,14654,14863,17419,47044,28199,6.0000000000000001E-3,6.0000000000000001E-3,6.7999999999999996E-3,1.77E-2,1.0200000000000001E-2,null,1.1599999999999999E-2,7.7000000000000002E-3,null,1.77E-2,8.5000000000000006E-3,9.1999999999999998E-3,null,1.1599999999999999E-2,32393]
[223,"ORANGE        ",9173376,9486166,9822680,10135297,10504154,10846603,2005,0,null,83456,99360,67050,115475,79845,83456,99360,67050,115475,79845,9.1000000000000004E-3,1.0500000000000001E-2,6.7999999999999996E-3,1.14E-2,7.6E-3,null,8.6E-3,8.3000000000000001E-3,null,1.14E-2,7.1999999999999998E-3,4.2000000000000006E-3,null,8.6E-3,93281]
[224,"ORLEANS       ",18867244,19563917,20274325,21025980,21814246,22590464,1991,2001,null,224992,221310,244797,262616,230861,224992,221310,244797,262616,230861,1.1900000000000001E-2,1.1299999999999999E-2,1.21E-2,1.2500000000000001E-2,1.06E-2,null,1.17E-2,1.1299999999999999E-2,null,1.2500000000000001E-2,1.14E-2,1.1000000000000003E-3,null,1.17E-2,264308]
[225,"OTIS          ",4113844,4249537,4398675,4550248,4696742,4848898,1992,0,null,32847,42899,41606,32738,34737,32847,42899,41606,32738,34737,8.0000000000000002E-3,1.01E-2,9.4999999999999998E-3,7.1999999999999998E-3,7.4000000000000003E-3,null,8.0000000000000002E-3,8.0000000000000002E-3,null,9.4999999999999998E-3,7.3000000000000001E-3,2.1999999999999997E-3,null,8.0000000000000002E-3,38791]
[226,"OXFORD        ",19494796,20270648,21064981,22237627,23278922,0,2004,0,null,288482,287567,646021,485354,0,288482,287567,646021,485354,0,1.4800000000000001E-2,1.4200000000000001E-2,3.0700000000000002E-2,2.18E-2,0,null,2.2200000000000001E-2,1.6899999999999998E-2,null,3.0700000000000002E-2,1.7999999999999999E-2,1.2700000000000003E-2,null,2.2200000000000001E-2,541185]
[227,"PALMER        ",16524998,17087964,17709659,18468917,19116646,19780028,1991,0,null,149841,194496,316517,183950,185466,149841,194496,316517,183950,185466,9.1000000000000004E-3,1.14E-2,1.7899999999999999E-2,0.01,9.7000000000000003E-3,null,1.2500000000000001E-2,1.04E-2,null,1.7899999999999999E-2,9.9000000000000008E-3,7.9999999999999984E-3,null,1.2500000000000001E-2,247250]
[228,"PAXTON        ",7839559,8107407,8459855,8819707,9194642,9545237,2005,0,null,71859,149763,148356,154443,120729,71859,149763,148356,154443,120729,9.1999999999999998E-3,1.8499999999999999E-2,1.7500000000000002E-2,1.7500000000000002E-2,1.3100000000000001E-2,null,1.6E-2,1.6E-2,null,1.7500000000000002E-2,1.5299999999999999E-2,2.2000000000000023E-3,null,1.6E-2,152724]
[229,"PEABODY       ",103360677,107064546,110787135,114596472,118533936,122866207,0,0,null,1119809,1045975,1039659,1072552,1368923,1119809,1045975,1039659,1072552,1368923,1.0800000000000001E-2,9.7999999999999997E-3,9.4000000000000004E-3,9.4000000000000004E-3,1.15E-2,null,1.01E-2,9.4999999999999998E-3,null,1.15E-2,9.4000000000000004E-3,2.0999999999999994E-3,null,1.01E-2,1240949]
[230,"PELHAM        ",3214692,3325336,3555040,3665542,3768246,3881125,1991,0,null,30276,146571,21626,11066,18673,30276,146571,21626,11066,18673,9.4000000000000004E-3,4.41E-2,6.1000000000000004E-3,3.0000000000000001E-3,5.0000000000000001E-3,null,4.7000000000000002E-3,4.7000000000000002E-3,null,6.1000000000000004E-3,4.0000000000000001E-3,2.1000000000000003E-3,null,4.7000000000000002E-3,18241]
[231,"PEMBROKE      ",32826684,33986383,35216099,36772902,38129305,39499337,2004,0,null,339032,379588,676401,437080,416799,339032,379588,676401,437080,416799,1.03E-2,1.12E-2,1.9199999999999998E-2,1.1900000000000001E-2,1.09E-2,null,1.4E-2,1.1299999999999999E-2,null,1.9199999999999998E-2,1.14E-2,7.7999999999999979E-3,null,1.4E-2,552991]
[232,"PEPPERELL     ",16365516,16909565,17506299,18294064,19005032,21176319,0,0,null,134912,173995,350107,253064,296162,134912,173995,350107,253064,296162,8.2000000000000007E-3,1.03E-2,0.02,1.38E-2,1.5599999999999999E-2,null,1.6500000000000001E-2,1.32E-2,null,0.02,1.47E-2,5.3000000000000009E-3,null,1.6500000000000001E-2,349409]
[233,"PERU          ",1778473,1846860,1898694,1956346,2037506,2168834,0,0,null,23925,5662,10185,32251,79778,23925,5662,10185,32251,79778,1.35E-2,3.0999999999999999E-3,5.4000000000000003E-3,1.6500000000000001E-2,3.9199999999999999E-2,null,2.0400000000000001E-2,8.3000000000000001E-3,null,3.9199999999999999E-2,1.0999999999999999E-2,2.8199999999999999E-2,null,8.3000000000000001E-3,18001]
[234,"PETERSHAM     ",2360625,2431825,2502979,2588773,2673214,2756054,0,0,null,12184,10358,23220,19722,16010,12184,10358,23220,19722,16010,5.1999999999999998E-3,4.3E-3,9.2999999999999992E-3,7.6E-3,6.0000000000000001E-3,null,7.6E-3,6.0000000000000001E-3,null,9.2999999999999992E-3,6.7999999999999996E-3,2.4999999999999996E-3,null,7.6E-3,20946]
[235,"PHILLIPSTON   ",1983428,2052643,2136588,2269998,2372268,2572875,0,0,null,19629,32629,75089,35339,48248,19629,32629,75089,35339,48248,9.9000000000000008E-3,1.5900000000000001E-2,3.5099999999999999E-2,1.5599999999999999E-2,2.0299999999999999E-2,null,2.3699999999999999E-2,1.7299999999999999E-2,null,3.5099999999999999E-2,1.7999999999999999E-2,1.7100000000000001E-2,null,2.3699999999999999E-2,60977]
[236,"PITTSFIELD    ",81964865,83579125,84001992,86959318,89534132,92117152,1996,0,null,1271090,1555705,1566185,1967739,1556217,1271090,1555705,1566185,1967739,1556217,1.55E-2,1.8599999999999998E-2,1.8599999999999998E-2,2.2599999999999999E-2,1.7399999999999999E-2,null,1.95E-2,1.8200000000000001E-2,null,2.2599999999999999E-2,1.7999999999999999E-2,4.5999999999999999E-3,null,1.95E-2,1745916]
[237,"PLAINFIELD    ",1430096,1547082,1628254,1708281,1760548,1890204,0,0,null,81234,42495,39320,9560,73153,81234,42495,39320,9560,73153,5.6800000000000003E-2,2.75E-2,2.41E-2,5.5999999999999999E-3,4.1599999999999998E-2,null,2.3800000000000002E-2,1.9099999999999999E-2,null,4.1599999999999998E-2,1.49E-2,2.6699999999999998E-2,null,1.9099999999999999E-2,36103]
[238,"PLAINVILLE    ",16135126,17715870,18678750,19740039,20689665,21757359,1991,0,null,1177366,519983,594321,456125,550452,1177366,519983,594321,456125,550452,7.2999999999999995E-2,2.9399999999999999E-2,3.1800000000000002E-2,2.3099999999999999E-2,2.6599999999999999E-2,null,2.7199999999999998E-2,2.64E-2,null,3.1800000000000002E-2,2.4899999999999999E-2,6.9000000000000034E-3,null,2.7199999999999998E-2,591800]
[239,"PLYMOUTH      ",142002362,148423560,155423807,162811487,170642498,179332150,2007,0,null,2871139,3289658,3502085,3760724,4423590,2871139,3289658,3502085,3760724,4423590,2.0199999999999999E-2,2.2200000000000001E-2,2.2499999999999999E-2,2.3099999999999999E-2,2.5899999999999999E-2,null,2.3800000000000002E-2,2.2599999999999999E-2,null,2.5899999999999999E-2,2.2800000000000001E-2,3.0999999999999986E-3,null,2.3800000000000002E-2,4268105]
[240,"PLYMPTON      ",8271331,8569479,8881419,9404890,9718362,10053825,0,0,null,89141,97703,301436,78350,82521,89141,97703,301436,78350,82521,1.0800000000000001E-2,1.14E-2,3.39E-2,8.3000000000000001E-3,8.5000000000000006E-3,null,1.6899999999999998E-2,9.4000000000000004E-3,null,3.39E-2,8.3999999999999995E-3,2.5500000000000002E-2,null,9.4000000000000004E-3,94506]
[241,"PRINCETON     ",8043997,8266237,8498399,8809942,9157587,9554494,0,0,null,21140,25506,99083,127396,167967,21140,25506,99083,127396,167967,2.5999999999999999E-3,3.0999999999999999E-3,1.17E-2,1.4500000000000001E-2,1.83E-2,null,1.4800000000000001E-2,9.7999999999999997E-3,null,1.83E-2,1.3100000000000001E-2,5.1999999999999998E-3,null,1.4800000000000001E-2,141407]
[242,"PROVINCETOWN  ",16632692,17216993,17941024,18617293,19270041,20041863,2003,2016,null,165534,293606,227743,187316,290071,331068,293606,227743,187316,290071,1.9900000000000001E-2,1.7100000000000001E-2,1.2699999999999999E-2,1.01E-2,1.5100000000000001E-2,null,1.26E-2,1.26E-2,null,1.5100000000000001E-2,1.14E-2,3.7000000000000002E-3,null,1.26E-2,252527]
[243,"QUINCY        ",217531004,225137473,235419728,248073180,260842479,272751243,2000,0,null,2105938,4653818,6767959,6567469,5680056,2105938,4653818,6767959,6567469,5680056,9.7000000000000003E-3,2.07E-2,2.87E-2,2.6499999999999999E-2,2.18E-2,null,2.5700000000000001E-2,2.3E-2,null,2.87E-2,2.4199999999999999E-2,4.5000000000000005E-3,null,2.5700000000000001E-2,7009707]
[244,"RANDOLPH      ",47547872,49138736,50914048,52762092,54835650,57058211,0,0,null,395759,546844,575193,754506,851670,395759,546844,575193,754506,851670,8.3000000000000001E-3,1.11E-2,1.1299999999999999E-2,1.43E-2,1.55E-2,null,1.37E-2,1.2200000000000001E-2,null,1.55E-2,1.2800000000000001E-2,2.6999999999999993E-3,null,1.37E-2,781697]
[245,"RAYNHAM       ",26848394,27537444,28718635,30118218,31468796,32858631,1993,0,null,646553,492755,679361,597622,606902,646553,492755,679361,597622,606902,2.41E-2,1.7899999999999999E-2,2.3699999999999999E-2,1.9800000000000002E-2,1.9300000000000001E-2,null,2.0899999999999998E-2,1.9E-2,null,2.3699999999999999E-2,1.9599999999999999E-2,4.0999999999999995E-3,null,2.0899999999999998E-2,686745]
[246,"READING       ",47642938,49746497,51706807,53841449,56027149,58049650,1991,0,null,912485,716648,841972,839664,592835,912485,716648,841972,839664,592835,1.9199999999999998E-2,1.44E-2,1.6299999999999999E-2,1.5599999999999999E-2,1.06E-2,null,1.4200000000000001E-2,1.35E-2,null,1.6299999999999999E-2,1.3100000000000001E-2,3.199999999999998E-3,null,1.4200000000000001E-2,824305]
[247,"REHOBOTH      ",19182021,19929273,20635479,21427940,22305918,23332148,0,0,null,267701,207974,276574,342279,468582,267701,207974,276574,342279,468582,1.4E-2,1.04E-2,1.34E-2,1.6E-2,2.1000000000000001E-2,null,1.6799999999999999E-2,1.3299999999999999E-2,null,2.1000000000000001E-2,1.47E-2,6.3000000000000018E-3,null,1.6799999999999999E-2,391980]
[248,"REVERE        ",72494502,75555755,79270646,82685765,86416689,90539665,1991,0,null,1248890,1825997,1415191,1663780,1957926,1248890,1825997,1415191,1663780,1957926,1.72E-2,2.4199999999999999E-2,1.7899999999999999E-2,2.01E-2,2.2700000000000001E-2,null,2.0199999999999999E-2,2.0199999999999999E-2,null,2.2700000000000001E-2,1.9E-2,3.7000000000000019E-3,null,2.0199999999999999E-2,1828901]
[249,"RICHMOND      ",4488072,4633701,4803408,4961053,5131596,5318609,0,0,null,33427,53864,37560,46517,58723,33427,53864,37560,46517,58723,7.4000000000000003E-3,1.1599999999999999E-2,7.7999999999999996E-3,9.4000000000000004E-3,1.14E-2,null,9.4999999999999998E-3,9.4999999999999998E-3,null,1.14E-2,8.6E-3,2.8000000000000004E-3,null,9.4999999999999998E-3,50527]
[250,"ROCHESTER     ",9746480,10180936,10611456,11192983,11651128,12327242,1991,0,null,190794,175996,316241,198179,384836,190794,175996,316241,198179,384836,1.9599999999999999E-2,1.7299999999999999E-2,2.98E-2,1.77E-2,3.3000000000000002E-2,null,2.6800000000000001E-2,2.1600000000000001E-2,null,3.3000000000000002E-2,2.3800000000000002E-2,9.1999999999999998E-3,null,2.6800000000000001E-2,330370]
[251,"ROCKLAND      ",25383879,26775187,27782975,28784836,29921077,30946342,2007,0,null,756711,338408,307286,414903,277238,756711,338408,307286,414903,277238,2.98E-2,1.26E-2,1.11E-2,1.44E-2,9.2999999999999992E-3,null,1.1599999999999999E-2,1.0999999999999999E-2,null,1.44E-2,1.0200000000000001E-2,4.1999999999999989E-3,null,1.1599999999999999E-2,358978]
[252,"ROCKPORT      ",16477427,17041512,17721421,18370320,18994428,19672313,0,0,null,135571,253872,205864,164850,203024,135571,253872,205864,164850,203024,8.2000000000000007E-3,1.49E-2,1.1599999999999999E-2,8.9999999999999993E-3,1.0699999999999999E-2,null,1.04E-2,1.04E-2,null,1.1599999999999999E-2,9.9000000000000008E-3,1.6999999999999984E-3,null,1.04E-2,204592]
[253,"ROWE          ",3243190,3368969,3466267,3574066,4248259,4369678,1992,0,null,44699,13074,21142,584841,15213,44699,13074,21142,584841,15213,1.38E-2,3.8999999999999998E-3,6.1000000000000004E-3,0.1636,3.5999999999999999E-3,null,5.7799999999999997E-2,4.4999999999999997E-3,null,0.1636,4.8999999999999998E-3,0.15870000000000001,null,4.4999999999999997E-3,19664]
[254,"ROWLEY        ",11429854,11899227,12321212,12774587,13218974,13851903,2001,0,null,183627,124504,145345,125022,302454,183627,124504,145345,125022,302454,1.61E-2,1.0500000000000001E-2,1.18E-2,9.7999999999999997E-3,2.29E-2,null,1.4800000000000001E-2,1.0699999999999999E-2,null,2.29E-2,1.0800000000000001E-2,1.21E-2,null,1.4800000000000001E-2,205008]
[255,"ROYALSTON     ",1287501,1331894,1383683,1439339,1493489,0,0,0,null,12205,18492,21064,18166,14825,12205,18492,21064,18166,14825,9.4999999999999998E-3,1.3899999999999999E-2,1.52E-2,1.26E-2,9.9000000000000008E-3,null,1.26E-2,1.21E-2,null,1.52E-2,1.1299999999999999E-2,3.9000000000000007E-3,null,1.26E-2,19526]
[256,"RUSSELL       ",2964157,3079079,3190966,3319384,3427807,3550260,1991,0,null,40818,32437,48644,25438,36758,40818,32437,48644,25438,36758,1.38E-2,1.0500000000000001E-2,1.52E-2,7.7000000000000002E-3,1.0699999999999999E-2,null,1.12E-2,9.5999999999999992E-3,null,1.52E-2,9.1999999999999998E-3,6.0000000000000001E-3,null,1.12E-2,39763]
[257,"RUTLAND       ",11396232,11991001,12561606,13441049,14272876,14993230,2007,0,null,309022,259886,558610,486071,363532,309022,259886,558610,486071,363532,2.7099999999999999E-2,2.1700000000000001E-2,4.4499999999999998E-2,3.6200000000000003E-2,2.5499999999999998E-2,null,3.5400000000000001E-2,2.7799999999999998E-2,null,4.4499999999999998E-2,3.09E-2,1.3599999999999998E-2,null,3.5400000000000001E-2,530760]
[258,"SALEM         ",83270410,86548205,90563116,95321556,99208798,107591472,1991,0,null,1196035,1851206,2494362,1500919,5902454,1196035,1851206,2494362,1500919,5902454,1.44E-2,2.1399999999999999E-2,2.75E-2,1.5699999999999999E-2,5.9499999999999997E-2,null,3.4200000000000001E-2,2.1499999999999998E-2,null,5.9499999999999997E-2,2.1600000000000001E-2,3.7899999999999996E-2,null,2.1499999999999998E-2,2313217]
[259,"SALISBURY     ",16949641,17808114,18562229,19427399,20232635,21513215,0,0,null,434732,308912,401114,319551,324764,434732,308912,401114,319551,324764,2.5600000000000001E-2,1.7299999999999999E-2,2.1600000000000001E-2,1.6400000000000001E-2,1.61E-2,null,1.7999999999999999E-2,1.66E-2,null,2.1600000000000001E-2,1.6299999999999999E-2,5.3000000000000026E-3,null,1.7999999999999999E-2,387238]
[260,"SANDISFIELD   ",2767331,2852760,2935167,3018886,3125227,3227269,1991,0,null,16246,11088,10340,30869,23911,16246,11088,10340,30869,23911,5.8999999999999999E-3,3.8999999999999998E-3,3.5000000000000001E-3,1.0200000000000001E-2,7.7000000000000002E-3,null,7.1000000000000004E-3,5.0000000000000001E-3,null,1.0200000000000001E-2,5.5999999999999999E-3,4.6000000000000008E-3,null,7.1000000000000004E-3,22914]
[261,"SANDWICH      ",44910186,46684096,48411748,50644088,52505265,57938685,1992,0,null,651155,560550,1022046,595074,4120788,651155,560550,1022046,595074,4120788,1.4500000000000001E-2,1.2E-2,2.1100000000000001E-2,1.18E-2,7.85E-2,null,3.7100000000000001E-2,1.4999999999999999E-2,null,7.85E-2,1.6500000000000001E-2,6.2E-2,null,1.4999999999999999E-2,869080]
[262,"SAUGUS        ",56139325,58020770,60215392,62519141,64944694,68007835,1991,0,null,477878,744103,792016,862574,1439524,477878,744103,792016,862574,1439524,8.5000000000000006E-3,1.2800000000000001E-2,1.32E-2,1.38E-2,2.2200000000000001E-2,null,1.6400000000000001E-2,1.3299999999999999E-2,null,2.2200000000000001E-2,1.35E-2,8.7000000000000011E-3,null,1.6400000000000001E-2,1115328]
[263,"SAVOY         ",1019141,1076901,1113216,1157519,1202874,1275917,0,0,null,30667,9392,16473,16417,42971,30667,9392,16473,16417,42971,3.0099999999999998E-2,8.6999999999999994E-3,1.4800000000000001E-2,1.4200000000000001E-2,3.5700000000000003E-2,null,2.1600000000000001E-2,1.26E-2,null,3.5700000000000003E-2,1.4500000000000001E-2,2.1200000000000004E-2,null,1.26E-2,16077]
[264,"SCITUATE      ",43380956,44998195,46631722,48369781,50415801,52662121,1992,0,null,532715,508572,572266,836775,985925,532715,508572,572266,836775,985925,1.23E-2,1.1299999999999999E-2,1.23E-2,1.7299999999999999E-2,1.9599999999999999E-2,null,1.6400000000000001E-2,1.3599999999999999E-2,null,1.9599999999999999E-2,1.4800000000000001E-2,4.7999999999999987E-3,null,1.6400000000000001E-2,863659]
[265,"SEEKONK       ",33762555,35313054,36955455,38770631,40656429,42777102,2004,0,null,706435,759167,891290,916532,1104262,706435,759167,891290,916532,1104262,2.0899999999999998E-2,2.1499999999999998E-2,2.41E-2,2.3599999999999999E-2,2.7199999999999998E-2,null,2.5000000000000001E-2,2.3099999999999999E-2,null,2.7199999999999998E-2,2.3900000000000001E-2,3.2999999999999974E-3,null,2.5000000000000001E-2,1069428]
[266,"SHARON        ",46941849,48553616,50221633,52194884,53987495,55764024,2011,0,null,438221,453829,717710,487739,425960,438221,453829,717710,487739,425960,9.2999999999999992E-3,9.2999999999999992E-3,1.43E-2,9.2999999999999992E-3,7.9000000000000008E-3,null,1.0500000000000001E-2,8.8000000000000005E-3,null,1.43E-2,8.6E-3,5.7000000000000002E-3,null,1.0500000000000001E-2,585522]
[267,"SHEFFIELD     ",8657716,9031419,9321862,9683750,10052845,10571830,2004,0,null,157260,64658,128841,127001,267664,157260,64658,128841,127001,267664,1.8200000000000001E-2,7.1999999999999998E-3,1.38E-2,1.3100000000000001E-2,2.6599999999999999E-2,null,1.78E-2,1.14E-2,null,2.6599999999999999E-2,1.35E-2,1.3099999999999999E-2,null,1.78E-2,188179]
[268,"SHELBURNE     ",3202602,3348914,3521348,3648850,3863209,4029212,0,0,null,66247,88711,39468,123138,74158,66247,88711,39468,123138,74158,2.07E-2,2.6499999999999999E-2,1.12E-2,3.3700000000000001E-2,1.9199999999999998E-2,null,2.1399999999999999E-2,1.9E-2,null,3.3700000000000001E-2,1.52E-2,1.8500000000000003E-2,null,2.1399999999999999E-2,86225]
[269,"SHERBORN      ",17026058,17630632,18171914,18938857,19670708,20408518,0,0,null,178923,100516,312646,258379,246043,178923,100516,312646,258379,246043,1.0500000000000001E-2,5.7000000000000002E-3,1.72E-2,1.3599999999999999E-2,1.2500000000000001E-2,null,1.44E-2,1.06E-2,null,1.72E-2,1.3100000000000001E-2,4.0999999999999995E-3,null,1.44E-2,293883]
[270,"SHIRLEY       ",8273620,8620417,9004417,9391341,9749303,10177100,1994,0,null,139956,168490,161814,123103,184065,139956,168490,161814,123103,184065,1.6899999999999998E-2,1.95E-2,1.7999999999999999E-2,1.3100000000000001E-2,1.89E-2,null,1.67E-2,1.67E-2,null,1.89E-2,1.5599999999999999E-2,3.3000000000000008E-3,null,1.67E-2,169958]
[271,"SHREWSBURY    ",55163759,57509996,59993053,62792735,65969822,68742114,1991,0,null,959612,953185,1299856,1597448,1121615,959612,953185,1299856,1597448,1121615,1.7399999999999999E-2,1.66E-2,2.1700000000000001E-2,2.5399999999999999E-2,1.7000000000000001E-2,null,2.1399999999999999E-2,1.84E-2,null,2.5399999999999999E-2,1.9400000000000001E-2,5.9999999999999984E-3,null,2.1399999999999999E-2,1471081]
[272,"SHUTESBURY    ",3917546,4042254,4175638,4312691,4499514,4684879,1991,0,null,26769,32328,32546,79005,72877,26769,32328,32546,79005,72877,6.7999999999999996E-3,8.0000000000000002E-3,7.7999999999999996E-3,1.83E-2,1.6199999999999999E-2,null,1.41E-2,1.0699999999999999E-2,null,1.83E-2,1.2E-2,6.3E-3,null,1.41E-2,66057]
[273,"SOMERSET      ",50754952,51760191,51928234,53534572,54438515,56581414,0,0,null,314862,339321,308132,141257,781936,314862,339321,308132,141257,781936,6.1999999999999998E-3,6.6E-3,5.8999999999999999E-3,2.5999999999999999E-3,1.44E-2,null,7.6E-3,5.0000000000000001E-3,null,1.44E-2,4.3E-3,1.01E-2,null,7.6E-3,413733]
[274,"SOMERVILLE    ",123036937,129440163,137032678,145062349,155996513,168272052,1991,0,null,3326937,4356511,4398128,7307605,8375626,3326937,4356511,4398128,7307605,8375626,2.7E-2,3.3700000000000001E-2,3.2099999999999997E-2,5.04E-2,5.3699999999999998E-2,null,4.5400000000000003E-2,3.8699999999999998E-2,null,5.3699999999999998E-2,4.1300000000000003E-2,1.2399999999999994E-2,null,4.5400000000000003E-2,7639551]
[275,"SOUTH HADLEY  ",23392639,24177266,25167319,26151095,27040090,27987337,1991,0,null,199811,385621,354593,235218,271245,199811,385621,354593,235218,271245,8.5000000000000006E-3,1.5900000000000001E-2,1.41E-2,8.9999999999999993E-3,0.01,null,1.0999999999999999E-2,1.0999999999999999E-2,null,1.41E-2,9.4999999999999998E-3,4.5999999999999999E-3,null,1.0999999999999999E-2,307861]
[276,"SOUTHAMPTON   ",9659836,10096011,10526111,10913245,11328270,11813272,1991,0,null,194679,177700,123981,142194,201795,194679,177700,123981,142194,201795,2.0199999999999999E-2,1.7600000000000001E-2,1.18E-2,1.2999999999999999E-2,1.78E-2,null,1.4200000000000001E-2,1.41E-2,null,1.78E-2,1.24E-2,5.4000000000000003E-3,null,1.4200000000000001E-2,167748]
[277,"SOUTHBOROUGH  ",34011406,35565954,36969762,38549091,40136494,42035158,1999,0,null,704263,514659,655085,623675,895251,704263,514659,655085,623675,895251,2.07E-2,1.4500000000000001E-2,1.77E-2,1.6199999999999999E-2,2.23E-2,null,1.8700000000000001E-2,1.61E-2,null,2.23E-2,1.7000000000000001E-2,5.2999999999999992E-3,null,1.8700000000000001E-2,786057]
[278,"SOUTHBRIDGE   ",18453786,19151014,19904455,20829980,21603094,22413899,1994,0,null,235883,274666,427914,252364,270728,235883,274666,427914,252364,270728,1.2800000000000001E-2,1.43E-2,2.1499999999999998E-2,1.21E-2,1.2500000000000001E-2,null,1.54E-2,1.2999999999999999E-2,null,2.1499999999999998E-2,1.23E-2,9.1999999999999981E-3,null,1.54E-2,345174]
[279,"SOUTHWICK     ",16404944,17058447,17759877,18404978,19183577,20110144,1991,0,null,243379,274969,201104,318475,446978,243379,274969,201104,318475,446978,1.4800000000000001E-2,1.61E-2,1.1299999999999999E-2,1.7299999999999999E-2,2.3300000000000001E-2,null,1.7299999999999999E-2,1.49E-2,null,2.3300000000000001E-2,1.43E-2,9.0000000000000011E-3,null,1.7299999999999999E-2,347905]
[280,"SPENCER       ",10547955,10921566,11423384,12249994,12791511,13269186,1991,0,null,109912,228779,541025,235267,157887,109912,228779,541025,235267,157887,1.04E-2,2.0899999999999998E-2,4.7399999999999998E-2,1.9199999999999998E-2,1.23E-2,null,2.63E-2,1.7500000000000002E-2,null,4.7399999999999998E-2,1.5800000000000002E-2,3.1599999999999996E-2,null,1.7500000000000002E-2,232211]
[281,"SPRINGFIELD   ",176123213,181910553,191434885,198331396,205316171,216375301,1995,0,null,5047901,4966608,4332083,5098516,5920463,5047901,4966608,4332083,5098516,5920463,2.87E-2,2.7300000000000001E-2,2.2599999999999999E-2,2.5700000000000001E-2,2.8799999999999999E-2,null,2.5700000000000001E-2,2.52E-2,null,2.8799999999999999E-2,2.4199999999999999E-2,4.5999999999999999E-3,null,2.5700000000000001E-2,5276626]
[282,"STERLING      ",15502599,16106102,16687080,17440737,18074895,18699541,0,0,null,215938,178326,336480,198140,172773,215938,178326,336480,198140,172773,1.3899999999999999E-2,1.11E-2,2.0199999999999999E-2,1.14E-2,9.5999999999999992E-3,null,1.37E-2,1.0699999999999999E-2,null,2.0199999999999999E-2,1.0500000000000001E-2,9.6999999999999986E-3,null,1.37E-2,256184]
[283,"STOCKBRIDGE   ",7469364,7708508,7952288,8201797,8500747,8788113,0,0,null,52410,51067,50702,93905,74847,52410,51067,50702,93905,74847,7.0000000000000001E-3,6.6E-3,6.4000000000000003E-3,1.14E-2,8.8000000000000005E-3,null,8.8999999999999999E-3,7.3000000000000001E-3,null,1.14E-2,7.6E-3,3.8000000000000004E-3,null,8.8999999999999999E-3,78214]
[284,"STONEHAM      ",42148283,43645235,45117658,46848986,48775845,50503191,2003,0,null,443245,381292,596929,755634,507950,443245,381292,596929,755634,507950,1.0500000000000001E-2,8.6999999999999994E-3,1.32E-2,1.61E-2,1.04E-2,null,1.32E-2,1.0800000000000001E-2,null,1.61E-2,1.18E-2,4.3E-3,null,1.32E-2,666642]
[285,"STOUGHTON     ",56778587,59357546,61450811,63668616,66125345,68706812,0,0,null,921425,609326,681535,865014,928333,921425,609326,681535,865014,928333,1.6199999999999999E-2,1.03E-2,1.11E-2,1.3599999999999999E-2,1.4E-2,null,1.29E-2,1.17E-2,null,1.4E-2,1.24E-2,1.6000000000000007E-3,null,1.29E-2,886318]
[286,"STOW          ",21312499,22127692,22930372,23862585,25030231,26472126,0,0,null,282381,249488,358954,571082,816139,282381,249488,358954,571082,816139,1.32E-2,1.1299999999999999E-2,1.5699999999999999E-2,2.3900000000000001E-2,3.2599999999999997E-2,null,2.41E-2,1.7000000000000001E-2,null,3.2599999999999997E-2,1.9800000000000002E-2,1.2799999999999995E-2,null,2.41E-2,637978]
[287,"STURBRIDGE    ",20713056,21466886,22292406,23216055,24101513,25017150,1991,0,null,236004,288848,363239,305057,313099,236004,288848,363239,305057,313099,1.14E-2,1.35E-2,1.6299999999999999E-2,1.3100000000000001E-2,1.2999999999999999E-2,null,1.41E-2,1.32E-2,null,1.6299999999999999E-2,1.3100000000000001E-2,3.199999999999998E-3,null,1.41E-2,352742]
[288,"SUDBURY       ",56582989,58598792,61312294,63828502,66825915,68383233,1991,0,null,601228,1248532,983400,1401700,963941,601228,1248532,983400,1401700,963941,1.06E-2,2.1299999999999999E-2,1.6E-2,2.1999999999999999E-2,1.44E-2,null,1.7500000000000002E-2,1.72E-2,null,2.1999999999999999E-2,1.52E-2,6.7999999999999988E-3,null,1.7500000000000002E-2,1196707]
[289,"SUNDERLAND    ",3702735,3837702,3964798,4104218,4246495,4612595,0,0,null,40488,31153,40300,39671,59937,40488,31153,40300,39671,59937,1.09E-2,8.0999999999999996E-3,1.0200000000000001E-2,9.7000000000000003E-3,1.41E-2,null,1.1299999999999999E-2,9.2999999999999992E-3,null,1.41E-2,0.01,4.0999999999999995E-3,null,1.1299999999999999E-2,52122]
[290,"SUTTON        ",15561216,16156655,17623114,18523637,19345475,20291607,0,0,null,206408,1062543,459945,358747,462495,206408,1062543,459945,358747,462495,1.3299999999999999E-2,6.5799999999999997E-2,2.6100000000000002E-2,1.9400000000000001E-2,2.3900000000000001E-2,null,2.3099999999999999E-2,2.3099999999999999E-2,null,2.6100000000000002E-2,2.1700000000000001E-2,4.4000000000000011E-3,null,2.3099999999999999E-2,468736]
[291,"SWAMPSCOTT    ",37018136,38643856,40259292,41882189,43367808,44831939,2005,0,null,700266,649339,616414,438564,379936,700266,649339,616414,438564,379936,1.89E-2,1.6799999999999999E-2,1.5299999999999999E-2,1.0500000000000001E-2,8.8000000000000005E-3,null,1.15E-2,1.15E-2,null,1.5299999999999999E-2,9.7000000000000003E-3,5.5999999999999991E-3,null,1.15E-2,515567]
[292,"SWANSEA       ",28416510,29610458,30897451,32161401,33646940,35127161,1991,0,null,483535,546732,491514,681504,640661,483535,546732,491514,681504,640661,1.7000000000000001E-2,1.8499999999999999E-2,1.5900000000000001E-2,2.12E-2,1.9E-2,null,1.8700000000000001E-2,1.78E-2,null,2.12E-2,1.7500000000000002E-2,3.6999999999999984E-3,null,1.8700000000000001E-2,656878]
[293,"TAUNTON       ",83171138,87834266,91918832,96427124,101092103,106324574,1993,0,null,2583850,1888709,2210321,2254301,2705168,2583850,1888709,2210321,2254301,2705168,3.1099999999999999E-2,2.1499999999999998E-2,2.4E-2,2.3400000000000001E-2,2.6800000000000001E-2,null,2.47E-2,2.3E-2,null,2.6800000000000001E-2,2.3699999999999999E-2,3.1000000000000021E-3,null,2.47E-2,2626217]
[294,"TEMPLETON     ",5872638,6118889,6340954,6584941,6853149,7158112,2008,0,null,94321,69092,62744,103584,133635,94321,69092,62744,103584,133635,1.61E-2,1.1299999999999999E-2,9.9000000000000008E-3,1.5699999999999999E-2,1.95E-2,null,1.4999999999999999E-2,1.23E-2,null,1.95E-2,1.2800000000000001E-2,6.6999999999999994E-3,null,1.4999999999999999E-2,107372]
[295,"TEWKSBURY     ",63555128,66810097,70189395,74376362,78416959,81546456,0,0,null,1666091,1674177,2432232,2181188,1169073,1666091,1674177,2432232,2181188,1169073,2.6200000000000001E-2,2.5100000000000001E-2,3.4700000000000002E-2,2.93E-2,1.49E-2,null,2.63E-2,2.3099999999999999E-2,null,3.4700000000000002E-2,2.2100000000000002E-2,1.26E-2,null,2.63E-2,2144672]
[296,"TISBURY       ",19423469,20120809,20859932,21778784,22735338,23590055,0,0,null,202179,236103,394588,412084,286334,202179,236103,394588,412084,286334,1.04E-2,1.17E-2,1.89E-2,1.89E-2,1.26E-2,null,1.6799999999999999E-2,1.44E-2,null,1.89E-2,1.5800000000000002E-2,3.0999999999999986E-3,null,1.6799999999999999E-2,396313]
[297,"TOLLAND       ",855313,909451,939097,984904,1026359,1065217,0,0,null,32755,6315,22329,16833,13146,32755,6315,22329,16833,13146,3.8300000000000001E-2,6.8999999999999999E-3,2.3800000000000002E-2,1.7100000000000001E-2,1.2800000000000001E-2,null,1.7899999999999999E-2,1.23E-2,null,2.3800000000000002E-2,1.4999999999999999E-2,8.8000000000000023E-3,null,1.7899999999999999E-2,19067]
[298,"TOPSFIELD     ",16168067,16914730,17423227,17938622,18462129,19855552,0,0,null,342461,85629,79814,75041,338802,342461,85629,79814,75041,338802,2.12E-2,5.1000000000000004E-3,4.5999999999999999E-3,4.1999999999999997E-3,1.84E-2,null,9.1000000000000004E-3,4.5999999999999999E-3,null,1.84E-2,4.4000000000000003E-3,1.3999999999999999E-2,null,9.1000000000000004E-3,180686]
[299,"TOWNSEND      ",12800551,13260416,13752029,14226488,14766609,15285466,0,0,null,139851,160102,130658,184459,149692,139851,160102,130658,184459,149692,1.09E-2,1.21E-2,9.4999999999999998E-3,1.2999999999999999E-2,1.01E-2,null,1.09E-2,1.06E-2,null,1.2999999999999999E-2,9.7999999999999997E-3,3.1999999999999997E-3,null,1.09E-2,166612]
[300,"TRURO         ",8811257,9165935,9521382,9884433,10245342,10189584,1991,1997,null,134397,126298,125016,113799,162985,134397,126298,125016,113799,162985,1.5299999999999999E-2,1.38E-2,1.3100000000000001E-2,1.15E-2,1.5900000000000001E-2,null,1.35E-2,1.2800000000000001E-2,null,1.5900000000000001E-2,1.23E-2,3.6000000000000008E-3,null,1.35E-2,137559]
[301,"TYNGSBOROUGH  ",23113154,23993663,24973562,26010114,27040694,28178290,2005,0,null,302680,380057,412213,380132,461504,302680,380057,412213,380132,461504,1.3100000000000001E-2,1.5800000000000002E-2,1.6500000000000001E-2,1.46E-2,1.7100000000000001E-2,null,1.61E-2,1.5599999999999999E-2,null,1.7100000000000001E-2,1.5599999999999999E-2,1.5000000000000013E-3,null,1.61E-2,453670]
[302,"TYRINGHAM     ",1315688,1359406,1395962,1441623,1489774,1533632,0,0,null,10826,2571,10762,12110,6614,10826,2571,10762,12110,6614,8.2000000000000007E-3,1.9E-3,7.7000000000000002E-3,8.3999999999999995E-3,4.4000000000000003E-3,null,6.7999999999999996E-3,4.7000000000000002E-3,null,8.3999999999999995E-3,6.1000000000000004E-3,2.2999999999999991E-3,null,6.7999999999999996E-3,10429]
[303,"UPTON         ",11147962,11571723,12281188,12953959,13656288,14360859,1991,0,null,145062,419650,365741,337358,363164,145062,419650,365741,337358,363164,1.2999999999999999E-2,3.6299999999999999E-2,2.98E-2,2.5999999999999999E-2,2.6599999999999999E-2,null,2.75E-2,2.75E-2,null,2.98E-2,2.63E-2,3.4999999999999996E-3,null,2.75E-2,394924]
[304,"UXBRIDGE      ",21650469,22727780,24245252,25241202,26405192,28122469,2005,0,null,536049,949278,389819,532960,1050948,536049,949278,389819,532960,1050948,2.4799999999999999E-2,4.1799999999999997E-2,1.61E-2,2.1100000000000001E-2,3.9800000000000002E-2,null,2.5700000000000001E-2,2.5700000000000001E-2,null,3.9800000000000002E-2,1.8599999999999998E-2,2.1200000000000004E-2,null,2.5700000000000001E-2,722747]
[305,"WAKEFIELD     ",60350740,62859640,65227825,68260862,71370427,74317122,1991,0,null,1000131,796694,1402341,1403043,1162434,1000131,796694,1402341,1403043,1162434,1.66E-2,1.2699999999999999E-2,2.1499999999999998E-2,2.06E-2,1.6299999999999999E-2,null,1.95E-2,1.6500000000000001E-2,null,2.1499999999999998E-2,1.8499999999999999E-2,2.9999999999999992E-3,null,1.95E-2,1449184]
[306,"WALES         ",2896334,2983300,3083290,3175954,3282099,3419431,1991,0,null,14558,25407,15582,26746,55280,14558,25407,15582,26746,55280,5.0000000000000001E-3,8.5000000000000006E-3,5.1000000000000004E-3,8.3999999999999995E-3,1.6799999999999999E-2,null,1.01E-2,7.3000000000000001E-3,null,1.6799999999999999E-2,6.7999999999999996E-3,9.9999999999999985E-3,null,1.01E-2,34536]
[307,"WALPOLE       ",55436719,57997151,60384756,62828403,65691452,68863605,1997,0,null,1174514,937676,934028,1292339,1529866,1174514,937676,934028,1292339,1529866,2.12E-2,1.6199999999999999E-2,1.55E-2,2.06E-2,2.3300000000000001E-2,null,1.9800000000000002E-2,1.7399999999999999E-2,null,2.3300000000000001E-2,1.8100000000000002E-2,5.1999999999999998E-3,null,1.9800000000000002E-2,1363499]
[308,"WALTHAM       ",178285048,188477935,198984814,209933737,219284328,231970809,0,0,null,5735761,5794931,5974303,4102248,7204373,5735761,5794931,5974303,4102248,7204373,3.2199999999999999E-2,3.0700000000000002E-2,0.03,1.95E-2,3.2899999999999999E-2,null,2.75E-2,2.6700000000000002E-2,null,3.2899999999999999E-2,2.4799999999999999E-2,8.0999999999999996E-3,null,2.75E-2,6379197]
[309,"WARE          ",13020800,13582024,14056255,14537902,15006396,15473335,1991,0,null,235704,133277,130241,105045,91779,235704,133277,130241,105045,91779,1.8100000000000002E-2,9.7999999999999997E-3,9.2999999999999992E-3,7.1999999999999998E-3,6.1000000000000004E-3,null,7.4999999999999997E-3,7.4999999999999997E-3,null,9.2999999999999992E-3,6.7000000000000002E-3,2.599999999999999E-3,null,7.4999999999999997E-3,116050]
[310,"WAREHAM       ",34981651,36344277,37654086,38990064,40402319,42001479,2003,0,null,488085,401202,394626,437503,589102,488085,401202,394626,437503,589102,1.4E-2,1.0999999999999999E-2,1.0500000000000001E-2,1.12E-2,1.46E-2,null,1.21E-2,1.09E-2,null,1.46E-2,1.09E-2,3.7000000000000002E-3,null,1.21E-2,508218]
[311,"WARREN        ",6673404,6891487,7131605,7717299,8001578,8333966,0,0,null,51248,67831,407404,91347,132349,51248,67831,407404,91347,132349,7.7000000000000002E-3,9.7999999999999997E-3,5.7099999999999998E-2,1.18E-2,1.6500000000000001E-2,null,2.8500000000000001E-2,1.2699999999999999E-2,null,5.7099999999999998E-2,1.4200000000000001E-2,4.2899999999999994E-2,null,1.2699999999999999E-2,105841]
[312,"WARWICK       ",1525063,1579485,1650651,1694498,1745377,1799561,0,0,null,16295,31679,2581,8517,10550,16295,31679,2581,8517,10550,1.0699999999999999E-2,2.01E-2,1.6000000000000001E-3,5.0000000000000001E-3,6.0000000000000001E-3,null,4.1999999999999997E-3,4.1999999999999997E-3,null,6.0000000000000001E-3,3.3E-3,2.7000000000000001E-3,null,4.1999999999999997E-3,7558]
[313,"WASHINGTON    ",917125,954890,996728,1046143,1092773,1125692,0,0,null,14837,17966,24497,20476,5600,14837,17966,24497,20476,5600,1.6199999999999999E-2,1.8800000000000001E-2,2.46E-2,1.9599999999999999E-2,5.1000000000000004E-3,null,1.6400000000000001E-2,1.4500000000000001E-2,null,2.46E-2,1.24E-2,1.2200000000000001E-2,null,1.6400000000000001E-2,18461]
[314,"WATERTOWN     ",86488677,90873906,95657980,101193510,109523765,117181127,1991,0,null,2223012,2512226,3144080,5800417,4919268,2223012,2512226,3144080,5800417,4919268,2.5700000000000001E-2,2.76E-2,3.2899999999999999E-2,5.7299999999999997E-2,4.4900000000000002E-2,null,4.4999999999999998E-2,3.5099999999999999E-2,null,5.7299999999999997E-2,3.8899999999999997E-2,1.84E-2,null,4.4999999999999998E-2,5273151]
[315,"WAYLAND       ",48392560,50576294,52642987,54681311,56484404,58453859,1991,0,null,973920,802285,694244,436060,543022,973920,802285,694244,436060,543022,2.01E-2,1.5900000000000001E-2,1.32E-2,8.0000000000000002E-3,9.5999999999999992E-3,null,1.03E-2,1.03E-2,null,1.32E-2,8.8000000000000005E-3,4.3999999999999994E-3,null,1.03E-2,602075]
[316,"WEBSTER       ",19151781,19935117,20679290,21524002,22355582,23233170,0,0,null,304541,245795,327730,293480,318698,304541,245795,327730,293480,318698,1.5900000000000001E-2,1.23E-2,1.5800000000000002E-2,1.3599999999999999E-2,1.43E-2,null,1.46E-2,1.34E-2,null,1.5800000000000002E-2,1.4E-2,1.8000000000000013E-3,null,1.46E-2,339204]
[317,"WELLESLEY     ",88155189,92052400,96603303,101191524,105821432,110269797,1991,0,null,1693331,2249593,2168677,2100119,1802830,1693331,2249593,2168677,2100119,1802830,1.9199999999999998E-2,2.4400000000000002E-2,2.24E-2,2.0799999999999999E-2,1.7000000000000001E-2,null,2.01E-2,2.01E-2,null,2.24E-2,1.89E-2,3.4999999999999996E-3,null,2.01E-2,2216423]
[318,"WELLFLEET     ",10872508,11253929,11654468,12086315,12519876,12984127,0,0,null,109608,119190,140486,131403,119554,109608,119190,140486,131403,119554,1.01E-2,1.06E-2,1.21E-2,1.09E-2,9.4999999999999998E-3,null,1.0800000000000001E-2,1.03E-2,null,1.21E-2,1.0200000000000001E-2,1.8999999999999989E-3,null,1.0800000000000001E-2,140229]
[319,"WENDELL       ",2147433,2240770,2319652,2332852,2373737,0,0,0,null,39651,22863,28890,52632,0,39651,22863,28890,52632,0,1.8499999999999999E-2,1.0200000000000001E-2,1.2500000000000001E-2,2.2599999999999999E-2,0,null,1.5100000000000001E-2,1.37E-2,null,2.2599999999999999E-2,1.14E-2,1.1199999999999998E-2,null,1.5100000000000001E-2,35843]
[320,"WENHAM        ",10073411,10402760,10753166,11230678,11798966,12818529,0,0,null,63095,90337,187557,287521,225444,63095,90337,187557,287521,225444,6.3E-3,8.6999999999999994E-3,1.7399999999999999E-2,2.5600000000000001E-2,1.9099999999999999E-2,null,2.07E-2,1.5100000000000001E-2,null,2.5600000000000001E-2,1.83E-2,7.3000000000000009E-3,null,2.07E-2,265344]
[321,"WEST BOYLSTON ",14866552,15415087,15893760,16621968,17321101,17966588,1991,0,null,176871,93296,330864,283584,212459,176871,93296,330864,283584,212459,1.1900000000000001E-2,6.1000000000000004E-3,2.0799999999999999E-2,1.7100000000000001E-2,1.23E-2,null,1.67E-2,1.18E-2,null,2.0799999999999999E-2,1.47E-2,6.0999999999999995E-3,null,1.67E-2,300042]
[322,"WEST BRIDGEWAT",19853783,20759599,21857033,23171922,24195675,25240719,1991,0,null,409471,578444,768463,444455,440152,409471,578444,768463,444455,440152,2.06E-2,2.7900000000000001E-2,3.5200000000000002E-2,1.9199999999999998E-2,1.8200000000000001E-2,null,2.4199999999999999E-2,2.18E-2,null,3.5200000000000002E-2,1.8700000000000001E-2,1.6500000000000001E-2,null,2.4199999999999999E-2,610825]
[323,"WEST BROOKFIEL",4886636,5161511,5398247,5688495,5907603,6218609,0,0,null,152709,104176,155292,76896,163316,152709,104176,155292,76896,163316,3.1300000000000001E-2,2.0199999999999999E-2,2.8799999999999999E-2,1.35E-2,2.76E-2,null,2.3300000000000001E-2,2.0400000000000001E-2,null,2.8799999999999999E-2,2.06E-2,8.199999999999999E-3,null,2.3300000000000001E-2,144894]
[324,"WEST NEWBURY  ",9584947,10012852,10549455,10921695,11305610,11731588,1993,0,null,188281,286282,108503,110872,143338,188281,286282,108503,110872,143338,1.9599999999999999E-2,2.86E-2,1.03E-2,1.0200000000000001E-2,1.2699999999999999E-2,null,1.11E-2,1.11E-2,null,1.2699999999999999E-2,1.03E-2,2.3999999999999994E-3,null,1.11E-2,130221]
[325,"WEST SPRINGFIE",66190302,67898393,69010238,70020189,70938030,71673901,0,0,null,1012016,1000212,1489537,1623098,997491,1012016,1000212,1489537,1623098,997491,1.5299999999999999E-2,1.47E-2,2.1600000000000001E-2,2.3199999999999998E-2,1.41E-2,null,1.9599999999999999E-2,1.6799999999999999E-2,null,2.3199999999999998E-2,1.7899999999999999E-2,5.2999999999999992E-3,null,1.9599999999999999E-2,1390385]
[326,"WEST STOCKBRID",5199928,5357302,5526501,5716812,5926880,6121927,0,0,null,27376,33185,52148,67148,46875,27376,33185,52148,67148,46875,5.3E-3,6.1999999999999998E-3,9.4000000000000004E-3,1.17E-2,7.9000000000000008E-3,null,9.7000000000000003E-3,7.7999999999999996E-3,null,1.17E-2,8.6999999999999994E-3,3.0000000000000009E-3,null,9.7000000000000003E-3,59383]
[327,"WEST TISBURY  ",9652884,10046689,10421030,10905907,11312744,11747230,0,0,null,152483,123174,224351,134189,151668,152483,123174,224351,134189,151668,1.5800000000000002E-2,1.23E-2,2.1499999999999998E-2,1.23E-2,1.34E-2,null,1.5699999999999999E-2,1.2699999999999999E-2,null,2.1499999999999998E-2,1.29E-2,8.5999999999999983E-3,null,1.5699999999999999E-2,184432]
[328,"WESTBOROUGH   ",69793544,73322434,77632120,81268153,84338470,87805268,1998,0,null,1784051,2476625,1695230,1038613,1358336,1784051,2476625,1695230,1038613,1358336,2.5600000000000001E-2,3.3799999999999997E-2,2.18E-2,1.2800000000000001E-2,1.61E-2,null,1.6899999999999998E-2,1.6899999999999998E-2,null,2.18E-2,1.4500000000000001E-2,7.2999999999999992E-3,null,1.6899999999999998E-2,1483909]
[329,"WESTFIELD     ",66178065,68967726,71768059,74937129,78163668,81172571,1991,0,null,1135209,1076140,1374869,1353111,1054811,1135209,1076140,1374869,1353111,1054811,1.72E-2,1.5599999999999999E-2,1.9199999999999998E-2,1.8100000000000002E-2,1.35E-2,null,1.6899999999999998E-2,1.5699999999999999E-2,null,1.9199999999999998E-2,1.5800000000000002E-2,3.3999999999999968E-3,null,1.6899999999999998E-2,1371816]
[330,"WESTFORD      ",60243961,62655841,64929659,66965306,69379681,70584010,1997,0,null,901454,707422,408857,740243,1069837,901454,707422,408857,740243,1069837,1.4999999999999999E-2,1.1299999999999999E-2,6.3E-3,1.11E-2,1.54E-2,null,1.09E-2,9.5999999999999992E-3,null,1.54E-2,8.6999999999999994E-3,6.7000000000000011E-3,null,1.09E-2,769366]
[331,"WESTHAMPTON   ",3324080,3455387,3587928,3731141,3881839,4047857,0,0,null,48205,46157,53515,57419,68972,48205,46157,53515,57419,68972,1.4500000000000001E-2,1.34E-2,1.49E-2,1.54E-2,1.78E-2,null,1.6E-2,1.46E-2,null,1.78E-2,1.52E-2,2.5999999999999999E-3,null,1.6E-2,64766]
[332,"WESTMINSTER   ",13384640,14074442,14897109,15466219,16177240,16205119,0,0,null,355186,470806,196682,324366,214927,355186,470806,196682,324366,214927,2.6499999999999999E-2,3.3500000000000002E-2,1.32E-2,2.1000000000000001E-2,1.3299999999999999E-2,null,1.5800000000000002E-2,1.5800000000000002E-2,null,2.1000000000000001E-2,1.3299999999999999E-2,7.700000000000002E-3,null,1.5800000000000002E-2,256041]
[333,"WESTON        ",61012902,63465401,66244040,69146363,72273886,75116342,2004,0,null,927176,1192004,1246222,1398864,1035609,927176,1192004,1246222,1398864,1035609,1.52E-2,1.8800000000000001E-2,1.8800000000000001E-2,2.0199999999999999E-2,1.43E-2,null,1.78E-2,1.7299999999999999E-2,null,2.0199999999999999E-2,1.66E-2,3.599999999999999E-3,null,1.78E-2,1337071]
[334,"WESTPORT      ",22447879,23452692,24378558,25391825,26515689,27688761,0,0,null,443616,339549,403803,489068,510180,443616,339549,403803,489068,510180,1.9800000000000002E-2,1.4500000000000001E-2,1.66E-2,1.9300000000000001E-2,1.9199999999999998E-2,null,1.84E-2,1.6799999999999999E-2,null,1.9300000000000001E-2,1.7899999999999999E-2,1.4000000000000019E-3,null,1.84E-2,509473]
[335,"WESTWOOD      ",53127070,58617511,62355620,65340733,68206120,71075739,1992,0,null,4162264,2271397,1426222,1226531,1164466,4162264,2271397,1426222,1226531,1164466,7.8299999999999995E-2,3.8699999999999998E-2,2.29E-2,1.8800000000000001E-2,1.7100000000000001E-2,null,1.9599999999999999E-2,1.9599999999999999E-2,null,2.29E-2,1.7999999999999999E-2,4.9000000000000016E-3,null,1.9599999999999999E-2,1393084]
[336,"WEYMOUTH      ",88986186,94099739,97511090,102157306,106743622,111575293,0,0,null,2888898,1058858,2100568,2032383,2025052,2888898,1058858,2100568,2032383,2025052,3.2500000000000001E-2,1.1299999999999999E-2,2.1499999999999998E-2,1.9900000000000001E-2,1.9E-2,null,2.01E-2,1.67E-2,null,2.1499999999999998E-2,1.95E-2,1.9999999999999983E-3,null,2.01E-2,2242663]
[337,"WHATELY       ",3870742,4123265,4291469,4530850,4725089,4947548,0,0,null,155754,65123,132094,80967,104332,155754,65123,132094,80967,104332,4.02E-2,1.5800000000000002E-2,3.0800000000000001E-2,1.7899999999999999E-2,2.2100000000000002E-2,null,2.3599999999999999E-2,1.8599999999999998E-2,null,3.0800000000000001E-2,0.02,1.0800000000000001E-2,null,2.3599999999999999E-2,116762]
[338,"WHITMAN       ",20466110,23142555,23125376,23971008,24920630,25470647,0,0,null,1328292,261670,267498,344392,237001,1328292,261670,267498,344392,237001,6.4899999999999999E-2,1.1299999999999999E-2,1.1599999999999999E-2,1.44E-2,9.4999999999999998E-3,null,1.18E-2,1.0800000000000001E-2,null,1.44E-2,1.06E-2,3.7999999999999996E-3,null,1.18E-2,300554]
[339,"WILBRAHAM     ",29524748,30592125,31707201,32919921,34268070,35548343,2003,0,null,329258,350273,420040,525150,423572,329258,350273,420040,525150,423572,1.12E-2,1.14E-2,1.32E-2,1.6E-2,1.24E-2,null,1.3899999999999999E-2,1.23E-2,null,1.6E-2,1.2800000000000001E-2,3.1999999999999997E-3,null,1.3899999999999999E-2,494122]
[340,"WILLIAMSBURG  ",4424970,4596358,4768943,4948580,5124923,5328559,0,0,null,60763,57676,60413,52628,75513,60763,57676,60413,52628,75513,1.37E-2,1.2500000000000001E-2,1.2699999999999999E-2,1.06E-2,1.47E-2,null,1.2699999999999999E-2,1.1900000000000001E-2,null,1.47E-2,1.17E-2,2.9999999999999992E-3,null,1.2699999999999999E-2,67673]
[341,"WILLIAMSTOWN  ",13741523,14164826,14702382,15252778,15820771,16490774,0,0,null,79765,183435,182836,186674,274484,79765,183435,182836,186674,274484,5.7999999999999996E-3,1.2999999999999999E-2,1.24E-2,1.2200000000000001E-2,1.7299999999999999E-2,null,1.4E-2,1.2500000000000001E-2,null,1.7299999999999999E-2,1.23E-2,4.9999999999999992E-3,null,1.4E-2,230871]
[342,"WILMINGTON    ",66056442,69555446,73267482,76668444,80382294,84206856,1991,0,null,1847593,1973150,1569275,1797139,1815005,1847593,1973150,1569275,1797139,1815005,2.8000000000000001E-2,2.8400000000000002E-2,2.1399999999999999E-2,2.3400000000000001E-2,2.2599999999999999E-2,null,2.2499999999999999E-2,2.2499999999999999E-2,null,2.3400000000000001E-2,2.1999999999999999E-2,1.4000000000000019E-3,null,2.2499999999999999E-2,1894654]
[343,"WINCHENDON    ",9930528,10243614,10607360,10951910,11371232,11808108,0,0,null,64823,107655,79366,145525,152595,64823,107655,79366,145525,152595,6.4999999999999997E-3,1.0500000000000001E-2,7.4999999999999997E-3,1.3299999999999999E-2,1.34E-2,null,1.14E-2,1.04E-2,null,1.34E-2,1.04E-2,3.0000000000000009E-3,null,1.14E-2,134612]
[344,"WINCHESTER    ",60341350,62587995,65091625,67623009,70170068,82746318,2004,0,null,738112,938930,904093,856483,821998,738112,938930,904093,856483,821998,1.2200000000000001E-2,1.4999999999999999E-2,1.3899999999999999E-2,1.2699999999999999E-2,1.17E-2,null,1.2800000000000001E-2,1.2800000000000001E-2,null,1.3899999999999999E-2,1.2200000000000001E-2,1.6999999999999984E-3,null,1.2800000000000001E-2,1059153]
[345,"WINDSOR       ",1473013,1535766,1583699,1663243,1729610,1791336,0,0,null,25927,9539,39952,24786,18486,25927,9539,39952,24786,18486,1.7600000000000001E-2,6.1999999999999998E-3,2.52E-2,1.49E-2,1.0699999999999999E-2,null,1.6899999999999998E-2,1.06E-2,null,2.52E-2,1.2800000000000001E-2,1.24E-2,null,1.6899999999999998E-2,30274]
[346,"WINTHROP      ",19435531,20120731,20843129,21550994,22379747,23171226,0,0,null,192132,219379,186787,289978,231985,192132,219379,186787,289978,231985,9.9000000000000008E-3,1.09E-2,8.9999999999999993E-3,1.35E-2,1.04E-2,null,1.0999999999999999E-2,1.01E-2,null,1.35E-2,9.7000000000000003E-3,3.7999999999999996E-3,null,1.0999999999999999E-2,254883]
[347,"WOBURN        ",103272336,108244066,113058815,120318593,126832137,133532009,0,0,null,2389922,2108647,3067125,3505579,3497401,2389922,2108647,3067125,3505579,3497401,2.3099999999999999E-2,1.95E-2,2.7099999999999999E-2,2.9100000000000001E-2,2.76E-2,null,2.7900000000000001E-2,2.47E-2,null,2.9100000000000001E-2,2.7400000000000001E-2,1.7000000000000001E-3,null,2.7900000000000001E-2,3725543]
[348,"WORCESTER     ",271963069,280922031,293408601,307195432,321080317,335601504,1993,0,null,6177865,5463519,6451616,6198050,6494179,6177865,5463519,6451616,6198050,6494179,2.2700000000000001E-2,1.9400000000000001E-2,2.1999999999999999E-2,2.0199999999999999E-2,2.0199999999999999E-2,null,2.0799999999999999E-2,1.9900000000000001E-2,null,2.1999999999999999E-2,2.0199999999999999E-2,1.7999999999999995E-3,null,2.0799999999999999E-2,6980511]
[349,"WORTHINGTON   ",2347916,2419324,2496827,2570390,2662862,2758056,0,0,null,12710,17020,11143,28212,28623,12710,17020,11143,28212,28623,5.4000000000000003E-3,7.0000000000000001E-3,4.4999999999999997E-3,1.0999999999999999E-2,1.0699999999999999E-2,null,8.6999999999999994E-3,7.4000000000000003E-3,null,1.0999999999999999E-2,7.6E-3,3.3999999999999994E-3,null,8.6999999999999994E-3,23995]
[350,"WRENTHAM      ",27609043,28715299,29957601,31144397,32444086,34103831,1993,0,null,416030,524420,437856,521079,824769,416030,524420,437856,521079,824769,1.5100000000000001E-2,1.83E-2,1.46E-2,1.67E-2,2.5399999999999999E-2,null,1.89E-2,1.6500000000000001E-2,null,2.5399999999999999E-2,1.5699999999999999E-2,9.7000000000000003E-3,null,1.89E-2,644562]
[351,"YARMOUTH      ",44488112,45808396,47344313,48947364,50661864,52398062,0,0,null,208081,390707,419444,490816,439010,208081,390707,419444,490816,439010,4.7000000000000002E-3,8.5000000000000006E-3,8.8999999999999999E-3,0.01,8.6999999999999994E-3,null,9.1999999999999998E-3,8.6999999999999994E-3,null,0.01,8.8000000000000005E-3,1.1999999999999997E-3,null,9.1999999999999998E-3,482062]
[null,null,null,null,null,null,null,null,null,null,null,null,null,null,null,null,null,null,null,null," "]
[null,"Total",{"$f":"SUM(C10:C360)","v":13991635222},14610429387,15285775958,15997715408,16754097004,17477097733,null,null,null,{"$f":"SUM(L10:L360)","v":279703665},316797816,335024629,361843001,377865089,279869199,316797816,334885447,361843001,377865089]

{"sheet":"levy limit base","index":7,"n_rows":363,"n_cols":20,"rows_kept":363,"cut":false,"hidden":true,"merged":[]}
["Calculation of Levy Limit Base"]
["1997-01-21"]
[]
[null,null,null,null,null,null,null,null,"Estimated"]
[" ",null,"FY2018","FY2018",null,null,"Impact of","FY19","FY19 Limit","FY20",null,"Impact of","FY20"]
[null,null,"Actual","Actual",null,null,"FY94-FY19","Limit","for MRGF","Actual",null,"FY94-FY20","Limit",null,null,null,null," ",null,"FY20"]
[null,null,"Limit Prior","Limit Prior","FY2018","FY2019","Overrides","Adjusted","Prior to ","Limit Prior","FY20","Overrides","Adjusted",null,"FY19","FY21",null,"Ceiling for",null,"Limit for"]
[null,null,"to Exclusions","to Exclusions","Overrides","Overrides","In FY19","For Overrides","Ceiling Check","to Exclusions","Overrides","in FY20","For Overrides",null,"Levy Ceiling","Levy Ceiling",null,"FY21 MRGF",null,"MRGF"]
[]
["ABINGTON      ",1,31083749,32404381,0,0,811760,31592621,31592621,33620233,0,832054,32788179,null,52381085,52381085,null,52381085,null,32788179]
["ACTON         ",2,81644435,84340154,0,0,9349499,74990655,74990655,87238384,0,9583236,77655148,null,111287539,111287539,null,111287539,null,77655148]
["ACUSHNET      ",3,16601843,17237500,0,0,0,17237500,17237500,18027438,0,0,18027438,null,30364804,30364804,null,30364804,null,18027438]
["ADAMS         ",4,10984702,11356251,0,0,0,11356251,11356251,11708307,0,0,11708307,null,12854673,12854673,null,12854673,null,11708307]
["AGAWAM        ",5,70533487,73038831,0,0,0,73038831,73038831,76081914,0,0,76081914,null,76712052,76712052,null,76712052,null,76081914]
["ALFORD        ",6,1593842,1641470,0,0,0,1641470,1641470,1689068,0,0,1689068,null,6865851,6865851,null,6865851,null,1689068]
["AMESBURY      ",7,44116384,45766634,0,0,0,45766634,45766634,47359518,0,0,47359518,null,57139252,57139252,null,57139252,null,47359518]
["AMHERST       ",8,50700146,52787635,0,0,4754539,48033096,48033096,54963386,0,4873402,50089984,null,60510440,60510440,null,60510440,null,50089984]
["ANDOVER       ",9,136417582,142600951,0,0,0,142600951,142600951,150531622,0,0,150531622,null,208033436,208033436,null,208033436,null,150531622]
["ARLINGTON     ",10,109965991,113696347,0,0,15595743,98100604,98100604,122855373,0,15985637,106869736,null,275335205,275335205,null,275335205,null,106869736]
["ASHBURNHAM    ",11,12029260,12516653,475656,475656,3381046,9135607,9611263,12955141,475656,3453681,9501460,null,15924268,15924268,null,15924268,null,9501460]
["ASHBY         ",12,5780183,5985962,0,0,317222,5668740,5668740,6209856,0,325153,5884703,null,8219710,8219710,null,8219710,null,5884703]
["ASHFIELD      ",13,3939855,4063967,0,0,270772,3793195,3793195,4215661,0,277541,3938120,null,6113646,6113646,null,6113646,null,3938120]
["ASHLAND       ",14,42081316,44426174,0,0,0,44426174,44426174,46224897,0,0,46224897,null,70835880,70835880,null,70835880,null,46224897]
["ATHOL         ",15,11932928,12593058,0,0,1472817,11120241,11120241,13168847,0,1509637,11659210,null,19408876,19408876,null,19408876,null,11659210]
["ATTLEBORO     ",16,70764061,73464173,0,0,0,73464173,73464173,76079548,0,0,76079548,null,121111741,121111741,null,121111741,null,76079548]
["AUBURN        ",17,43089839,44823850,0,0,2713989,42109861,42109861,46875534,0,2781839,44093695,null,53879355,53879355,null,53879355,null,44093695]
["AVON          ",18,19268191,20137740,0,0,1429006,18708734,18708734,21007325,0,1464731,19542594,null,20414414,20414414,null,20414414,null,19542594]
["AYER          ",19,22809032,24119751,0,0,790998,23328753,23328753,25370001,0,810773,24559228,null,30793777,30793777,null,30793777,null,24559228]
["BARNSTABLE    ",20,116900171,121259225,0,0,0,121259225,121259225,125537222,0,0,125537222,null,356395403,356395403,null,356395403,null,125537222]
["BARRE         ",21,7805228,8087275,0,0,0,8087275,8087275,8401060,0,0,8401060,null,11567411,11567411,null,11567411,null,8401060]
["BECKET        ",22,5781022,5970071,0,0,465774,5504297,5504297,6230618,0,477418,5753200,null,12596641,12596641,null,12596641,null,5753200]
["BEDFORD       ",23,66660425,69820484,0,0,0,69820484,69820484,72855273,0,0,72855273,null,98918899,98918899,null,98918899,null,72855273]
["BELCHERTOWN   ",24,26333465,27507359,0,0,0,27507359,27507359,28624718,0,0,28624718,null,37770235,37770235,null,37770235,null,28624718]
["BELLINGHAM    ",25,37954471,39837833,0,0,0,39837833,39837833,41820156,0,0,41820156,null,63508455,63508455,null,63508455,null,41820156]
["BELMONT       ",26,86086128,89250197,0,0,12775439,76474758,76474758,92590154,0,13094825,79495329,null,198666950,198666950,null,198666950,null,79495329]
["BERKLEY       ",27,9049927,9457290,0,0,921231,8536059,8536059,9873799,0,944262,8929537,null,22473067,22473067,null,22473067,null,8929537]
["BERLIN        ",28,11033857,11569324,0,0,20449,11548875,11548875,12072601,0,20960,12051641,null,16004243,16004243,null,16004243,null,12051641]
["BERNARDSTON   ",29,4202185,4355366,0,0,0,4355366,4355366,4570462,0,0,4570462,null,5489427,5489427,null,5489427,null,4570462]
["BEVERLY       ",30,99407098,103596037,0,0,0,103596037,103596037,108035190,0,0,108035190,null,174530948,174530948,null,174530948,null,108035190]
["BILLERICA     ",31,128919297,134931118,0,0,0,134931118,134931118,141531357,0,0,141531357,null,174152488,174152488,null,174152488,null,141531357]
["BLACKSTONE    ",32,17959202,18738701,0,0,0,18738701,18738701,19444909,0,0,19444909,null,24651396,24651396,null,24651396,null,19444909]
["BLANDFORD     ",33,2858934,2962546,0,0,441394,2521152,2521152,3084017,0,452429,2631588,null,4302692,4302692,null,4302692,null,2631588]
["BOLTON        ",34,19891622,20694442,0,0,1546442,19148000,19148000,21577386,0,1585103,19992283,null,26421643,26421643,null,26421643,null,19992283]
["BOSTON        ",35,2216600850,2350783055,0,0,0,2350783055,2350783055,2509114748,0,0,2509114748,null,4112853018,4112853018,null,4112853018,null,2509114748]
["BOURNE        ",36,45011685,46738964,0,0,2480037,44258927,44258927,48442777,0,2542038,45900739,null,119027071,119027071,null,119027071,null,45900739]
["BOXBOROUGH    ",37,20320009,21219522,0,0,1378997,19840525,19840525,21990284,0,1413472,20576812,null,29196842,29196842,null,29196842,null,20576812]
["BOXFORD       ",38,29022765,29975880,197318,197318,6303887,23671993,23869311,30917038,197318,6456551,24460487,null,45588174,45588174,null,45588174,null,24460487]
["BOYLSTON      ",39,11802490,13005293,0,0,1004751,12000542,12000542,13748143,0,1029870,12718273,null,19639160,19639160,null,19639160,null,12718273]
["BRAINTREE     ",40,89528431,92686291,0,0,0,92686291,92686291,96036025,0,0,96036025,null,180183143,180183143,null,180183143,null,96036025]
["BREWSTER      ",41,30648080,31769031,0,0,3951653,27817378,27817378,33179671,0,4050444,29129227,null,98612932,98612932,null,98612932,null,29129227]
["BRIDGEWATER   ",42,40588392,42480624,0,0,3328321,39152303,39152303,44339285,0,3411529,40927756,null,76069508,76069508,null,76069508,null,40927756]
["BRIMFIELD     ",43,7237714,7485472,0,0,0,7485472,7485472,7716005,0,0,7716005,null,10483952,10483952,null,10483952,null,7716005]
["BROCKTON      ",44,137859951,143674763,0,0,0,143674763,143674763,149036481,0,0,149036481,null,196087387,196087387,null,196087387,null,149036481]
["BROOKFIELD    ",45,5191955,5449013,0,0,0,5449013,5449013,5668022,0,0,5668022,null,6974226,6974226,null,6974226,null,5668022]
["BROOKLINE     ",46,210376535,224812701,0,0,21220564,203592137,197016712,233198737,0,28490889,204707848,null,628010210,628010210,null,628010210,null,204707848]
["BUCKLAND      ",47,3781466,3900190,0,0,258471,3641719,3641719,4020485,0,264933,3755552,null,5322888,5322888,null,5322888,null,3755552]
["BURLINGTON    ",48,117266931,123645873,0,0,0,123645873,123645873,130007610,0,0,130007610,null,165319752,165319752,null,165319752,null,130007610]
["CAMBRIDGE     ",49,570550306,599170668,0,0,0,599170668,599170668,628478895,0,0,628478895,null,1224428502,1224428502,null,1224428502,null,628478895]
["CANTON        ",50,73481199,76233465,0,0,5608801,70624664,70624664,79874050,0,5749021,74125029,null,124726827,124726827,null,124726827,null,74125029]
["CARLISLE      ",51,25902026,26812579,0,0,3446639,23365940,23365940,27929053,0,3532805,24396248,null,37704890,37704890,null,37704890,null,24396248]
["CARVER        ",52,23905837,24824537,0,0,0,24824537,24824537,25987764,0,0,25987764,null,34408267,34408267,null,34408267,null,25987764]
["CHARLEMONT    ",53,2977962,3086335,0,0,0,3086335,3086335,3207212,0,0,3207212,null,3493456,3493456,null,3493456,null,3207212]
["CHARLTON      ",54,19275350,21786248,0,0,390828,21395420,19851765,23014009,0,1982845,21031164,null,39636229,39636229,null,39636229,null,21031164]
["CHATHAM       ",55,29050068,30220430,0,0,3216169,27004261,27004261,31457177,0,3296573,28160604,null,176924743,176924743,null,176924743,null,28160604]
["CHELMSFORD    ",56,93668498,97520293,0,0,0,97520293,97520293,101789687,0,0,101789687,null,146436252,146436252,null,146436252,null,101789687]
["CHELSEA       ",57,54878173,57906281,0,0,0,57906281,57906281,61485089,0,0,61485089,null,86918628,86918628,null,86918628,null,61485089]
["CHESHIRE      ",58,3605741,3726319,0,0,215562,3510757,3510757,3834858,0,220951,3613907,null,7902444,7902444,null,7902444,null,3613907]
["CHESTER       ",59,2686252,2763212,0,0,172839,2590373,2590373,2848306,0,177160,2671146,null,2907729,2907729,null,2907729,null,2671146]
["CHESTERFIELD  ",60,3055865,3165362,0,0,0,3165362,3165362,3301345,0,0,3301345,null,3796965,3796965,null,3796965,null,3301345]
["CHICOPEE      ",61,88297903,91689322,0,0,0,91689322,91689322,95030164,0,0,95030164,null,99149314,99149314,null,99149314,null,95030164]
["CHILMARK      ",62,8337828,8804100,0,0,2801936,6002164,5831027,9191547,0,3047400,6144147,null,81906876,81906876,null,81906876,null,6144147]
["CLARKSBURG    ",63,1868756,1924899,0,0,0,1924899,1924899,2018524,0,0,2018524,null,3009326,3009326,null,3009326,null,2018524]
["CLINTON       ",64,25235019,27143889,0,0,1152273,25991616,25991616,28336642,0,1181080,27155562,null,35743616,35743616,null,35743616,null,27155562]
["COHASSET      ",65,35688027,37380305,0,0,2700290,34680015,34680015,38824230,0,2767797,36056433,null,75082896,75082896,null,75082896,null,36056433]
["COLRAIN       ",66,3473748,0,0,0,0,0,3594737,3722805,0,0,3722805,null,0,4296757,null,4296757,null,3722805]
["CONCORD       ",67,85491022,88864251,0,0,12082120,76782131,76782131,92281116,0,12384173,79896943,null,161175838,161175838,null,161175838,null,79896943]
["CONWAY        ",68,4781522,5043351,0,0,266841,4776510,4776510,5251273,0,273512,4977761,null,6589919,6589919,null,6589919,null,4977761]
["CUMMINGTON    ",69,1869307,1933059,0,0,43710,1889349,1889349,2015091,0,44803,1970288,null,3216117,3216117,null,3216117,null,1970288]
["DALTON        ",70,12035249,12481313,0,0,0,12481313,12481313,12984294,0,0,12984294,null,15303100,15303100,null,15303100,null,12984294]
["DANVERS       ",71,75516164,78198964,0,0,0,78198964,78198964,80994021,0,0,80994021,null,129101693,129101693,null,129101693,null,80994021]
["DARTMOUTH     ",72,59926087,61996342,0,0,2649386,59346956,59346956,64280466,0,2715621,61564845,null,145067538,145067538,null,145067538,null,61564845]
["DEDHAM        ",73,89441008,93000263,0,0,0,93000263,93000263,96531276,0,0,96531276,null,127188241,127188241,null,127188241,null,96531276]
["DEERFIELD     ",74,10459810,10913346,0,0,1037271,9876075,9876075,11323488,0,1063203,10260285,null,17892076,17892076,null,17892076,null,10260285]
["DENNIS        ",75,40989617,42279714,0,0,5565069,36714645,36714645,43636887,0,5704196,37932691,null,177100001,177100001,null,177100001,null,37932691]
["DIGHTON       ",76,16682131,17533123,0,0,0,17533123,17533123,18525532,0,0,18525532,null,26466159,26466159,null,26466159,null,18525532]
["DOUGLAS       ",77,13288266,15368085,0,0,177169,15190916,13690916,16153458,0,1719098,14434360,null,25501807,25501807,null,25501807,null,14434360]
["DOVER         ",78,32012170,33319777,0,0,3174116,30145661,30145661,34457446,0,3253469,31203977,null,66505402,66505402,null,66505402,null,31203977]
["DRACUT        ",79,45512281,47461299,0,0,0,47461299,47461299,49198678,0,0,49198678,null,91129725,91129725,null,91129725,null,49198678]
["DUDLEY        ",80,9793930,11820540,0,0,453361,11367179,9822846,12225929,0,2047636,10178293,null,25557768,25557768,null,25557768,null,10178293]
["DUNSTABLE     ",81,8392642,8773072,0,0,1525704,7247368,7247368,9137869,0,1563847,7574022,null,13662222,13662222,null,13662222,null,7574022]
["DUXBURY       ",82,53293997,55206582,0,0,0,55206582,55206582,57123110,0,0,57123110,null,106602127,106602127,null,106602127,null,57123110]
["EAST BRIDGEWAT",83,26351353,27320944,0,0,0,27320944,27320944,28364047,0,0,28364047,null,43172593,43172593,null,43172593,null,28364047]
["EAST BROOKFIEL",84,3561821,3706310,0,0,0,3706310,3706310,3870757,0,0,3870757,null,6037231,6037231,null,6037231,null,3870757]
["EAST LONGMEADO",85,41170794,42778627,0,0,0,42778627,42778627,44321187,0,0,44321187,null,49874686,49874686,null,49874686,null,44321187]
["EASTHAM       ",86,20101081,21114663,0,0,3373933,17740730,17374730,21761925,0,3833431,17928494,null,73666629,73666629,null,73666629,null,17928494]
["EASTHAMPTON   ",87,22484346,23306382,0,0,436542,22869840,22869840,24164725,0,447456,23717269,null,40013771,40013771,null,40013771,null,23717269]
["EASTON        ",88,52493985,54672072,0,0,4461094,50210978,50210978,56974422,0,4572621,52401801,null,88620545,88620545,null,88620545,null,52401801]
["EDGARTOWN     ",89,26570454,27655464,0,0,6298419,21357045,21357045,29200902,0,6455879,22745023,null,222145231,222145231,null,222145231,null,22745023]
["EGREMONT      ",90,4209885,4349391,0,0,0,4349391,4349391,4485945,0,0,4485945,null,10261544,10261544,null,10261544,null,4485945]
["ERVING        ",91,9689539,10620755,0,0,0,10620755,10620755,10909997,0,0,10909997,null,23477253,23477253,null,23477253,null,10909997]
["ESSEX         ",92,11850598,12240486,0,0,2661124,9579362,9579362,12665904,0,2727652,9938252,null,21647234,21647234,null,21647234,null,9938252]
["EVERETT       ",93,110457822,136743488,0,0,0,136743488,136743488,144152596,0,0,144152596,null,164013039,164013039,null,164013039,null,144152596]
["FAIRHAVEN     ",94,26676342,27566372,0,0,0,27566372,27566372,28484856,0,0,28484856,null,53421027,53421027,null,53421027,null,28484856]
["FALL RIVER    ",95,97454740,102122896,0,0,0,102122896,102122896,106816456,0,0,106816456,null,139947903,139947903,null,139947903,null,106816456]
["FALMOUTH      ",96,90621629,93670897,0,0,1605846,92065051,92065051,97107511,0,1645992,95461519,null,301262560,301262560,null,301262560,null,95461519]
["FITCHBURG     ",97,51485090,53682908,0,0,0,53682908,53682908,55682046,0,0,55682046,null,64389824,64389824,null,64389824,null,55682046]
["FLORIDA       ",98,2421013,0,0,0,268975,0,2399378,0,0,275699,0,null,0,4460408,null,4460408,null,2471839]
["FOXBOROUGH    ",99,45237199,47576229,0,0,0,47576229,47576229,49768722,0,0,49768722,null,80192124,80192124,null,80192124,null,49768722]
["FRAMINGHAM    ",100,200985321,209234446,0,0,10388990,198845456,198845456,217710963,0,10648715,207062248,null,244695406,244695406,null,244695406,null,207062248]
["FRANKLIN      ",101,70168037,73437716,0,0,3456227,69981489,69981489,77138077,0,3542633,73595444,null,131844518,131844518,null,131844518,null,73595444]
["FREETOWN      ",102,19501997,20288107,0,0,0,20288107,20288107,21671372,0,0,21671372,null,34827782,34827782,null,34827782,null,21671372]
["GARDNER       ",103,25888215,27018062,0,0,0,27018062,27018062,28240124,0,0,28240124,null,33434945,33434945,null,33434945,null,28240124]
["GAY HEAD      ",104,4048826,4504499,110000,110000,1441233,3063266,2848266,5016990,110000,1807639,3209351,null,18645091,18645091,null,18645091,null,3209351]
["GEORGETOWN    ",105,17932673,18646207,0,0,1512173,17134034,17026034,19324411,0,1660677,17663734,null,32980819,32980819,null,32980819,null,17663734]
["GILL          ",106,2747123,0,0,0,199153,0,2665584,0,0,204132,0,null,0,3957716,null,3957716,null,2764477]
["GLOUCESTER    ",107,76265313,79051706,0,0,0,79051706,79051706,82035573,0,0,82035573,null,165351430,165351430,null,165351430,null,82035573]
["GOSHEN        ",108,2282872,2361373,0,0,0,2361373,2361373,2443882,0,0,2443882,null,4047711,4047711,null,4047711,null,2443882]
["GOSNOLD       ",109,699602,0,0,0,208936,0,511645,0,0,214159,0,null,0,5723852,null,5723852,null,526687]
["GRAFTON       ",110,36005923,37515491,0,0,2207626,35307865,35307865,39346671,0,2262817,37083854,null,63304668,63304668,null,63304668,null,37083854]
["GRANBY        ",111,11619470,12113372,-30000,-30000,1136894,10976478,10946478,12520195,-30000,1166066,11354129,null,16680538,16680538,null,16680538,null,11354129]
["GRANVILLE     ",112,3167565,3261763,0,0,0,3261763,3261763,3402034,0,0,3402034,null,4933818,4933818,null,4933818,null,3402034]
["GREAT BARRINGT",113,21717815,22803152,0,0,0,22803152,22803152,23576289,0,0,23576289,null,37374362,37374362,null,37374362,null,23576289]
["GREENFIELD    ",114,33175019,34278055,0,0,0,34278055,34278055,35435096,0,0,35435096,null,36922180,36922180,null,36922180,null,35435096]
["GROTON        ",115,29360224,30650535,0,0,3113578,27536957,27536957,31932418,0,3191417,28741001,null,44656171,44656171,null,44656171,null,28741001]
["GROVELAND     ",116,13441118,13917495,0,0,2140152,11777343,11777343,14450497,0,2193656,12256841,null,25336806,25336806,null,25336806,null,12256841]
["HADLEY        ",117,10576297,11032660,0,0,0,11032660,11032660,11621843,0,0,11621843,null,24542277,24542277,null,24542277,null,11621843]
["HALIFAX       ",118,15617995,16171864,0,0,929625,15242239,15242239,16711720,0,952866,15758854,null,23556889,23556889,null,23556889,null,15758854]
["HAMILTON      ",119,27198556,28024238,0,0,7088564,20935674,20935674,28911424,0,7265778,21645646,null,41742923,41742923,null,41742923,null,21645646]
["HAMPDEN       ",120,11649278,12082323,0,0,0,12082323,12082323,12454681,0,0,12454681,null,15610102,15610102,null,15610102,null,12454681]
["HANCOCK       ",121,2281410,2348777,0,0,0,2348777,2348777,2410484,0,0,2410484,null,7576616,7576616,null,7576616,null,2410484]
["HANOVER       ",122,39600831,41275798,0,0,2015823,39259975,39259975,42832524,0,2066219,40766305,null,68678364,68678364,null,68678364,null,40766305]
["HANSON        ",123,19240837,20151661,0,0,853634,19298027,19298027,20981462,0,874975,20106487,null,33327567,33327567,null,33327567,null,20106487]
["HARDWICK      ",124,3811640,0,0,0,0,0,3945989,4101377,0,0,4101377,null,0,6067963,null,6067963,null,4101377]
["HARVARD       ",125,19615932,20287886,0,0,4136402,16151484,16151484,20906887,0,4239812,16667075,null,30631225,30631225,null,30631225,null,16667075]
["HARWICH       ",126,42683458,44144163,0,0,3998654,40145509,40145509,45589303,0,4098620,41490683,null,142087360,142087360,null,142087360,null,41490683]
["HATFIELD      ",127,7075286,7317964,0,0,41602,7276362,7276362,7666428,0,42642,7623786,null,13426903,13426903,null,13426903,null,7623786]
["HAVERHILL     ",128,101846990,105856629,0,0,0,105856629,105856629,110211975,0,0,110211975,null,166548517,166548517,null,166548517,null,110211975]
["HAWLEY        ",129,883598,916486,0,0,0,916486,916486,949471,0,0,949471,null,1251106,1251106,null,1251106,null,949471]
["HEATH         ",130,2252102,2253128,0,0,194520,2058608,2058608,2267068,0,199383,2067685,null,2253128,2253128,null,2253128,null,2067685]
["HINGHAM       ",131,76509213,79426526,0,0,3257354,76169172,76169172,82762765,0,3338788,79423977,null,177439624,177439624,null,177439624,null,79423977]
["HINSDALE      ",132,4600942,4765580,0,0,0,4765580,4765580,4983986,0,0,4983986,null,7741047,7741047,null,7741047,null,4983986]
["HOLBROOK      ",133,23647854,24558695,0,0,2861015,21697680,21697680,25464571,0,2932540,22532031,null,32331527,32331527,null,32331527,null,22532031]
["HOLDEN        ",134,36468157,38179514,0,0,0,38179514,38179514,39897093,0,0,39897093,null,59030466,59030466,null,59030466,null,39897093]
["HOLLAND       ",135,5391798,5575254,0,0,598591,4976663,4976663,5773739,0,613556,5160183,null,8227747,8227747,null,8227747,null,5160183]
["HOLLISTON     ",136,43871193,45930896,0,0,4384290,41546606,41546606,47769719,0,4493897,43275822,null,63546333,63546333,null,63546333,null,43275822]
["HOLYOKE       ",137,52427035,53918766,0,0,0,53918766,53918766,56039874,0,0,56039874,null,53918766,53918766,null,53918766,null,53918766]
["HOPEDALE      ",138,13802052,14339924,0,0,0,14339924,14339924,15361867,0,0,15361867,null,19002023,19002023,null,19002023,null,15361867]
["HOPKINTON     ",139,60654433,64394378,-1500000,-1500000,3449122,60945256,57907756,0,0,6648788,0,null,99541752,99541752,null,99541752,null,61955508]
["HUBBARDSTON   ",140,6774154,7032910,0,0,0,7032910,7032910,7273006,0,0,7273006,null,11710145,11710145,null,11710145,null,7273006]
["HUDSON        ",141,47803174,49897596,0,0,0,49897596,49897596,51902188,0,0,51902188,null,68613088,68613088,null,68613088,null,51902188]
["HULL          ",142,28040403,28951146,0,0,0,28951146,28951146,29976106,0,0,29976106,null,56172093,56172093,null,56172093,null,29976106]
["HUNTINGTON    ",143,3456309,3556682,0,0,135493,3421189,3421189,3698567,0,138880,3559687,null,4646117,4646117,null,4646117,null,3559687]
["IPSWICH       ",144,38120352,39429985,0,0,4985038,34444947,34444947,40693414,0,5109664,35583750,null,73802816,73802816,null,73802816,null,35583750]
["KINGSTON      ",145,32374414,33554184,0,0,2652649,30901535,30901535,34825119,0,2718965,32106154,null,52477655,52477655,null,52477655,null,32106154]
["LAKEVILLE     ",146,21785037,22656022,0,0,3873658,18782364,18782364,23627168,0,3970499,19656669,null,43741399,43741399,null,43741399,null,19656669]
["LANCASTER     ",147,17054549,17729094,0,0,3619638,14109456,14109456,18774299,0,3710129,15064170,null,23737357,23737357,null,23737357,null,15064170]
["LANESBOROUGH  ",148,8343686,8618973,0,0,0,8618973,8618973,9002151,0,0,9002151,null,9837467,9837467,null,9837467,null,9002151]
["LAWRENCE      ",149,70661377,74107308,0,0,0,74107308,74107308,80249851,0,0,80249851,null,105500804,105500804,null,105500804,null,80249851]
["LEE           ",150,15362384,15986619,0,0,384093,15602526,15602526,16672089,0,393695,16278394,null,23457452,23457452,null,23457452,null,16278394]
["LEICESTER     ",151,14001857,14615965,0,0,0,14615965,14615965,15292785,0,0,15292785,null,25732365,25732365,null,25732365,null,15292785]
["LENOX         ",152,16892223,17783155,0,0,0,17783155,17783155,18419626,0,0,18419626,null,31215412,31215412,null,31215412,null,18419626]
["LEOMINSTER    ",153,74049153,77287086,0,0,0,77287086,77287086,80298856,0,0,80298856,null,97162659,97162659,null,97162659,null,80298856]
["LEVERETT      ",154,5162859,5377732,0,0,293895,5083837,5083837,5597916,0,301242,5296674,null,6462022,6462022,null,6462022,null,5296674]
["LEXINGTON     ",155,169366479,176907122,0,0,21176483,155730639,155730639,184938303,0,21705895,163232408,null,298060000,298060000,null,298060000,null,163232408]
["LEYDEN        ",156,1820724,1878027,0,0,0,1878027,1878027,1932264,0,0,1932264,null,2171007,2171007,null,2171007,null,1932264]
["LINCOLN       ",157,27696403,28418354,0,0,3193765,25224589,25224589,29211523,0,3273609,25937914,null,52890154,52890154,null,52890154,null,25937914]
["LITTLETON     ",158,35349968,38069647,0,0,2131572,35938075,35938075,40158316,0,2184861,37973455,null,48138205,48138205,null,48138205,null,37973455]
["LONGMEADOW    ",159,46851176,48289342,0,0,5648777,42640565,42640565,49857396,0,5789996,44067400,null,54552238,54552238,null,54552238,null,44067400]
["LOWELL        ",160,146747545,152560490,0,0,0,152560490,152560490,158905239,0,0,158905239,null,204695360,204695360,null,204695360,null,158905239]
["LUDLOW        ",161,39450650,41088672,0,0,0,41088672,41088672,42772547,0,0,42772547,null,51961479,51961479,null,51961479,null,42772547]
["LUNENBURG     ",162,23087668,24137396,0,0,1280600,22856796,22856796,25107062,0,1312615,23794447,null,36056217,36056217,null,36056217,null,23794447]
["LYNN          ",163,126245456,131247559,0,0,0,131247559,131247559,136429137,0,0,136429137,null,207964425,207964425,null,207964425,null,136429137]
["LYNNFIELD     ",164,41182957,42596102,0,0,5725538,36870564,36870564,44273401,0,5868676,38404725,null,77986427,77986427,null,77986427,null,38404725]
["MALDEN        ",165,86826081,90263355,0,0,0,90263355,90263355,94569307,0,0,94569307,null,192336403,192336403,null,192336403,null,94569307]
["MANCHESTER    ",166,23714112,24583099,0,0,2918141,21664958,21664958,25363947,0,2991095,22372852,null,61086664,61086664,null,61086664,null,22372852]
["MANSFIELD     ",167,60178592,62753738,0,0,2415028,60338710,60338710,65023962,0,2475404,62548558,null,96582530,96582530,null,96582530,null,62548558]
["MARBLEHEAD    ",168,59592925,61400179,0,0,6774809,54625370,54625370,63238414,0,6944179,56294235,null,157889226,157889226,null,157889226,null,56294235]
["MARION        ",169,17691386,18306189,0,0,1699262,16606927,16606927,19362682,0,1741744,17620938,null,43163144,43163144,null,43163144,null,17620938]
["MARLBOROUGH   ",170,131259954,138028167,0,0,0,138028167,138028167,144113359,0,0,144113359,null,149027078,149027078,null,149027078,null,144113359]
["MARSHFIELD    ",171,60683624,62903647,0,0,2560169,60343478,60343478,65059735,0,2624173,62435562,null,125013752,125013752,null,125013752,null,62435562]
["MASHPEE       ",172,46068055,48001741,0,0,0,48001741,48001741,49968699,0,0,49968699,null,134652250,134652250,null,134652250,null,49968699]
["MATTAPOISETT  ",173,21161059,22005954,0,0,1964085,20041869,20041869,22855216,0,2013187,20842029,null,44038675,44038675,null,44038675,null,20842029]
["MAYNARD       ",174,28058307,29049744,0,0,1410415,27639329,27639329,30432490,0,1445675,28986815,null,35864451,35864451,null,35864451,null,28986815]
["MEDFIELD      ",175,39559733,42835123,0,0,7516146,35318977,33405874,44458802,0,9664980,34793822,null,67052130,67052130,null,67052130,null,34793822]
["MEDFORD       ",176,109528185,113940518,0,0,0,113940518,113940518,118138663,0,0,118138663,null,270047293,270047293,null,270047293,null,118138663]
["MEDWAY        ",177,34087272,39782447,0,0,2593258,37189189,37189189,41294017,0,2658089,38635928,null,58164355,58164355,null,58164355,null,38635928]
["MELROSE       ",178,55368833,57521943,0,0,0,57521943,57521943,64738724,0,0,64738724,null,132583791,132583791,null,132583791,null,64738724]
["MENDON        ",179,14477901,15201586,0,0,2679906,12521680,12521680,15840333,0,2746904,13093429,null,24185196,24185196,null,24185196,null,13093429]
["MERRIMAC      ",180,12282175,12817276,0,0,1952833,10864443,10864443,13230691,0,2001654,11229037,null,20655168,20655168,null,20655168,null,11229037]
["METHUEN       ",181,86698275,90014577,0,0,0,90014577,90014577,93348857,0,0,93348857,null,139280668,139280668,null,139280668,null,93348857]
["MIDDLEBOROUGH ",182,40482738,42271292,0,0,0,42271292,42271292,44431811,0,0,44431811,null,68329135,68329135,null,68329135,null,44431811]
["MIDDLEFIELD   ",183,1378983,1423245,0,0,0,1423245,1423245,1463886,0,0,1463886,null,1680668,1680668,null,1680668,null,1463886]
["MIDDLETON     ",184,26764835,28006842,0,0,1738660,26268182,26268182,29471490,0,1782127,27689363,null,52436491,52436491,null,52436491,null,27689363]
["MILFORD       ",185,67893461,70897896,0,0,0,70897896,70897896,73699324,0,0,73699324,null,85930178,85930178,null,85930178,null,73699324]
["MILLBURY      ",186,24012723,25332451,0,0,0,25332451,25332451,26788885,0,0,26788885,null,41679589,41679589,null,41679589,null,26788885]
["MILLIS        ",187,19685399,20829764,0,0,2917796,17911968,17911968,22032205,0,2990741,19041464,null,30000873,30000873,null,30000873,null,19041464]
["MILLVILLE     ",188,4659119,4850197,0,0,0,4850197,4850197,5015056,0,0,5015056,null,7798044,7798044,null,7798044,null,5015056]
["MILTON        ",189,76769831,79587098,3137264,3137264,19261851,60325247,63462511,82374502,3137264,19664966,62709536,null,152949470,152949470,null,152949470,null,62709536]
["MONROE        ",190,622379,0,0,0,0,0,639015,655693,0,0,655693,null,0,650306,null,650306,null,650306]
["MONSON        ",191,13144423,13611944,0,0,119730,13492214,13492214,14206908,0,122723,14084185,null,19232324,19232324,null,19232324,null,14084185]
["MONTAGUE      ",192,16267561,17194323,0,0,137806,17056517,17056517,18178839,0,141251,18037588,null,22256185,22256185,null,22256185,null,18037588]
["MONTEREY      ",193,3875505,3999223,0,0,918941,3080282,3080282,4138621,0,941915,3196706,null,13130660,13130660,null,13130660,null,3196706]
["MONTGOMERY    ",194,1659121,1708335,0,0,0,1708335,1708335,1775205,0,0,1775205,null,2764683,2764683,null,2764683,null,1775205]
["MOUNT WASHINGT",195,583238,602916,0,0,141298,461618,461618,624449,0,144830,479619,null,2202357,2202357,null,2202357,null,479619]
["NAHANT        ",196,8283908,8552061,0,0,513266,8038795,8038795,9422554,0,526098,8896456,null,22451216,22451216,null,22451216,null,8896456]
["NANTUCKET     ",197,71686428,74761587,0,0,7087721,67673866,67673866,77688262,0,7264914,70423348,null,596784828,596784828,null,596784828,null,70423348]
["NATICK        ",198,103160981,107285191,0,0,5520295,101764896,101764896,111851327,0,5658302,106193025,null,219083154,219083154,null,219083154,null,106193025]
["NEEDHAM       ",199,126800315,134365725,0,0,10634935,123730790,123730790,142426994,0,10900808,131526186,null,254220430,254220430,null,254220430,null,131526186]
["NEW ASHFORD   ",200,478811,564635,0,0,37749,526886,456886,582156,0,110443,471713,null,984373,984373,null,984373,null,471713]
["NEW BEDFORD   ",201,123961220,129211894,0,0,0,129211894,129211894,134165825,0,0,134165825,null,156410187,156410187,null,156410187,null,134165825]
["NEW BRAINTREE ",202,1916946,1986818,0,0,0,1986818,1986818,2068476,0,0,2068476,null,2938367,2938367,null,2938367,null,2068476]
["NEW MARLBOROUG",203,4797459,4972733,0,0,471185,4501548,4501548,5159395,0,482965,4676430,null,12337795,12337795,null,12337795,null,4676430]
["NEW SALEM     ",204,1919191,1995078,0,0,396228,1598850,1598850,2058173,0,406134,1652039,null,2895827,2895827,null,2895827,null,1652039]
["NEWBURY       ",205,15439734,16361470,0,0,1412256,14949214,14589424,16951777,0,1816347,15135430,null,39117873,39117873,null,39117873,null,15135430]
["NEWBURYPORT   ",206,52014405,54300695,0,0,0,54300695,54300695,56390995,0,0,56390995,null,109237194,109237194,null,109237194,null,56390995]
["NEWTON        ",207,329940249,343951137,0,0,26159259,317791878,317791878,358155776,0,26813240,331342536,null,760621190,760621190,null,760621190,null,331342536]
["NORFOLK       ",208,28658330,30047297,0,0,2893086,27154211,27154211,31381469,0,2965413,28416056,null,44846280,44846280,null,44846280,null,28416056]
["NORTH ADAMS   ",209,16996148,17777170,0,0,0,17777170,17777170,18814731,0,0,18814731,null,18133108,18133108,null,18133108,null,18133108]
["NORTH ANDOVER ",210,71355993,74267520,0,0,7981880,66285640,66285640,77464858,0,8181427,69283431,null,130455811,130455811,null,130455811,null,69283431]
["NORTH ATTLEBOR",211,50026771,58295294,0,0,0,58295294,51795294,60377329,0,6662500,53714829,null,99224857,99224857,null,99224857,null,53714829]
["NORTH BROOKFIE",212,5665509,5879516,0,0,0,5879516,5879516,6092243,0,0,6092243,null,9896599,9896599,null,9896599,null,6092243]
["NORTH READING ",213,42647910,44467836,0,0,1715933,42751903,42751903,46656776,0,1758831,44897945,null,81442226,81442226,null,81442226,null,44897945]
["NORTHAMPTON   ",214,56758366,59108954,0,0,5265326,53843628,53843628,61649762,0,5396959,56252803,null,86160631,86160631,null,86160631,null,56252803]
["NORTHBOROUGH  ",215,49116899,50983446,0,0,1576494,49406952,49406952,52997340,0,1615906,51381434,null,73519799,73519799,null,73519799,null,51381434]
["NORTHBRIDGE   ",216,20770441,21564417,0,0,40649,21523768,21523768,22340990,0,41665,22299325,null,42771089,42771089,null,42771089,null,22299325]
["NORTHFIELD    ",217,7872147,8690698,0,0,1069126,7621572,7621572,9054916,0,1095854,7959062,null,11602349,11602349,null,11602349,null,7959062]
["NORTON        ",218,34510608,36577459,0,0,0,36577459,36577459,38391163,0,0,38391163,null,63146873,63146873,null,63146873,null,38391163]
["NORWELL       ",219,41632142,43199612,0,0,1103402,42096210,42096210,44672846,0,1130987,43541859,null,67865644,67865644,null,67865644,null,43541859]
["NORWOOD       ",220,71002135,73656770,0,0,0,73656770,73656770,83324094,0,0,83324094,null,132780743,132780743,null,132780743,null,83324094]
["OAK BLUFFS    ",221,21494560,22592311,0,0,2941722,19650589,19375589,23379875,0,3297140,20082735,null,80367997,80367997,null,80367997,null,20082735]
["OAKHAM        ",222,2776589,2893048,75000,75000,198026,2695022,2770022,2993573,75000,201102,2792471,null,5317525,5317525,null,5317525,null,2792471]
["ORANGE        ",223,10767772,11152441,0,0,648287,10504154,10504154,11511097,0,664494,10846603,null,12596714,12596714,null,12596714,null,10846603]
["ORLEANS       ",224,23310953,24881343,0,0,2342097,22539246,21814246,25734238,0,3143774,22590464,null,102393132,102393132,null,102393132,null,22590464]
["OTIS          ",225,5021909,5180195,0,0,483453,4696742,4696742,5344437,0,495539,4848898,null,15350668,15350668,null,15350668,null,4848898]
["OXFORD        ",226,22237627,23278922,0,0,0,23278922,23278922,0,0,0,0,null,34383138,34383138,null,34383138,null,24377687]
["PALMER        ",227,18468917,19116646,0,0,0,19116646,19116646,19780028,0,0,19780028,null,23760608,23760608,null,23760608,null,19780028]
["PAXTON        ",228,9102893,9884908,0,0,290266,9594642,9194642,10252760,0,707523,9545237,null,13964823,13964823,null,13964823,null,9545237]
["PEABODY       ",229,114596472,118533936,0,0,0,118533936,118533936,122866207,0,0,122866207,null,199296428,199296428,null,199296428,null,122866207]
["PELHAM        ",230,3928492,4037770,0,0,269524,3768246,3768246,4157387,0,276262,3881125,null,4488173,4488173,null,4488173,null,3881125]
["PEMBROKE      ",231,38138715,39529263,0,0,1399958,38129305,38129305,40934294,0,1434957,39499337,null,70781280,70781280,null,70781280,null,39499337]
["PEPPERELL     ",232,19062903,19793092,0,0,788060,19005032,19005032,21984081,0,807762,21176319,null,33075330,33075330,null,33075330,null,21176319]
["PERU          ",233,1956346,2037506,0,0,0,2037506,2037506,2168834,0,0,2168834,null,2263807,2263807,null,2263807,null,2168834]
["PETERSHAM     ",234,2588773,2673214,0,0,0,2673214,2673214,2756054,0,0,2756054,null,3815040,3815040,null,3815040,null,2756054]
["PHILLIPSTON   ",235,3202862,3328454,0,0,956186,2372268,2372268,3552966,0,980091,2572875,null,5132555,5132555,null,5132555,null,2572875]
["PITTSFIELD    ",236,86959318,89534132,0,0,0,89534132,89534132,92117152,0,0,92117152,null,89534132,89534132,null,89534132,null,89534132]
["PLAINFIELD    ",237,1746914,1800147,0,0,39599,1760548,1760548,1930793,0,40589,1890204,null,2214456,2214456,null,2214456,null,1890204]
["PLAINVILLE    ",238,20840343,21817477,0,0,1127812,20689665,20689665,22913366,0,1156007,21757359,null,36400574,36400574,null,36400574,null,21757359]
["PLYMOUTH      ",239,162811487,170642498,0,0,0,170642498,170642498,179332150,0,0,179332150,null,264143734,264143734,null,264143734,null,179332150]
["PLYMPTON      ",240,9404890,9718362,0,0,0,9718362,9718362,10053825,0,0,10053825,null,13179744,13179744,null,13179744,null,10053825]
["PRINCETON     ",241,8809942,9157587,0,0,0,9157587,9157587,9554494,0,0,9554494,null,13537214,13537214,null,13537214,null,9554494]
["PROVINCETOWN  ",242,19400233,20380555,0,0,802514,19578041,19270041,21180140,0,1138277,20041863,null,79590853,79590853,null,79590853,null,20041863]
["QUINCY        ",243,248073180,260842479,0,0,0,260842479,260842479,272751243,0,0,272751243,null,398527175,398527175,null,398527175,null,272751243]
["RANDOLPH      ",244,60184676,62443799,0,0,7608149,54835650,54835650,64856564,0,7798353,57058211,null,93562029,93562029,null,93562029,null,57058211]
["RAYNHAM       ",245,32311873,33717292,0,0,2248496,31468796,31468796,35163339,0,2304708,32858631,null,57422659,57422659,null,57422659,null,32858631]
["READING       ",246,64298364,70895487,0,0,10718338,60177149,56027149,73289696,0,15240046,58049650,null,129822467,129822467,null,129822467,null,58049650]
["REHOBOTH      ",247,21427940,24421910,0,0,0,24421910,22305918,25501040,0,2168892,23332148,null,47110759,47110759,null,47110759,null,23332148]
["REVERE        ",248,82685765,86416689,0,0,0,86416689,86416689,90539665,0,0,90539665,null,159565023,159565023,null,159565023,null,90539665]
["RICHMOND      ",249,4961053,5131596,0,0,0,5131596,5131596,5318609,0,0,5318609,null,10407881,10407881,null,10407881,null,5318609]
["ROCHESTER     ",250,11543522,12010430,0,0,359302,11651128,11651128,12695527,0,368285,12327242,null,23734720,23734720,null,23734720,null,12327242]
["ROCKLAND      ",251,32806457,34043239,0,0,4122162,29921077,29921077,35171558,0,4225216,30946342,null,52956178,52956178,null,52956178,null,30946342]
["ROCKPORT      ",252,21332185,22030340,0,0,3035912,18994428,18994428,22784123,0,3111810,19672313,null,56246101,56246101,null,56246101,null,19672313]
["ROWE          ",253,3574066,4248259,0,0,0,4248259,4248259,4369678,0,0,4369678,null,12841829,12841829,null,12841829,null,4369678]
["ROWLEY        ",254,14134907,14613302,0,0,1394328,13218974,13218974,15281089,0,1429186,13851903,null,26604824,26604824,null,26604824,null,13851903]
["ROYALSTON     ",255,1626301,0,0,0,191636,0,1493489,0,0,196427,0,null,0,3506657,null,3506657,null,1549644]
["RUSSELL       ",256,3319384,3427807,0,0,0,3427807,3427807,3550260,0,0,3550260,null,3615276,3615276,null,3615276,null,3550260]
["RUTLAND       ",257,13793222,14633853,0,0,360977,14272876,14272876,15363231,0,370001,14993230,null,22806473,22806473,null,22806473,null,14993230]
["SALEM         ",258,95321556,136761707,0,0,0,136761707,99208798,107591472,0,0,107591472,null,99208798,136761707,null,136761707,null,107591472]
["SALISBURY     ",259,19427399,20232635,0,0,0,20232635,20232635,21513215,0,0,21513215,null,45632112,45632112,null,45632112,null,21513215]
["SANDISFIELD   ",260,3018886,3125227,0,0,0,3125227,3125227,3227269,0,0,3227269,null,6159255,6159255,null,6159255,null,3227269]
["SANDWICH      ",261,58584945,60644643,0,0,8139378,52505265,52505265,66281547,0,8342862,57938685,null,107915892,107915892,null,107915892,null,57938685]
["SAUGUS        ",262,62519141,64944694,0,0,0,64944694,64944694,68007835,0,0,68007835,null,117887725,117887725,null,117887725,null,68007835]
["SAVOY         ",263,1383657,1434665,0,0,231791,1202874,1202874,1513503,0,237586,1275917,null,1660060,1660060,null,1660060,null,1275917]
["SCITUATE      ",264,55646272,57874204,0,0,7458403,50415801,50415801,60306984,0,7644863,52662121,null,116267594,116267594,null,116267594,null,52662121]
["SEEKONK       ",265,38770631,40656429,0,0,0,40656429,40656429,42777102,0,0,42777102,null,62261428,62261428,null,62261428,null,42777102]
["SHARON        ",266,64067988,66157427,0,0,12169932,53987495,53987495,68238204,0,12474180,55764024,null,87024860,87024860,null,87024860,null,55764024]
["SHEFFIELD     ",267,10015988,10393389,0,0,340544,10052845,10052845,10920888,0,349058,10571830,null,14946405,14946405,null,14946405,null,10571830]
["SHELBURNE     ",268,3938515,4160116,0,0,296907,3863209,3863209,4333542,0,304330,4029212,null,6578993,6578993,null,6578993,null,4029212]
["SHERBORN      ",269,23214236,24052971,0,0,4382263,19670708,19670708,24900338,0,4491820,20408518,null,31831265,31831265,null,31831265,null,20408518]
["SHIRLEY       ",270,10077928,10453055,0,0,703752,9749303,9749303,10898446,0,721346,10177100,null,17393634,17393634,null,17393634,null,10177100]
["SHREWSBURY    ",271,68715634,72040793,0,0,6070971,65969822,65969822,74964859,0,6222745,68742114,null,152368618,152368618,null,152368618,null,68742114]
["SHUTESBURY    ",272,5023702,5228300,0,0,728786,4499514,4499514,5431885,0,747006,4684879,null,5471297,5471297,null,5471297,null,4684879]
["SOMERSET      ",273,53534572,54438515,0,0,0,54438515,54438515,56581414,0,0,56581414,null,54438515,54438515,null,54438515,null,54438515]
["SOMERVILLE    ",274,145062349,155996513,0,0,0,155996513,155996513,168272052,0,0,168272052,null,391412800,391412800,null,391412800,null,168272052]
["SOUTH HADLEY  ",275,26151095,27040090,0,0,0,27040090,27040090,27987337,0,0,27987337,null,39845211,39845211,null,39845211,null,27987337]
["SOUTHAMPTON   ",276,10913245,11821433,0,0,0,11821433,11328270,12318764,0,505492,11813272,null,18805495,18805495,null,18805495,null,11813272]
["SOUTHBOROUGH  ",277,40989148,42637552,0,0,2501058,40136494,40136494,44598742,0,2563584,42035158,null,62938758,62938758,null,62938758,null,42035158]
["SOUTHBRIDGE   ",278,20829980,21603094,0,0,0,21603094,21603094,22413899,0,0,22413899,null,25913337,25913337,null,25913337,null,22413899]
["SOUTHWICK     ",279,18404978,19183577,0,0,0,19183577,19183577,20110144,0,0,20110144,null,27198250,27198250,null,27198250,null,20110144]
["SPENCER       ",280,13667826,14244789,0,0,1453278,12791511,12791511,14758796,0,1489610,13269186,null,27436994,27436994,null,27436994,null,13269186]
["SPRINGFIELD   ",281,198331396,205316171,0,0,0,205316171,205316171,216375301,0,0,216375301,null,205316171,205316171,null,205316171,null,205316171]
["STERLING      ",282,18591961,19254900,0,0,1180005,18074895,18074895,19909046,0,1209505,18699541,null,27954612,27954612,null,27954612,null,18699541]
["STOCKBRIDGE   ",283,8201797,8500747,0,0,0,8500747,8500747,8788113,0,0,8788113,null,22270515,22270515,null,22270515,null,8788113]
["STONEHAM      ",284,46848986,48775845,0,0,0,48775845,48775845,50503191,0,0,50503191,null,104422369,104422369,null,104422369,null,50503191]
["STOUGHTON     ",285,63668616,66125345,0,0,0,66125345,66125345,68706812,0,0,68706812,null,100538525,100538525,null,100538525,null,68706812]
["STOW          ",286,25229447,26431265,0,0,1401034,25030231,25030231,27908186,0,1436060,26472126,null,32836268,32836268,null,32836268,null,26472126]
["STURBRIDGE    ",287,23216055,24101513,0,0,0,24101513,24101513,25017150,0,0,25017150,null,32310520,32310520,null,32310520,null,25017150]
["SUDBURY       ",288,81276640,84710256,1077270,1077270,18961611,65748645,66825915,87791953,1077270,19408720,68383233,null,118209090,118209090,null,118209090,null,68383233]
["SUNDERLAND    ",289,4954148,5317673,0,0,871178,4446495,4246495,5710552,0,1097957,4612595,null,9101826,9101826,null,9101826,null,4612595]
["SUTTON        ",290,19148070,19985519,0,0,640044,19345475,19345475,20947652,0,656045,20291607,null,36562406,36562406,null,36562406,null,20291607]
["SWAMPSCOTT    ",291,48386446,50034671,0,0,6666863,43367808,43367808,51665474,0,6833535,44831939,null,75400181,75400181,null,75400181,null,44831939]
["SWANSEA       ",292,32161401,33646940,0,0,0,33646940,33646940,35127161,0,0,35127161,null,54657100,54657100,null,54657100,null,35127161]
["TAUNTON       ",293,96427124,101092103,0,0,0,101092103,101092103,106324574,0,0,106324574,null,130092103,130348312,null,130348312,null,106324574]
["TEMPLETON     ",294,9062662,9863059,0,0,2539664,7323395,6853149,10243270,0,3085158,7158112,null,16456817,16456817,null,16456817,null,7158112]
["TEWKSBURY     ",295,74376362,78416959,0,0,0,78416959,78416959,81546456,0,0,81546456,null,122588532,122588532,null,122588532,null,81546456]
["TISBURY       ",296,23553556,24554479,0,0,1819141,22735338,22735338,25454675,0,1864620,23590055,null,74919773,74919773,null,74919773,null,23590055]
["TOLLAND       ",297,1404096,1456031,0,0,429672,1026359,1026359,1505631,0,440414,1065217,null,4803563,4803563,null,4803563,null,1065217]
["TOPSFIELD     ",298,22285113,22917282,0,0,4455153,18462129,18462129,24422084,0,4566532,19855552,null,35214719,35214719,null,35214719,null,19855552]
["TOWNSEND      ",299,16074515,16660837,0,0,1894228,14766609,14766609,17227050,0,1941584,15285466,null,23541029,23541029,null,23541029,null,15285466]
["TRURO         ",300,15007937,15496934,465617,465617,5717209,9779725,10245342,16038083,465617,5848499,10189584,null,56570351,56570351,null,56570351,null,10189584]
["TYNGSBOROUGH  ",301,26010114,27040694,0,0,0,27040694,27040694,28178290,0,0,28178290,null,40883963,40883963,null,40883963,null,28178290]
["TYRINGHAM     ",302,1441623,1489774,0,0,0,1489774,1489774,1533632,0,0,1533632,null,5050230,5050230,null,5050230,null,1533632]
["UPTON         ",303,18653622,19498443,0,0,5842155,13656288,13656288,20349068,0,5988209,14360859,null,29369767,29369767,null,29369767,null,14360859]
["UXBRIDGE      ",304,26317114,27508002,0,0,1102810,26405192,26405192,29252849,0,1130380,28122469,null,43380869,43380869,null,43380869,null,28122469]
["WAKEFIELD     ",305,68260862,71370427,0,0,0,71370427,71370427,74317122,0,0,74317122,null,127298669,127298669,null,127298669,null,74317122]
["WALES         ",306,3175954,3282099,0,0,0,3282099,3282099,3419431,0,0,3419431,null,4275505,4275505,null,4275505,null,3419431]
["WALPOLE       ",307,68200516,71197868,0,0,5506416,65691452,65691452,74507681,0,5644076,68863605,null,114820685,114820685,null,114820685,null,68863605]
["WALTHAM       ",308,209933737,219284328,0,0,0,219284328,219284328,231970809,0,0,231970809,null,305916986,305916986,null,305916986,null,231970809]
["WARE          ",309,14537902,15006396,0,0,0,15006396,15006396,15473335,0,0,15473335,null,18772789,18772789,null,18772789,null,15473335]
["WAREHAM       ",310,38990064,40402319,0,0,0,40402319,40402319,42001479,0,0,42001479,null,92246598,92246598,null,92246598,null,42001479]
["WARREN        ",311,7717299,8001578,0,0,0,8001578,8001578,8333966,0,0,8333966,null,9605507,9605507,null,9605507,null,8333966]
["WARWICK       ",312,1694498,1745377,0,0,0,1745377,1745377,1799561,0,0,1799561,null,1883303,1883303,null,1883303,null,1799561]
["WASHINGTON    ",313,1171706,1221475,0,0,128702,1092773,1092773,1257612,0,131920,1125692,null,2051445,2051445,null,2051445,null,1125692]
["WATERTOWN     ",314,101193510,109523765,0,0,0,109523765,109523765,117181127,0,0,117181127,null,199973041,199973041,null,199973041,null,117181127]
["WAYLAND       ",315,68894520,71052943,0,0,14568539,56484404,56484404,73386611,0,14932752,58453859,null,94278033,94278033,null,94278033,null,58453859]
["WEBSTER       ",316,21524002,22355582,0,0,0,22355582,22355582,23233170,0,0,23233170,null,40258467,40258467,null,40258467,null,23233170]
["WELLESLEY     ",317,123786901,128981693,0,0,23160261,105821432,105821432,134009065,0,23739268,110269797,null,304775927,304775927,null,304775927,null,110269797]
["WELLFLEET     ",318,15274813,15788086,147300,147300,3415510,12372576,12519876,16481342,147300,3497215,12984127,null,59826462,59826462,null,59826462,null,12984127]
["WENDELL       ",319,2332852,0,0,0,0,0,2373737,0,0,0,0,null,0,2373737,null,2373737,null,2373737]
["WENHAM        ",320,14161731,15134589,0,0,3004329,12130260,11798966,16237543,0,3419014,12818529,null,22023323,22023323,null,22023323,null,12818529]
["WEST BOYLSTON ",321,16621968,17321101,0,0,0,17321101,17321101,17966588,0,0,17966588,null,23786597,23786597,null,23786597,null,17966588]
["WEST BRIDGEWAT",322,23282211,24308721,0,0,113046,24195675,24195675,25356591,0,115872,25240719,null,31290363,31290363,null,31290363,null,25240719]
["WEST BROOKFIEL",323,5688495,5907603,0,0,0,5907603,5907603,6218609,0,0,6218609,null,9423736,9423736,null,9423736,null,6218609]
["WEST NEWBURY  ",324,13212301,13653481,0,0,2347871,11305610,11305610,14138156,0,2406568,11731588,null,23660482,23660482,null,23660482,null,11731588]
["WEST SPRINGFIE",325,70020189,70938030,0,0,0,70938030,70938030,71673901,0,0,71673901,null,70938030,70938030,null,70938030,null,70938030]
["WEST STOCKBRID",326,5716812,5926880,0,0,0,5926880,5926880,6121927,0,0,6121927,null,9575715,9575715,null,9575715,null,6121927]
["WEST TISBURY  ",327,14784144,15687937,0,0,3975193,11712744,11312744,16231803,0,4484573,11747230,null,67727426,67727426,null,67727426,null,11747230]
["WESTBOROUGH   ",328,81268153,84338470,0,0,0,84338470,84338470,87805268,0,0,87805268,null,102479382,102479382,null,102479382,null,87805268]
["WESTFIELD     ",329,74937129,78163668,0,0,0,78163668,78163668,81172571,0,0,81172571,null,81584315,81584315,null,81584315,null,81172571]
["WESTFORD      ",330,73355974,75930116,1600000,1600000,8150435,67779681,69379681,78898206,1600000,8314196,70584010,null,118175342,118175342,null,118175342,null,70584010]
["WESTHAMPTON   ",331,4210753,4373441,0,0,491602,3881839,3881839,4551749,0,503892,4047857,null,5775305,5775305,null,5775305,null,4047857]
["WESTMINSTER   ",332,18400963,19185353,591479,591479,3599592,15585761,16177240,19879914,591479,3674795,16205119,null,24402348,24402348,null,24402348,null,16205119]
["WESTON        ",333,74821418,78090817,0,0,5816931,72273886,72273886,81078696,0,5962354,75116342,null,152654208,152654208,null,152654208,null,75116342]
["WESTPORT      ",334,25669860,0,0,0,284986,0,26515689,27980872,0,292111,27688761,null,85562848,85562848,null,85562848,null,27688761]
["WESTWOOD      ",335,73553156,76623854,0,0,8417734,68206120,68206120,79703916,0,8628177,71075739,null,114427069,114427069,null,114427069,null,71075739]
["WEYMOUTH      ",336,102157306,106743622,0,0,0,106743622,106743622,111575293,0,0,111575293,null,203070184,203070184,null,203070184,null,111575293]
["WHATELY       ",337,4829464,5031168,0,0,306079,4725089,4725089,5261279,0,313731,4947548,null,6751528,6751528,null,6751528,null,4947548]
["WHITMAN       ",338,24281008,25238380,310000,310000,627750,24610630,24920630,26106341,310000,635694,25470647,null,41195326,41195326,null,41195326,null,25470647]
["WILBRAHAM     ",339,35912060,37335012,0,0,3066942,34268070,34268070,38691959,0,3143616,35548343,null,43624973,43624973,null,43624973,null,35548343]
["WILLIAMSBURG  ",340,5750062,5946442,0,0,821519,5124923,5124923,6170616,0,842057,5328559,null,7944583,7944583,null,7944583,null,5328559]
["WILLIAMSTOWN  ",341,16931168,17541121,0,0,1720350,15820771,15820771,18254133,0,1763359,16490774,null,24280497,24280497,null,24280497,null,16490774]
["WILMINGTON    ",342,76668444,80382294,0,0,0,80382294,80382294,84206856,0,0,84206856,null,117909392,117909392,null,117909392,null,84206856]
["WINCHENDON    ",343,11441972,11873546,0,0,502314,11371232,11371232,12322980,0,514872,11808108,null,18258577,18258577,null,18258577,null,11808108]
["WINCHESTER    ",344,75734260,78484100,0,0,8314032,70170068,70170068,91268201,0,8521883,82746318,null,191045485,191045485,null,191045485,null,82746318]
["WINDSOR       ",345,1714037,1781674,0,0,52064,1729610,1729610,1844702,0,53366,1791336,null,3059501,3059501,null,3059501,null,1791336]
["WINTHROP      ",346,28144519,29138110,0,0,6758363,22379747,22379747,30098548,0,6927322,23171226,null,63008327,63008327,null,63008327,null,23171226]
["WOBURN        ",347,120318593,126832137,0,0,0,126832137,126832137,133532009,0,0,133532009,null,198452638,198452638,null,198452638,null,133532009]
["WORCESTER     ",348,307195432,321080317,0,0,0,321080317,321080317,335601504,0,0,335601504,null,338145373,338145373,null,338145373,null,335601504]
["WORTHINGTON   ",349,2748521,2845446,0,0,182584,2662862,2662862,2945205,0,187149,2758056,null,4312231,4312231,null,4312231,null,2758056]
["WRENTHAM      ",350,31144397,32444086,0,0,0,32444086,32444086,34103831,0,0,34103831,null,55533083,55533083,null,55533083,null,34103831]
["YARMOUTH      ",351,56580241,59032330,570767,570767,8394466,50637864,50661864,61548557,570767,9150495,52398062,null,150265383,150265383,null,150265383,null,52398062]
[]
[null,null,{"$f":"SUM(C10:C360)","v":16641078506},{"$f":"SUM(D10:D360)","v":17437196041},7227671,7227671,665137343,16773212384,16754097004,18186396254,8727671,716837726,17477097733,0,30720305697,30789152211,0,30789152211,0,{"$f":"SUM(T10:T360)","v":17553788274}]
[null,null,null,null,null,null,null,null,null,null,null,null," "]

{"sheet":"GRS","index":8,"n_rows":362,"n_cols":11,"rows_kept":362,"cut":false,"hidden":true,"merged":[]}
["Change in General Revenue Sharing"]
[]
[]
[]
[null,null,null,null,null,null,null,null,null,"Estimated"]
[null,null,null,null,"State-",null,null,"Estimated",null,"State-","Estimated"]
[null,"DOR",null,null,"Owned","Total",null,"Additional","Estimated","Owned","Total"]
["MUNICIPALITY  ","CDE",null,"UGGA","Land","PY",null,"Assistance","UGGA","Land","CY"]
[null,null," "," "]
["ABINGTON      ",1,0,2088894,138184,{"$f":"SUM(C10:E10)","v":2227078},null,0,2147383,138184,{"$f":"SUM(H10:J10)","v":2285567}]
["ACTON         ",2,0,1485383,69544,{"$f":"SUM(C11:E11)","v":1554927},null,0,1526974,69544,{"$f":"SUM(H11:J11)","v":1596518}]
["ACUSHNET      ",3,0,1610035,43,1610078,null,0,1655116,43,1655159]
["ADAMS         ",4,0,2485998,66682,2552680,null,0,2555606,66682,2622288]
["AGAWAM        ",5,0,3911960,97708,4009668,null,0,4021495,97708,4119203]
["ALFORD        ",6,0,14902,0,14902,null,0,15319,0,15319]
["AMESBURY      ",7,0,2065799,0,2065799,null,0,2123641,0,2123641]
["AMHERST       ",8,0,8939803,203540,9143343,null,0,9190117,203540,9393657]
["ANDOVER       ",9,0,1897423,223355,2120778,null,0,1950551,223355,2173906]
["ARLINGTON     ",10,0,8056055,0,8056055,null,0,8281625,0,8281625]
["ASHBURNHAM    ",11,0,844287,100829,945116,null,0,867927,100829,968756]
["ASHBY         ",12,0,464959,104362,569321,null,0,477978,104362,582340]
["ASHFIELD      ",13,0,197138,11824,208962,null,0,202658,11824,214482]
["ASHLAND       ",14,0,1435983,99824,1535807,null,0,1476191,99824,1576015]
["ATHOL         ",15,0,2811281,48017,2859298,null,0,2889997,48017,2938014]
["ATTLEBORO     ",16,0,6057887,0,6057887,null,0,6227508,0,6227508]
["AUBURN        ",17,0,1818556,0,1818556,null,0,1869476,0,1869476]
["AVON          ",18,0,735982,0,735982,null,0,756589,0,756589]
["AYER          ",19,0,803867,14821,818688,null,0,826375,14821,841196]
["BARNSTABLE    ",20,0,2233598,110446,2344044,null,0,2296139,110446,2406585]
["BARRE         ",21,0,955017,68636,1023653,null,0,981757,68636,1050393]
["BECKET        ",22,0,96433,45321,141754,null,0,99133,45321,144454]
["BEDFORD       ",23,0,1218953,1022863,2241816,null,0,1253084,1022863,2275947]
["BELCHERTOWN   ",24,0,1806769,156541,1963310,null,0,1857359,156541,2013900]
["BELLINGHAM    ",25,0,1801819,879,1802698,null,0,1852270,879,1853149]
["BELMONT       ",26,0,2397629,0,2397629,null,0,2464763,0,2464763]
["BERKLEY       ",27,0,646096,31048,677144,null,0,664187,31048,695235]
["BERLIN        ",28,0,214087,0,214087,null,0,220081,0,220081]
["BERNARDSTON   ",29,0,308844,23634,332478,null,0,317492,23634,341126]
["BEVERLY       ",30,0,6201104,0,6201104,null,0,6374735,0,6374735]
["BILLERICA     ",31,0,6183385,140493,6323878,null,0,6356520,140493,6497013]
["BLACKSTONE    ",32,0,1453444,26371,1479815,null,0,1494140,26371,1520511]
["BLANDFORD     ",33,0,134832,20571,155403,null,0,138607,20571,159178]
["BOLTON        ",34,0,209654,12208,221862,null,0,215524,12208,227732]
["BOSTON        ",35,0,201181161,408662,201589823,null,0,206814233,408662,207222895]
["BOURNE        ",36,0,1556625,600691,2157316,null,0,1600210,600691,2200901]
["BOXBOROUGH    ",37,0,267857,3474,271331,null,0,275357,3474,278831]
["BOXFORD       ",38,0,516201,162650,678851,null,0,530655,162650,693305]
["BOYLSTON      ",39,0,363726,0,363726,null,0,373910,0,373910]
["BRAINTREE     ",40,0,6076372,30807,6107179,null,0,6246510,30807,6277317]
["BREWSTER      ",41,0,419274,315704,734978,null,0,431014,315704,746718]
["BRIDGEWATER   ",42,0,3867561,360892,4228453,null,0,3975853,360892,4336745]
["BRIMFIELD     ",43,0,414004,84114,498118,null,0,425596,84114,509710]
["BROCKTON      ",44,0,22233756,232,22233988,null,0,22856301,232,22856533]
["BROOKFIELD    ",45,0,524296,90875,615171,null,0,538976,90875,629851]
["BROOKLINE     ",46,0,6741760,0,6741760,null,0,6930529,0,6930529]
["BUCKLAND      ",47,0,325143,2404,327547,null,0,334247,2404,336651]
["BURLINGTON    ",48,0,2780883,0,2780883,null,0,2858748,0,2858748]
["CAMBRIDGE     ",49,0,22812246,0,22812246,null,0,23450989,0,23450989]
["CANTON        ",50,0,2277134,38584,2315718,null,0,2340894,38584,2379478]
["CARLISLE      ",51,0,232942,163746,396688,null,0,239464,163746,403210]
["CARVER        ",52,0,1551239,174878,1726117,null,0,1594674,174878,1769552]
["CHARLEMONT    ",53,0,185614,18961,204575,null,0,190811,18961,209772]
["CHARLTON      ",54,0,1538419,5210,1543629,null,0,1581495,5210,1586705]
["CHATHAM       ",55,0,159810,0,159810,null,0,164285,0,164285]
["CHELMSFORD    ",56,0,5389609,5516,5395125,null,0,5540518,5516,5546034]
["CHELSEA       ",57,0,8721149,137702,8858851,null,0,8965341,137702,9103043]
["CHESHIRE      ",58,0,652321,110901,763222,null,0,670586,110901,781487]
["CHESTER       ",59,0,191177,16961,208138,null,0,196530,16961,213491]
["CHESTERFIELD  ",60,0,146607,71230,217837,null,0,150712,71230,221942]
["CHICOPEE      ",61,0,12227779,0,12227779,null,0,12570157,0,12570157]
["CHILMARK      ",62,0,3983,0,3983,null,0,4095,0,4095]
["CLARKSBURG    ",63,0,386290,18885,405175,null,0,397106,18885,415991]
["CLINTON       ",64,0,2499684,2418,2502102,null,0,2569675,2418,2572093]
["COHASSET      ",65,0,546320,0,546320,null,0,561617,0,561617]
["COLRAIN       ",66,0,306467,42248,{"$f":"SUM(C75:E75)","v":348715},null,0,315048,42248,{"$f":"SUM(H75:J75)","v":357296}]
["CONCORD       ",67,0,1231888,570619,1802507,null,0,1266381,570619,1837000]
["CONWAY        ",68,0,189777,45671,235448,null,0,195091,45671,240762]
["CUMMINGTON    ",69,0,88584,51372,139956,null,0,91064,51372,142436]
["DALTON        ",70,0,1208147,55124,1263271,null,0,1241975,55124,1297099]
["DANVERS       ",71,0,3024383,280264,3304647,null,0,3109066,280264,3389330]
["DARTMOUTH     ",72,0,2676827,298529,2975356,null,0,2751778,298529,3050307]
["DEDHAM        ",73,0,3472478,0,3472478,null,0,3569707,0,3569707]
["DEERFIELD     ",74,0,510020,86261,596281,null,0,524301,86261,610562]
["DENNIS        ",75,0,578305,8118,586423,null,0,594498,8118,602616]
["DIGHTON       ",76,0,821082,4497,825579,null,0,844072,4497,848569]
["DOUGLAS       ",77,0,774922,208645,983567,null,0,796620,208645,1005265]
["DOVER         ",78,0,204266,65615,269881,null,0,209985,65615,275600]
["DRACUT        ",79,0,3720503,42872,3763375,null,0,3824677,42872,3867549]
["DUDLEY        ",80,0,1897257,0,1897257,null,0,1950380,0,1950380]
["DUNSTABLE     ",81,0,261176,42435,303611,null,0,268489,42435,310924]
["DUXBURY       ",82,0,941254,100780,1042034,null,0,967609,100780,1068389]
["EAST BRIDGEWAT",83,0,1589463,3354,1592817,null,0,1633968,3354,1637322]
["EAST BROOKFIEL",84,0,307962,3435,311397,null,0,316585,3435,320020]
["EAST LONGMEADO",85,0,1537043,0,1537043,null,0,1580080,0,1580080]
["EASTHAM       ",86,0,158202,1900,160102,null,0,162632,1900,164532]
["EASTHAMPTON   ",87,0,2984699,3407,2988106,null,0,3068271,3407,3071678]
["EASTON        ",88,0,2325370,95767,2421137,null,0,2390480,95767,2486247]
["EDGARTOWN     ",89,0,70733,1465372,1536105,null,0,72714,1465372,1538086]
["EGREMONT      ",90,0,66998,156206,223204,null,0,68874,156206,225080]
["ERVING        ",91,0,71370,47485,118855,null,0,73368,47485,120853]
["ESSEX         ",92,0,259986,1851,261837,null,0,267266,1851,269117]
["EVERETT       ",93,0,7336124,0,7336124,null,0,7541535,0,7541535]
["FAIRHAVEN     ",94,0,2394507,166179,2560686,null,0,2461553,166179,2627732]
["FALL RIVER    ",95,0,25304963,333270,25638233,null,0,26013502,333270,26346772]
["FALMOUTH      ",96,0,1472161,461240,1933401,null,0,1513382,461240,1974622]
["FITCHBURG     ",97,0,9061922,47697,9109619,null,0,9315656,47697,9363353]
["FLORIDA       ",98,0,52853,35815,88668,null,0,54333,35815,90148]
["FOXBOROUGH    ",99,0,1581670,122445,1704115,null,0,1625957,122445,1748402]
["FRAMINGHAM    ",100,0,10564592,465122,11029714,null,0,10860401,465122,11325523]
["FRANKLIN      ",101,0,2623839,136032,2759871,null,0,2697306,136032,2833338]
["FREETOWN      ",102,0,1008321,198492,1206813,null,0,1036554,198492,1235046]
["GARDNER       ",103,0,4499744,50885,4550629,null,0,4625737,50885,4676622]
["GAY HEAD      ",104,0,2482,2227,4709,null,0,2551,2227,4778]
["GEORGETOWN    ",105,0,760692,140235,900927,null,0,781991,140235,922226]
["GILL          ",106,0,258287,18279,276566,null,0,265519,18279,283798]
["GLOUCESTER    ",107,0,4241003,23993,4264996,null,0,4359751,23993,4383744]
["GOSHEN        ",108,0,84950,35965,120915,null,0,87329,35965,123294]
["GOSNOLD       ",109,0,2227,23637,25864,null,0,2289,23637,25926]
["GRAFTON       ",110,0,1660319,4949,1665268,null,0,1706808,4949,1711757]
["GRANBY        ",111,0,937587,67834,1005421,null,0,963839,67834,1031673]
["GRANVILLE     ",112,0,170249,53648,223897,null,0,175016,53648,228664]
["GREAT BARRINGT",113,0,805877,248949,1054826,null,0,828442,248949,1077391]
["GREENFIELD    ",114,0,3371242,29835,3401077,null,0,3465637,29835,3495472]
["GROTON        ",115,0,822557,77979,900536,null,0,845589,77979,923568]
["GROVELAND     ",116,0,772960,119276,892236,null,0,794603,119276,913879]
["HADLEY        ",117,0,481936,220339,702275,null,0,495430,220339,715769]
["HALIFAX       ",118,0,963926,47976,1011902,null,0,990916,47976,1038892]
["HAMILTON      ",119,0,713432,143730,857162,null,0,733408,143730,877138]
["HAMPDEN       ",120,0,730571,0,730571,null,0,751027,0,751027]
["HANCOCK       ",121,0,59953,49989,109942,null,0,61632,49989,111621]
["HANOVER       ",122,0,2249434,8380,2257814,null,0,2312418,8380,2320798]
["HANSON        ",123,0,1359810,43401,1403211,null,0,1397885,43401,1441286]
["HARDWICK      ",124,0,494351,58492,552843,null,0,508193,58492,566685]
["HARVARD       ",125,0,1572567,4819,1577386,null,0,1616599,4819,1621418]
["HARWICH       ",126,0,457398,82030,539428,null,0,470205,82030,552235]
["HATFIELD      ",127,0,331332,4466,335798,null,0,340609,4466,345075]
["HAVERHILL     ",128,0,10436481,941,10437422,null,0,10728702,941,10729643]
["HAWLEY        ",129,0,45954,57635,103589,null,0,47241,57635,104876]
["HEATH         ",130,0,88845,4410,{"$f":"SUM(C139:E139)","v":93255},null,0,91333,4410,{"$f":"SUM(H139:J139)","v":95743}]
["HINGHAM       ",131,0,1675859,4332,1680191,null,0,1722783,4332,1727115]
["HINSDALE      ",132,0,236433,31816,268249,null,0,243053,31816,274869]
["HOLBROOK      ",133,0,1566803,0,1566803,null,0,1610673,0,1610673]
["HOLDEN        ",134,0,2030218,102605,2132823,null,0,2087064,102605,2189669]
["HOLLAND       ",135,0,214328,3897,218225,null,0,220329,3897,224226]
["HOLLISTON     ",136,0,1644407,2348,1646755,null,0,1690450,2348,1692798]
["HOLYOKE       ",137,0,10784446,77810,10862256,null,0,11086410,77810,11164220]
["HOPEDALE      ",138,0,692424,31,692455,null,0,711812,31,711843]
["HOPKINTON     ",139,0,834159,346054,1180213,null,0,857515,346054,1203569]
["HUBBARDSTON   ",140,0,478330,67295,545625,null,0,491723,67295,559018]
["HUDSON        ",141,0,2117490,52650,2170140,null,0,2176780,52650,2229430]
["HULL          ",142,0,2250382,23656,2274038,null,0,2313393,23656,2337049]
["HUNTINGTON    ",143,0,365967,37034,403001,null,0,376214,37034,413248]
["IPSWICH       ",144,0,1704546,375103,2079649,null,0,1752273,375103,2127376]
["KINGSTON      ",145,0,1019231,32111,1051342,null,0,1047769,32111,1079880]
["LAKEVILLE     ",146,0,868848,13345,882193,null,0,893176,13345,906521]
["LANCASTER     ",147,0,1015030,125086,1140116,null,0,1043451,125086,1168537]
["LANESBOROUGH  ",148,0,366295,108408,474703,null,0,376551,108408,484959]
["LAWRENCE      ",149,0,20849605,6778,20856383,null,0,21433394,6778,21440172]
["LEE           ",150,0,661312,66705,728017,null,0,679829,66705,746534]
["LEICESTER     ",151,0,1843736,9922,1853658,null,0,1895361,9922,1905283]
["LENOX         ",152,0,566001,40770,606771,null,0,581849,40770,622619]
["LEOMINSTER    ",153,0,6077376,141003,6218379,null,0,6247543,141003,6388546]
["LEVERETT      ",154,0,189541,16497,206038,null,0,194848,16497,211345]
["LEXINGTON     ",155,0,1627400,0,1627400,null,0,1672967,0,1672967]
["LEYDEN        ",156,0,87430,29574,117004,null,0,89878,29574,119452]
["LINCOLN       ",157,0,722906,412583,1135489,null,0,743147,412583,1155730]
["LITTLETON     ",158,0,754817,5702,760519,null,0,775952,5702,781654]
["LONGMEADOW    ",159,0,1483570,0,1483570,null,0,1525110,0,1525110]
["LOWELL        ",160,0,26746523,209228,26955751,null,0,27495426,209228,27704654]
["LUDLOW        ",161,0,3243895,33644,3277539,null,0,3334724,33644,3368368]
["LUNENBURG     ",162,0,1122928,26222,1149150,null,0,1154370,26222,1180592]
["LYNN          ",163,0,23774862,1837,23776699,null,0,24440558,1837,24442395]
["LYNNFIELD     ",164,0,1104377,42759,1147136,null,0,1135300,42759,1178059]
["MALDEN        ",165,0,13322297,0,13322297,null,0,13695321,0,13695321]
["MANCHESTER    ",166,0,236147,0,236147,null,0,242759,0,242759]
["MANSFIELD     ",167,0,2368619,0,2368619,null,0,2434940,0,2434940]
["MARBLEHEAD    ",168,0,1209205,0,1209205,null,0,1243063,0,1243063]
["MARION        ",169,0,239599,24181,263780,null,0,246308,24181,270489]
["MARLBOROUGH   ",170,0,5780446,75163,5855609,null,0,5942298,75163,6017461]
["MARSHFIELD    ",171,0,2300372,3362,2303734,null,0,2364782,3362,2368144]
["MASHPEE       ",172,0,390683,407859,798542,null,0,401622,407859,809481]
["MATTAPOISETT  ",173,0,430377,174954,605331,null,0,442428,174954,617382]
["MAYNARD       ",174,0,1668251,0,1668251,null,0,1714962,0,1714962]
["MEDFIELD      ",175,0,1539280,47799,1587079,null,0,1582380,47799,1630179]
["MEDFORD       ",176,0,12880443,53104,12933547,null,0,13241095,53104,13294199]
["MEDWAY        ",177,0,1295508,0,1295508,null,0,1331782,0,1331782]
["MELROSE       ",178,0,5445804,1188,5446992,null,0,5598287,1188,5599475]
["MENDON        ",179,0,433944,4564,438508,null,0,446094,4564,450658]
["MERRIMAC      ",180,0,893448,3085,896533,null,0,918465,3085,921550]
["METHUEN       ",181,0,5773605,0,5773605,null,0,5935266,0,5935266]
["MIDDLEBOROUGH ",182,0,2618046,159941,2777987,null,0,2691351,159941,2851292]
["MIDDLEFIELD   ",183,0,56450,56885,113335,null,0,58031,56885,114916]
["MIDDLETON     ",184,0,581010,22117,603127,null,0,597278,22117,619395]
["MILFORD       ",185,0,3243398,0,3243398,null,0,3334213,0,3334213]
["MILLBURY      ",186,0,1880366,13574,1893940,null,0,1933016,13574,1946590]
["MILLIS        ",187,0,1111757,0,1111757,null,0,1142886,0,1142886]
["MILLVILLE     ",188,0,432534,2640,435174,null,0,444645,2640,447285]
["MILTON        ",189,0,3411993,892080,4304073,null,0,3507529,892080,4399609]
["MONROE        ",190,0,19525,7644,27169,null,0,20072,7644,27716]
["MONSON        ",191,0,1386152,88246,1474398,null,0,1424964,88246,1513210]
["MONTAGUE      ",192,0,1521832,221320,1743152,null,0,1564443,221320,1785763]
["MONTEREY      ",193,0,49097,244817,293914,null,0,50472,244817,295289]
["MONTGOMERY    ",194,0,92154,5632,{"$f":"SUM(C203:E203)","v":97786},null,0,94734,5632,{"$f":"SUM(H203:J203)","v":100366}]
["MOUNT WASHINGT",195,0,31831,239492,271323,null,0,32722,239492,272214]
["NAHANT        ",196,0,401221,1216,402437,null,0,412455,1216,413671]
["NANTUCKET     ",197,0,84135,185023,269158,null,0,86491,185023,271514]
["NATICK        ",198,0,4046428,115190,4161618,null,0,4159728,115190,4274918]
["NEEDHAM       ",199,0,1853722,0,1853722,null,0,1905626,0,1905626]
["NEW ASHFORD   ",200,0,21569,30863,52432,null,0,22173,30863,53036]
["NEW BEDFORD   ",201,0,24427447,20708,24448155,null,0,25111416,20708,25132124]
["NEW BRAINTREE ",202,0,140179,53089,193268,null,0,144104,53089,197193]
["NEW MARLBOROUG",203,0,62188,41237,103425,null,0,63929,41237,105166]
["NEW SALEM     ",204,0,110176,10974,121150,null,0,113261,10974,124235]
["NEWBURY       ",205,0,549937,313664,863601,null,0,565335,313664,878999]
["NEWBURYPORT   ",206,0,2708244,137985,2846229,null,0,2784075,137985,2922060]
["NEWTON        ",207,0,6240334,0,6240334,null,0,6415063,0,6415063]
["NORFOLK       ",208,0,1018329,227164,1245493,null,0,1046842,227164,1274006]
["NORTH ADAMS   ",209,0,4711039,85344,4796383,null,0,4842948,85344,4928292]
["NORTH ANDOVER ",210,0,2176186,261951,2438137,null,0,2237119,261951,2499070]
["NORTH ATTLEBOR",211,0,3055029,0,3055029,null,0,3140570,0,3140570]
["NORTH BROOKFIE",212,0,846135,26204,872339,null,0,869827,26204,896031]
["NORTH READING ",213,0,1885447,47918,1933365,null,0,1938240,47918,1986158]
["NORTHAMPTON   ",214,0,4667261,100063,4767324,null,0,4797944,100063,4898007]
["NORTHBOROUGH  ",215,0,1184473,136793,1321266,null,0,1217638,136793,1354431]
["NORTHBRIDGE   ",216,0,2241474,86282,2327756,null,0,2304235,86282,2390517]
["NORTHFIELD    ",217,0,383656,62906,446562,null,0,394398,62906,457304]
["NORTON        ",218,0,2207018,21556,2228574,null,0,2268815,21556,2290371]
["NORWELL       ",219,0,1138330,2334,1140664,null,0,1170203,2334,1172537]
["NORWOOD       ",220,0,4939252,0,4939252,null,0,5077551,0,5077551]
["OAK BLUFFS    ",221,0,77227,109394,186621,null,0,79389,109394,188783]
["OAKHAM        ",222,0,203729,87396,291125,null,0,209433,87396,296829]
["ORANGE        ",223,0,1716104,63269,1779373,null,0,1764155,63269,1827424]
["ORLEANS       ",224,0,182399,20767,203166,null,0,187506,20767,208273]
["OTIS          ",225,0,38623,132899,171522,null,0,39704,132899,172603]
["OXFORD        ",226,0,2183504,9552,2193056,null,0,2244642,9552,2254194]
["PALMER        ",227,0,2129586,78640,2208226,null,0,2189214,78640,2267854]
["PAXTON        ",228,0,574617,77924,652541,null,0,590706,77924,668630]
["PEABODY       ",229,0,7665240,10746,7675986,null,0,7879867,10746,7890613]
["PELHAM        ",230,0,169030,38898,207928,null,0,173763,38898,212661]
["PEMBROKE      ",231,0,1785006,0,1785006,null,0,1834986,0,1834986]
["PEPPERELL     ",232,0,1584876,38700,1623576,null,0,1629253,38700,1667953]
["PERU          ",233,0,121272,48267,169539,null,0,124668,48267,172935]
["PETERSHAM     ",234,0,121736,61107,182843,null,0,125145,61107,186252]
["PHILLIPSTON   ",235,0,195876,41477,237353,null,0,201361,41477,242838]
["PITTSFIELD    ",236,0,9168252,94082,9262334,null,0,9424963,94082,9519045]
["PLAINFIELD    ",237,0,53274,36539,89813,null,0,54766,36539,91305]
["PLAINVILLE    ",238,0,805600,28455,834055,null,0,828157,28455,856612]
["PLYMOUTH      ",239,0,4160905,698033,4858938,null,0,4277410,698033,4975443]
["PLYMPTON      ",240,0,251921,0,251921,null,0,258975,0,258975]
["PRINCETON     ",241,0,314403,193608,508011,null,0,323206,193608,516814]
["PROVINCETOWN  ",242,0,146881,76450,223331,null,0,150994,76450,227444]
["QUINCY        ",243,0,20276386,388782,20665168,null,0,20844125,388782,21232907]
["RANDOLPH      ",244,0,5519513,84758,5604271,null,0,5674059,84758,5758817]
["RAYNHAM       ",245,0,1207493,16887,1224380,null,0,1241303,16887,1258190]
["READING       ",246,0,3442525,36374,3478899,null,0,3538916,36374,3575290]
["REHOBOTH      ",247,0,1106916,27423,1134339,null,0,1137910,27423,1165333]
["REVERE        ",248,0,10923350,449,10923799,null,0,11229204,449,11229653]
["RICHMOND      ",249,0,114885,14957,129842,null,0,118102,14957,133059]
["ROCHESTER     ",250,0,451008,74260,525268,null,0,463636,74260,537896]
["ROCKLAND      ",251,0,2807181,0,2807181,null,0,2885782,0,2885782]
["ROCKPORT      ",252,0,464650,20826,485476,null,0,477660,20826,498486]
["ROWE          ",253,0,4184,6881,11065,null,0,4301,6881,11182]
["ROWLEY        ",254,0,573452,88552,662004,null,0,589509,88552,678061]
["ROYALSTON     ",255,0,190907,69972,260879,null,0,196252,69972,266224]
["RUSSELL       ",256,0,262262,3612,265874,null,0,269605,3612,273217]
["RUTLAND       ",257,0,982309,57978,1040287,null,0,1009814,57978,1067792]
["SALEM         ",258,0,7325200,61597,{"$f":"SUM(C267:E267)","v":7386797},null,0,7530306,61597,{"$f":"SUM(H267:J267)","v":7591903}]
["SALISBURY     ",259,0,670947,363133,1034080,null,0,689734,363133,1052867]
["SANDISFIELD   ",260,0,36797,79621,116418,null,0,37827,79621,117448]
["SANDWICH      ",261,0,1196864,579153,1776017,null,0,1230376,579153,1809529]
["SAUGUS        ",262,0,3895781,7837,3903618,null,0,4004863,7837,4012700]
["SAVOY         ",263,0,123038,79254,202292,null,0,126483,79254,205737]
["SCITUATE      ",264,0,2136185,72,2136257,null,0,2195998,72,2196070]
["SEEKONK       ",265,0,1306706,0,1306706,null,0,1343294,0,1343294]
["SHARON        ",266,0,1486493,163175,1649668,null,0,1528115,163175,1691290]
["SHEFFIELD     ",267,0,258699,99868,358567,null,0,265943,99868,365811]
["SHELBURNE     ",268,0,277698,2330,280028,null,0,285474,2330,287804]
["SHERBORN      ",269,0,230013,14435,244448,null,0,236453,14435,250888]
["SHIRLEY       ",270,0,1393208,92388,1485596,null,0,1432218,92388,1524606]
["SHREWSBURY    ",271,0,2958042,113028,3071070,null,0,3040867,113028,3153895]
["SHUTESBURY    ",272,0,180075,18981,199056,null,0,185117,18981,204098]
["SOMERSET      ",273,0,1628687,93,1628780,null,0,1674290,93,1674383]
["SOMERVILLE    ",274,0,26755389,0,26755389,null,0,27504540,0,27504540]
["SOUTH HADLEY  ",275,0,2773350,29343,2802693,null,0,2851004,29343,2880347]
["SOUTHAMPTON   ",276,0,676620,9969,686589,null,0,695565,9969,705534]
["SOUTHBOROUGH  ",277,0,464448,3621,468069,null,0,477453,3621,481074]
["SOUTHBRIDGE   ",278,0,3735783,3792,3739575,null,0,3840385,3792,3844177]
["SOUTHWICK     ",279,0,1339475,33131,1372606,null,0,1376980,33131,1410111]
["SPENCER       ",280,0,2401798,73103,2474901,null,0,2469048,73103,2542151]
["SPRINGFIELD   ",281,0,40199748,22189,40221937,null,0,41325341,22189,41347530]
["STERLING      ",282,0,736188,24178,760366,null,0,756801,24178,780979]
["STOCKBRIDGE   ",283,0,105849,41732,147581,null,0,108813,41732,150545]
["STONEHAM      ",284,0,3946510,2562,3949072,null,0,4057012,2562,4059574]
["STOUGHTON     ",285,0,3400457,0,3400457,null,0,3495670,0,3495670]
["STOW          ",286,0,447024,0,447024,null,0,459541,0,459541]
["STURBRIDGE    ",287,0,822696,143347,966043,null,0,845731,143347,989078]
["SUDBURY       ",288,0,1486462,37768,1524230,null,0,1528083,37768,1565851]
["SUNDERLAND    ",289,0,536722,133583,670305,null,0,551750,133583,685333]
["SUTTON        ",290,0,828928,144372,973300,null,0,852138,144372,996510]
["SWAMPSCOTT    ",291,0,1374511,1563,1376074,null,0,1412997,1563,1414560]
["SWANSEA       ",292,0,1994435,0,1994435,null,0,2050279,0,2050279]
["TAUNTON       ",293,0,8931365,150743,9082108,null,0,9181443,150743,9332186]
["TEMPLETON     ",294,0,1480770,80857,1561627,null,0,1522232,80857,1603089]
["TEWKSBURY     ",295,0,2955498,217738,3173236,null,0,3038252,217738,3255990]
["TISBURY       ",296,0,104125,12451,116576,null,0,107041,12451,119492]
["TOLLAND       ",297,0,19627,66690,86317,null,0,20177,66690,86867]
["TOPSFIELD     ",298,0,651328,140546,791874,null,0,669565,140546,810111]
["TOWNSEND      ",299,0,1395578,199989,1595567,null,0,1434654,199989,1634643]
["TRURO         ",300,0,31947,262,32209,null,0,32842,262,33104]
["TYNGSBOROUGH  ",301,0,1026218,27176,1053394,null,0,1054952,27176,1082128]
["TYRINGHAM     ",302,0,13482,12326,25808,null,0,13859,12326,26185]
["UPTON         ",303,0,565358,201138,766496,null,0,581188,201138,782326]
["UXBRIDGE      ",304,0,1461125,26773,1487898,null,0,1502036,26773,1528809]
["WAKEFIELD     ",305,0,3577383,32508,3609891,null,0,3677550,32508,3710058]
["WALES         ",306,0,250815,41244,292059,null,0,257838,41244,299082]
["WALPOLE       ",307,0,2706343,73420,2779763,null,0,2782121,73420,2855541]
["WALTHAM       ",308,0,10197155,7741,10204896,null,0,10482675,7741,10490416]
["WARE          ",309,0,1833298,19447,1852745,null,0,1884630,19447,1904077]
["WAREHAM       ",310,0,2100976,106632,2207608,null,0,2159803,106632,2266435]
["WARREN        ",311,0,960737,5196,965933,null,0,987638,5196,992834]
["WARWICK       ",312,0,135051,98401,233452,null,0,138832,98401,237233]
["WASHINGTON    ",313,0,100298,72197,172495,null,0,103106,72197,175303]
["WATERTOWN     ",314,0,7083057,0,7083057,null,0,7281383,0,7281383]
["WAYLAND       ",315,0,959875,99391,1059266,null,0,986751,99391,1086142]
["WEBSTER       ",316,0,2629189,25908,2655097,null,0,2702806,25908,2728714]
["WELLESLEY     ",317,0,1375608,0,1375608,null,0,1414125,0,1414125]
["WELLFLEET     ",318,0,62068,8399,70467,null,0,63806,8399,72205]
["WENDELL       ",319,0,185063,109468,294531,null,0,190245,109468,299713]
["WENHAM        ",320,0,454857,3062,457919,null,0,467593,3062,470655]
["WEST BOYLSTON ",321,0,846068,0,846068,null,0,869758,0,869758]
["WEST BRIDGEWAT",322,0,694397,38966,{"$f":"SUM(C331:E331)","v":733363},null,0,713840,38966,{"$f":"SUM(H331:J331)","v":752806}]
["WEST BROOKFIEL",323,0,517210,53276,570486,null,0,531692,53276,584968]
["WEST NEWBURY  ",324,0,314642,44320,358962,null,0,323452,44320,367772]
["WEST SPRINGFIE",325,0,3805777,480,3806257,null,0,3912339,480,3912819]
["WEST STOCKBRID",326,0,103248,73798,177046,null,0,106139,73798,179937]
["WEST TISBURY  ",327,0,197240,829714,1026954,null,0,202763,829714,1032477]
["WESTBOROUGH   ",328,0,1230539,110755,1341294,null,0,1264994,110755,1375749]
["WESTFIELD     ",329,0,6684896,118952,6803848,null,0,6872073,118952,6991025]
["WESTFORD      ",330,0,2256711,240,2256951,null,0,2319899,240,2320139]
["WESTHAMPTON   ",331,0,153875,1176,155051,null,0,158184,1176,159360]
["WESTMINSTER   ",332,0,695141,146464,841605,null,0,714605,146464,861069]
["WESTON        ",333,0,397212,0,397212,null,0,408334,0,408334]
["WESTPORT      ",334,0,1291919,671077,1962996,null,0,1328093,671077,1999170]
["WESTWOOD      ",335,0,774708,0,774708,null,0,796400,0,796400]
["WEYMOUTH      ",336,0,9259265,20231,9279496,null,0,9518524,20231,9538755]
["WHATELY       ",337,0,142507,31944,174451,null,0,146497,31944,178441]
["WHITMAN       ",338,0,2571344,0,2571344,null,0,2643342,0,2643342]
["WILBRAHAM     ",339,0,1554121,2576,1556697,null,0,1597636,2576,1600212]
["WILLIAMSBURG  ",340,0,321490,7585,329075,null,0,330492,7585,338077]
["WILLIAMSTOWN  ",341,0,1013834,159386,1173220,null,0,1042221,159386,1201607]
["WILMINGTON    ",342,0,2640489,0,2640489,null,0,2714423,0,2714423]
["WINCHENDON    ",343,0,1786474,92699,1879173,null,0,1836495,92699,1929194]
["WINCHESTER    ",344,0,1571148,20209,1591357,null,0,1615140,20209,1635349]
["WINDSOR       ",345,0,110274,93557,203831,null,0,113362,93557,206919]
["WINTHROP      ",346,0,4476634,0,4476634,null,0,4601980,0,4601980]
["WOBURN        ",347,0,6357286,2117,6359403,null,0,6535290,2117,6537407]
["WORCESTER     ",348,0,44128813,193960,44322773,null,0,45364420,193960,45558380]
["WORTHINGTON   ",349,0,133384,75236,208620,null,0,137119,75236,212355]
["WRENTHAM      ",350,0,990025,52703,1042728,null,0,1017746,52703,1070449]
["YARMOUTH      ",351,0,1340728,1169,1341897,null,0,1378268,1169,1379437]
[]
[null,null,{"$f":"SUM(C10:C360)","v":0},{"$f":"SUM(D10:D360)","v":1128617436},30000000,1158617436,null,0,1160218724,30000000,1190218724]

{"sheet":"Local Receipts","index":9,"n_rows":362,"n_cols":22,"rows_kept":362,"cut":false,"hidden":true,"merged":[]}
["Recurring Local Receipts"]
["1997-01-21"]
[null,null,null,null,null,"Base Year Actuals",null,null,null,null,null,null,null,null,null,"Current Year Estimates"]
[null,null,null,null,null,null," "]
[null,null,null," "," ","Penalties"," "," "," "," ","Recurring",null,null," "," ","Penalties"," "," "," "," ","Recurring","Recurring"]
[null,null,null,"Motor "," ","& Interest","Payments","Fines"," "," ","Local",null," ","Motor "," ","& Interest","Payments","Fines"," "," ","Local","Local"]
[null,null,"Base","Vehicle","Other","On Tax &","in-Lieu","and ","Investment","Miscel-","Receipts",null,"Current","Vehicle","Other","On Tax &","in-Lieu","and ","Investment","Miscel-","Receipts","Receipts"]
[null,null,"Year","Excise","Excise","Excise","of Taxes","Forfeits","Income","laneous","Base",null,"Year","Excise","Excise","Excise","of Taxes","Forfeits","Income","laneous","Current","Base"]
[]
["ABINGTON      ",1,2019,2104723,285000,225000,0,40000,65000,25000,{"$f":"SUM(D10:J10)","v":2744723},null,2020,2531824,340000,250000,0,50000,85000,245000,{"$f":"SUM(N10:T10)","v":3501824},{"$f":"SUM(N10:T10)","v":3501824}]
["ACTON         ",2,2019,3420000,310000,125000,40000,113000,112000,0,{"$f":"SUM(D11:J11)","v":4120000},null,2020,3429000,309000,160000,45000,92000,117000,0,{"$f":"SUM(N11:T11)","v":4152000},{"$f":"SUM(N11:T11)","v":4152000}]
["ACUSHNET      ",3,2019,1000000,0,110000,0,10000,13500,75000,1208500,null,2020,1200000,0,110000,0,10000,13500,75000,1408500,1408500]
["ADAMS         ",4,2019,944504,15213,95956,136900,15700,5000,0,1213273,null,2020,975000,16000,92538,151462,16000,5000,0,1256000,1256000]
["AGAWAM        ",5,2019,3650000,0,210000,52000,11900,166000,1228050,5317950,null,2020,3500000,160000,196000,52000,11900,300000,1496583,5716483,5716483]
["ALFORD        ",6,2019,104000,0,18000,0,4500,3000,0,129500,null,2020,95000,0,7000,0,3000,4700,0,109700,109700]
["AMESBURY      ",7,2019,2230000,578500,192500,12000,71500,30500,136000,3251000,null,2020,2314606,607000,120000,12000,60000,40000,185000,3338606,3338606]
["AMHERST       ",8,2019,1875000,687000,197229,948476,97700,80000,260549,4145954,null,2020,1930373,700000,232229,951277,87700,90000,655549,4647128,4647128]
["ANDOVER       ",9,2019,5331697,2250205,326345,382000,275000,146100,78114,8789461,null,2020,5826858,2358666,461500,412000,242000,631269,76121,10008414,10008414]
["ARLINGTON     ",10,2019,4551000,725000,355000,18000,30000,65000,0,5744000,null,2020,5051000,725000,355000,18000,30000,65000,0,6244000,6244000]
["ASHBURNHAM    ",11,2019,880595,2012,52983,67637,21850,3900,110000,1138977,null,2020,890000,2012,120000,67930,21850,3900,110000,1215692,1215692]
["ASHBY         ",12,2019,400000,0,22500,12000,8500,2400,0,445400,null,2020,410000,0,22000,12000,9500,2500,0,456000,456000]
["ASHFIELD      ",13,2019,178500,0,24000,0,2000,3000,0,207500,null,2020,200000,0,17000,0,3105.09,13000,0,233105.09,233105.09]
["ASHLAND       ",14,2019,2565000,225000,195000,0,25000,100000,100000,3210000,null,2020,2895000,0,230135.77,0,30000,200000,100000,3455135.77,3455135.77]
["ATHOL         ",15,2019,1020000,126000,190000,0,15000,12000,0,1363000,null,2020,1050000,140000,195000,0,15000,25000,0,1425000,1425000]
["ATTLEBORO     ",16,2019,4900863.07,645000,410000,6700,250000,20000,477000,6709563.0700000003,null,2020,5009261.1500000004,685000,410000,6700,210000,20000,477000,6817961.1500000004,6817961.1500000004]
["AUBURN        ",17,2019,2905000,1025000,250000,42715.73,145500,75000,0,4443215.7300000004,null,2020,2930000,1025000,245000,85000,145500,80000,0,4510500,4510500]
["AVON          ",18,2019,1072723,70000,140000,73500,25000,150000,35000,1566223,null,2020,1075800,70000,181944,74970,25500,153000,30000,1611214,1611214]
["AYER          ",19,2019,1096400,123000,68000,7500,10000,18000,100000,1422900,null,2020,1099000,123000,75000,7000,9000,23000,120000,1456000,1456000]
["BARNSTABLE    ",20,2019,7128259,2030000,1124000,30000,376000,400000,700000,11788259,null,2020,7131377,2060000,1204000,32000,330000,400000,600000,11757377,11757377]
["BARRE         ",21,2019,650000,0,50000,215085,12500,4000,0,931585,null,2020,722011.97,0,55000,220168.6,13000,10000,0,1020180.57,1020180.57]
["BECKET        ",22,2019,230000,0,100000,5000,9000,15000,0,359000,null,2020,230000,0,100000,5000,9000,15000,0,359000,359000]
["BEDFORD       ",23,2019,1950000,1100000,50000,1654518,60000,150000,50000,5014518,null,2020,1950000,1050000,50000,1734184,60000,220000,30000,5094184,5094184]
["BELCHERTOWN   ",24,2019,1915000,97000,155000,328000,40700,50000,185593,2771293,null,2020,2000000,100000,140000,328000,25700,70000,269593,2933293,2933293]
["BELLINGHAM    ",25,2019,2500000,355000,225000,83971,101400,40000,242928,3548299,null,2020,2650000,370000,285575,68733,115700,30000,257928,3777936,3777936]
["BELMONT       ",26,2019,3199812,200000,200000,36000,125075,149308,0,3910195,null,2020,3435243,229279,330000,36000,237733,250000,0,4518255,4518255]
["BERKLEY       ",27,2019,654000,20000,45000,0,10605,8000,0,737605,null,2020,730700,20000,45000,0,10604,20386,0,826690,826690]
["BERLIN        ",28,2019,536911,51784,24620,67522,38880,18000,21078,758795,null,2020,535455,82080,29500,69613,28250,38515,0,783413,783413]
["BERNARDSTON   ",29,2019,248000,90000,15000,0,33500,2600,5000,394100,null,2020,251850,88000,15000,0,33000,3103,5000,395953,395953]
["BEVERLY       ",30,2019,4725000,870000,320050,236667,85200,75000,820000,7131917,null,2020,4500000,875000,320050,236667,20000,100000,862000,6913717,6913717]
["BILLERICA     ",31,2019,6300000,1500000,350000,40000,125000,225000,125000,8665000,null,2020,6500000,1500000,355000,45000,125000,225000,125000,8875000,8875000]
["BLACKSTONE    ",32,2019,975000,30000,100000,12000,35000,8000,0,1160000,null,2020,1150000,40000,100000,12000,35000,8000,0,1345000,1345000]
["BLANDFORD     ",33,2019,150000,30000,35000,220000,500,2300,0,437800,null,2020,165000,33000,63000,260000,5000,2300,0,528300,528300]
["BOLTON        ",34,2019,865438,10000,50000,0,40000,10000,0,975438,null,2020,900000,62000,60000,0,40000,12000,0,1074000,1074000]
["BOSTON        ",35,2019,52040000,149250000,9005000,63016158,68745000,5000000,7767338,354823496,null,2020,52040000,164000000,8000000,68530000,69175000,15000000,7767338,384512338,384512338]
["BOURNE        ",36,2019,2850000,525000,196791,20000,125000,46000,649000,4411791,null,2020,3215000,555000,168895.84,20000,130000,250000,730000,5068895.84,5068895.84]
["BOXBOROUGH    ",37,2019,800000,127500,40000,0,28500,8000,23000,1027000,null,2020,840000,181000,40000,0,28500,25000,33000,1147500,1147500]
["BOXFORD       ",38,2019,1650000,0,72000,0,50000,95000,0,1867000,null,2020,1630000,0,53300,0,25000,150000,3983,1862283,1862283]
["BOYLSTON      ",39,2019,1096000,0,32000,595000,13000,5000,100000,1841000,null,2020,1022000,0,35000,595000,13000,20000,100000,1785000,1785000]
["BRAINTREE     ",40,2019,6613000,2793000,318000,2572000,97000,1200000,1511000,15104000,null,2020,6673386,2913000,298000,2411000,97000,1070000,1343000,14805386,14805386]
["BREWSTER      ",41,2019,1651000,1339200,218000,7000,28200,113784,68500,3425684,null,2020,1436262,1214187,152889,8328,23826,114793,54778,3005063,3005063]
["BRIDGEWATER   ",42,2019,3359518,500000,226143,5121,20000,20000,0,4130782,null,2020,3331972.9,500000,261000,5121,39000,60254,0,4197347.9000000004,4197347.9000000004]
["BRIMFIELD     ",43,2019,532394.48,2172,60000,2628,2200,9000,60000,668394.48,null,2020,465000,1961,50000,2688,2935,18777,55000,596361,596361]
["BROCKTON      ",44,2019,8330000,2090000,1845000,165000,250000,480000,1705000,14865000,null,2020,8500000,1900000,1950000,160000,350000,400000,1020000,14280000,14280000]
["BROOKFIELD    ",45,2019,479361.72,0,58725.95,5000,4134,4500,18038.28,569759.94999999995,null,2020,447668.39,0,40000,5000,12000,15000,25000,544668.39,544668.39]
["BROOKLINE     ",46,2019,6022200,2972410,512806,983636,3592000,436391,1157379,15676822,null,2020,6142644,3460310,525676,1010509,3392000,447300,1081367,16059806,16059806]
["BUCKLAND      ",47,2019,170000,0,15000,0,3000,1500,0,189500,null,2020,170000,0,15000,0,3000,1500,0,189500,189500]
["BURLINGTON    ",48,2019,3933515.34,4275000,400000,520000,25000,250000,210000,9613515.3399999999,null,2020,4097757.1,4460000,225000,520000,15000,485000,260000,10062757.1,10062757.1]
["CAMBRIDGE     ",49,2019,7200000,20012500,550000,7100000,11343735,2810000,1000000,50016235,null,2020,7600000,20750000,550000,7100000,10244395,4870000,1000000,52114395,52114395]
["CANTON        ",50,2019,4000000,550000,300000,242736,100000,80000,150000,5422736,null,2020,4300000,550000,275000,248804,80000,300000,250000,6003804,6003804]
["CARLISLE      ",51,2019,902112,0,49000,7000,4000,12000,12473,986585,null,2020,950000,0,49000,7000,4000,13000,12000,1035000,1035000]
["CARVER        ",52,2019,1640183,234003,160000,28000,24631,37000,138000,2261817,null,2020,1742353,239752,170167,28589,24573,55678,41202,2302314,2302314]
["CHARLEMONT    ",53,2019,145000,25000,33000,882,2000,3750,8000,217632,null,2020,140000,32000,35000,1000,0,5000,0,213000,213000]
["CHARLTON      ",54,2019,1825000,199000,75500,700000,80200,12000,24000,2915700,null,2020,2000000,185150,78000,700000,82000,45500,32500,3123150,3123150]
["CHATHAM       ",55,2019,985000,1665000,150000,25000,30000,32500,2500,2890000,null,2020,985000,1700000,150000,25000,40000,75000,2500,2977500,2977500]
["CHELMSFORD    ",56,2019,5450000,1048524,430000,70393,170000,150000,922883,8241800,null,2020,5400000,1070000,450000,53393,170000,217000,876407,8236800,8236800]
["CHELSEA       ",57,2019,11700000,2300000,350000,1816509,2700000,1400000,700000,20966509,null,2020,12100000,2450000,358750,1800000,2752500,1300000,1350000,22111250,22111250]
["CHESHIRE      ",58,2019,540000,0,25000,0,4300,3500,0,572800,null,2020,570000,0,30000,0,3800,5000,0,608800,608800]
["CHESTER       ",59,2019,140000,0,28000,7550,4500,4000,0,184050,null,2020,160000,0,15000,11500,3000,3400,3000,195900,195900]
["CHESTERFIELD  ",60,2019,158000,0,36674.120000000003,0,505,1010,2500,198689.12,null,2020,160000,0,29000,282,600,9450,2500,201832,201832]
["CHICOPEE      ",61,2019,5650000,1160000,500000,1300000,230000,350000,700000,9890000,null,2020,6200000,1207008,500000,1300000,250000,500000,650000,10607008,10607008]
["CHILMARK      ",62,2019,260000,58000,28000,5000,7500,4500,0,363000,null,2020,260000,80000,32000,5000,8000,6000,0,391000,391000]
["CLARKSBURG    ",63,2019,230296.27,2650,13200,0,1200,3855,21750,272951.27,null,2020,230600,2790,13200,0,1400,4500,21750,274240,274240]
["CLINTON       ",64,2019,1400000,0,220000,200000,25000,25000,150000,2020000,null,2020,1498879,80000,200000,280000,20000,125000,250000,2453879,2453879]
["COHASSET      ",65,2019,1188297,192519,130000,1291,25000,33936,8242,1579285,null,2020,1543102,194445,131300,1304,25250,34275,8324,1938000,1938000]
["COLRAIN       ",66,2019,130000,0,10000,0,6000,1000,0,{"$f":"SUM(D75:J75)","v":147000},null,2020,130000,0,10000,0,6000,1000,0,{"$f":"SUM(N75:T75)","v":147000},{"$f":"SUM(N75:T75)","v":147000}]
["CONCORD       ",67,2019,3095601,1235000,160000,20000,50000,500000,115000,5175601,null,2020,3316531,1555269,150000,20000,75000,700000,160000,5976800,5976800]
["CONWAY        ",68,2019,215000,0,15000,0,1000,5000,0,236000,null,2020,220000,0,11000,0,1000,5000,0,237000,237000]
["CUMMINGTON    ",69,2019,97000,0,10000,1000,1000,500,0,109500,null,2020,101500,0,9000,1000,500,500,0,112500,112500]
["DALTON        ",70,2019,750000,38850,45000,6600,14700,10000,0,865150,null,2020,750000,38850,46000,6600,13700,10000,0,865150,865150]
["DANVERS       ",71,2019,4400000,2460000,300000,1220000,50000,160000,303000,8893000,null,2020,4450000,2475000,300000,1220000,50000,160000,424077.88,9079077.8800000008,9079077.8800000008]
["DARTMOUTH     ",72,2019,3850000,1025000,250000,10000,100000,46000,200000,5481000,null,2020,3935000,1040000,250000,10000,100000,48000,200000,5583000,5583000]
["DEDHAM        ",73,2019,3800000,0,550000,28000,160000,250000,275000,5063000,null,2020,3800000,0,600000,140000,130000,200000,290000,5160000,5160000]
["DEERFIELD     ",74,2019,585000,210000,25000,130000,50000,12000,25000,1037000,null,2020,615000,245000,35000,160000,55000,25000,25000,1160000,1160000]
["DENNIS        ",75,2019,2178000,845000,390000,0,70000,15000,145000,3643000,null,2020,1998000,845000,390000,0,70000,15000,325000,3643000,3643000]
["DIGHTON       ",76,2019,1076118.75,24000,88615,3410.67,1550,23000,5410,1222104.42,null,2020,1220902.8,21559.93,88749.5,3410.67,598.24,61234.2,66548,1463003.3399999999,1463003.3399999999]
["DOUGLAS       ",77,2019,1041927,28400,110000,0,20000,19000,30000,1249327,null,2020,1069812,28400,110000,0,20000,19000,30000,1277212,1277212]
["DOVER         ",78,2019,1200000,200,50000,0,1800,75000,0,1327000,null,2020,1350000,200,75000,200,2000,75000,0,1502400,1502400]
["DRACUT        ",79,2019,4745674,378000,110000,20744,12500,75000,251500,5593418,null,2020,4807440,450000,175000,21302,53000,100000,260000,5866742,5866742]
["DUDLEY        ",80,2019,1543720,78000,124500,850,38625,28170,0,1813865,null,2020,1683720,97000,124500,850,38790,91710,0,2036570,2036570]
["DUNSTABLE     ",81,2019,550000,3000,35000,0,10000,7000,0,605000,null,2020,550000,3000,25000,0,15000,8000,0,601000,601000]
["DUXBURY       ",82,2019,2605540,94699,200000,8250,30360,185645,696500,3820994,null,2020,2790811.2,131256,229199,7260,36500,250176,724928,4170130.2,4170130.2]
["EAST BRIDGEWAT",83,2019,1946159,0,275000,3000,20000,35000,70000,2349159,null,2020,1971159,0,315000,3000,20000,85000,70000,2464159,2464159]
["EAST BROOKFIEL",84,2019,300000,1000,20000,0,10000,2000,0,333000,null,2020,300000,1500,20000,0,13000,3000,0,337500,337500]
["EAST LONGMEADO",85,2019,2408169.06,315000,225000,61000,5000,60000,330000,3404169.06,null,2020,2432008.13,325000,200000,63500,10000,150000,430000,3610508.13,3610508.13]
["EASTHAM       ",86,2019,880000,388000,90000,8000,34000,20000,32500,1452500,null,2020,880000,403000,90000,8000,34000,22000,33000,1470000,1470000]
["EASTHAMPTON   ",87,2019,1600909,180000,115000,33000,32000,15000,90000,2065909,null,2020,1778075.32,265000,105000,33000,25000,21500,125000,2352575.3200000003,2352575.3200000003]
["EASTON        ",88,2019,3750000,345000,275000,0,25000,55000,619000,5069000,null,2020,3830000,400000,275000,0,27000,75000,599000,5206000,5206000]
["EDGARTOWN     ",89,2019,850000,887500,85000,28000.17,45000,30000,0,1925500.17,null,2020,850000,1032718.4,85000,28000.17,45000,30000,0,2070718.5699999998,2070718.5699999998]
["EGREMONT      ",90,2019,215000,0,20000,700,12000,4000,12000,263700,null,2020,220000,0,19000,700,1000,9500,13000,263200,263200]
["ERVING        ",91,2019,175000,792,6600,0,20000,30000,70000,302392,null,2020,160000,800,6500,0,8000,25000,40700,241000,241000]
["ESSEX         ",92,2019,675000,229000,22000,0,10275,25000,0,961275,null,2020,675000,224475,22550,0,7665,56500,0,986190,986190]
["EVERETT       ",93,2019,3700000,500000,350000,14000,1000000,35000,950000,6549000,null,2020,4000000,23250000,350000,14000,1000000,250000,6250000,35114000,35114000]
["FAIRHAVEN     ",94,2019,1700000,600000,325000,170000,4000,30000,40000,2869000,null,2020,2000000,600000,350000,170000,5000,210000,90000,3425000,3425000]
["FALL RIVER    ",95,2019,8230000,1347300,1411000,429400,1550000,115000,2770330,15853030,null,2020,8230000,2331000,1230000,410000,1693285,657382.51,2180000,16731667.51,16731667.51]
["FALMOUTH      ",96,2019,4000000,1560000,575000,165000,80000,40000,40000,6460000,null,2020,4425000,1560000,575000,165000,80000,191000,40000,7036000,7036000]
["FITCHBURG     ",97,2019,3777668.42,900000,580000,224000,142000,75000,750000,6448668.4199999999,null,2020,4196532.74,1050000,700000,206500,160000,300000,725000,7338032.7400000002,7338032.7400000002]
["FLORIDA       ",98,2018,80000,0,5000,180000,1000,3000,0,269000,null,2019,80000,0,2000,180000,1000,3000,0,266000,266000]
["FOXBOROUGH    ",99,2019,3065872,2803275,185281,2118068,78407,270108,326948,8847959,null,2020,3148412,2819762,245004,2730863,54597,383711,40235,9422584,9422584]
["FRAMINGHAM    ",100,2019,8470400,3121980,1415701,671564,404855,61778,2408358,16554636,null,2020,8573024,3212134,970439,657949,320936,296534,1823882,15854898,15854898]
["FRANKLIN      ",101,2019,4469160,1065090,296000,20200,99000,151000,206000,6306450,null,2020,4619680,1049462,261027,34000,110516,350185,265273,6690143,6690143]
["FREETOWN      ",102,2019,1895000,1000,50000,5000,10000,12333,20000,1993333,null,2020,1700000,5800,120000,0,38000,12333,81528,1957661,1957661]
["GARDNER       ",103,2019,1920462,115000,300000,40000,116100,25000,425000,2941562,null,2020,2094985,282276,330990,43000,125479,45000,517636,3439366,3439366]
["GAY HEAD      ",104,2019,50000,10000,44500,7500,7000,2500,2000,123500,null,2020,50000,10000,44500,7500,7000,2500,2000,123500,123500]
["GEORGETOWN    ",105,2019,1574746,80000,127000,45000,65000,18000,612254,2522000,null,2020,1575000,80000,72000,48000,42000,50000,651000,2518000,2518000]
["GILL          ",106,2018,155000,8500,9000,0,900,1500,0,174900,null,2019,155000,9500,5000,0,900,1500,0,171900,171900]
["GLOUCESTER    ",107,2019,3518674,1495000,480000,59000,305000,55000,1339617,7252291,null,2020,3571000,1550000,480000,78075,285000,125000,1205717,7294792,7294792]
["GOSHEN        ",108,2019,142000,0,15000,0,5000,1200,0,163200,null,2020,142000,0,15000,0,5000,1200,0,163200,163200]
["GOSNOLD       ",109,2018,5000,2050,0,0,0,740,50350,58140,null,2019,3000,2050,500,0,0,320,50350,56220,56220]
["GRAFTON       ",110,2019,2884954,125000,91000,69413,54950,58939,334500,3618756,null,2020,2771654.36,150000,105000,69413,54950,38000,322300,3511317.36,3511317.36]
["GRANBY        ",111,2019,514023.65,10000,15000,0,8000,23000,0,570023.65,null,2020,525000,15000,25000,0,13000,26347,0,604347,604347]
["GRANVILLE     ",112,2019,190000,0,32000,200000,5000,400,0,427400,null,2020,193000,0,20000,200000,6000,600,0,419600,419600]
["GREAT BARRINGT",113,2019,420000,470000,45000,2000,8000,20000,0,965000,null,2020,420000,470000,45000,2000,8000,30000,0,975000,975000]
["GREENFIELD    ",114,2019,1590000,610000,275000,35003,300000,15000,605000,3430003,null,2020,1590000,600000,209000,40000,286000,16500,615000,3356500,3356500]
["GROTON        ",115,2019,1549739,120000,90000,260000,25000,20000,1650,2066389,null,2020,1577642,200000,90000,260000,25000,40000,1263,2193905,2193905]
["GROVELAND     ",116,2019,1050000,0,130000,59000,55000,15000,0,1309000,null,2020,1050000,0,115000,36000,55000,20000,0,1276000,1276000]
["HADLEY        ",117,2019,528698,986717,19272,28000,28725,14000,53204,1658616,null,2020,739305,1384052,35000,15000,27000,25000,103000,2328357,2328357]
["HALIFAX       ",118,2019,1060000,154000,180000,2490,5000,3000,15000,1419490,null,2020,1090000,159000,175000,2490,4500,8000,15000,1453990,1453990]
["HAMILTON      ",119,2019,1075000,66700,77900,32000,6950,8000,15000,1281550,null,2020,1075000,69700,76500,33000,6850,8000,20490,1289540,1289540]
["HAMPDEN       ",120,2019,526227,0,30000,5600,4500,2700,21000,590027,null,2020,526227,0,40000,7000,4500,10000,25000,612727,612727]
["HANCOCK       ",121,2019,57000,237444,4300,145000,6000,5500,0,455244,null,2020,149000,255000,4000,200000,1500,17550,0,627050,627050]
["HANOVER       ",122,2019,2482658,750,120000,0,87163,60000,0,2750571,null,2020,2792508,448,120000,0,101230,85000,0,3099186,3099186]
["HANSON        ",123,2019,1365000,0,175000,9000,3000,14000,0,1566000,null,2020,1395000,0,175000,9500,3000,20500,0,1603000,1603000]
["HARDWICK      ",124,2019,335000,5600,82300,173718,2000,3000,120274,721892,null,2020,328881.63,8145.35,86789.91,175874.77,4345.5,3728.15,105130.35,712895.66,712895.66]
["HARVARD       ",125,2019,900000,20000,120000,10000,40000,30000,108049,1228049,null,2020,900000,20000,64000,25000,30000,30000,9492,1078492,1078492]
["HARWICH       ",126,2019,2300000,1095000,340000,55000,10000,150000,270000,4220000,null,2020,2325000,1125000,385994,55000,8800,225038.75,295000,4419832.75,4419832.75]
["HATFIELD      ",127,2019,622000,46500,32000,3698,11000,12000,6500,733698,null,2020,578800,45500,62200,3700,20000,20000,14000,744200,744200]
["HAVERHILL     ",128,2019,7500000,1315000,500000,2000000,710000,368000,1025000,13418000,null,2020,7632760,1435000,490000,2228000,687000,839000,1032000,14343760,14343760]
["HAWLEY        ",129,2019,31500,0,6500,0,0,800,500,39300,null,2020,35000,0,6500,1000,0,800,2500,45800,45800]
["HEATH         ",130,2019,75000,0,19000,0,0,750,0,{"$f":"SUM(D139:J139)","v":94750},null,2020,76500,0,15000,0,0,1200,0,{"$f":"SUM(N139:T139)","v":92700},{"$f":"SUM(N139:T139)","v":92700}]
["HINGHAM       ",131,2019,4350000,835000,300000,661429,80000,103400,0,6329829,null,2020,4700000,860000,400000,673335,60000,775000,0,7468335,7468335]
["HINSDALE      ",132,2019,250000,0,20000,20000,0,2000,0,292000,null,2020,250000,0,20000,20000,0,2000,0,292000,292000]
["HOLBROOK      ",133,2019,1500000,1000,210000,3313,18000,70000,435000,2237313,null,2020,1550000,1000,229000,3292,15694,54000,179162,2032148,2032148]
["HOLDEN        ",134,2019,2300000,0,115000,1043435,45800,60000,210375,3774610,null,2020,2375000,0,115000,1041032,45800,75000,210375,3862207,3862207]
["HOLLAND       ",135,2019,300000,0,55000,1400,2000,7500,40000,405900,null,2020,344000,0,50000,0,1800,13000,40000,448800,448800]
["HOLLISTON     ",136,2019,2050000,0,140000,30000,55000,35000,102339,2412339,null,2020,2110000,0,130000,30000,43548,50000,86337,2449885,2449885]
["HOLYOKE       ",137,2019,3140000,1085000,300000,1504000,335000,125000,1598000,8087000,null,2020,3160000,1110000,290000,1459000,350000,125000,1440000,7934000,7934000]
["HOPEDALE      ",138,2019,880000,0,210000,70000,19000,16500,0,1195500,null,2020,850000,0,150000,52000,20000,15000,0,1087000,1087000]
["HOPKINTON     ",139,2018,3138016,0,201080,256467,17707,192390,51234,3856894,null,2019,3155000,0,201000,256500,12000,202175,43000,3869675,3869675]
["HUBBARDSTON   ",140,2019,650200,0,45000,337000,12300,6700,0,1051200,null,2020,639742.69999999995,0,43975,343703,9193,20025,27000,1083638.7,1083638.7]
["HUDSON        ",141,2019,3005000,511245,304844,0,65000,150000,857222,4893311,null,2020,2976000,813600,268000,0,71000,175000,840372,5143972,5143972]
["HULL          ",142,2019,1452444,360000,200000,240000,99000,95000,545000,2991444,null,2020,1372000,355000,215000,230000,118000,250000,535000,3075000,3075000]
["HUNTINGTON    ",143,2019,280000,0,41500,6100,0,3800,0,331400,null,2020,251000,0,26000,6800,3850,5450,0,293100,293100]
["IPSWICH       ",144,2019,2000000,245000,155000,160000,43000,55000,140000,2798000,null,2020,2000000,242000,152000,155000,40000,79000,110000,2778000,2778000]
["KINGSTON      ",145,2019,2100000,379450,150000,9450,20000,45000,40000,2743900,null,2020,2250000,397500,200000,10000,15000,80000,60000,3012500,3012500]
["LAKEVILLE     ",146,2019,1850000,8000,145000,22000,18000,5800.76,0,2048800.76,null,2020,1850000,0,160000,20000,18000,23004,0,2071004,2071004]
["LANCASTER     ",147,2019,1100000,0,97000,12000,41133,20000,0,1270133,null,2020,1100000,36100,97000,12000,53950,50000,0,1349050,1349050]
["LANESBOROUGH  ",148,2019,535000,105291,140000,15449,3000,3800,62000,864540,null,2020,545000,100194,150000,0,2200,3000,82628,883022,883022]
["LAWRENCE      ",149,2019,5467944,1497626,986700,600000,934756,968176,1801492,12256694,null,2020,5368570.1900000004,1058626,1000000,630000,760000,1600000,1588250,12005446.190000001,12005446.190000001]
["LEE           ",150,2019,740000,440000,69660,35000,28000,30000,287455,1630115,null,2020,760000,440000,75000,78000,29000,50000,294650,1726650,1726650]
["LEICESTER     ",151,2019,1475000,95000,165000,45000,45000,45000,189000,2059000,null,2020,1500000,106000,195000,25000,35000,80000,157000,2098000,2098000]
["LENOX         ",152,2019,600000,1776357,50000,55000,22000,60000,74734,2638091,null,2020,620000,1797000,50000,55000,22000,66000,74734,2684734,2684734]
["LEOMINSTER    ",153,2019,2750000,265000,183000,0,110000,50000,48000,3406000,null,2020,2750000,315000,183000,0,110000,50000,48000,3456000,3456000]
["LEVERETT      ",154,2019,211083.53,0,16040.65,600,3662.5,5252.22,8200,244838.9,null,2020,220075.54,0,17232.82,700,4345.33,5697.65,8200,256251.34,256251.34]
["LEXINGTON     ",155,2019,5080000,1583000,341500,614000,200000,345000,400000,8563500,null,2020,5281392.38,1648000,341500,668000,202000,500000,378000,9018892.379999999,9018892.379999999]
["LEYDEN        ",156,2019,84554.31,0,14000,9000,2000,900,0,110454.31,null,2020,92018.64,0,13000,9000,1200,1200,0,116418.64,116418.64]
["LINCOLN       ",157,2019,429439,0,36197,117,27682,5885,473184,972504,null,2020,294222,0,36197,117,27682,5885,420475,784578,784578]
["LITTLETON     ",158,2019,1300000,436116,75000,850000,25000,100000,0,2786116,null,2020,1500000,461116,73000,750000,40000,150000,0,2974116,2974116]
["LONGMEADOW    ",159,2019,2489287,125000,145000,55900,25000,125000,785000,3750187,null,2020,2475000,115000,130000,50000,25000,175000,765000,3735000,3735000]
["LOWELL        ",160,2019,8750000,2127559,1324254,560602,1478500,300000,1740997,16281912,null,2020,8711942.75,1754366.31,1246786.97,425000,1361451.81,320000,1446540,15266087.840000002,15266087.840000002]
["LUDLOW        ",161,2019,2850000,388000,325000,1400000,40000,15000,400000,5418000,null,2020,2850000,406000,155000,1450000,180000,20000,425000,5486000,5486000]
["LUNENBURG     ",162,2019,1621640,96113,193552,1735,29716,61701,1376,2005833,null,2020,1671640,100980,156022,1648,27213,62935,0,2020438,2020438]
["LYNN          ",163,2019,8045936,663200,676976,487909,1487770,69582,3221066,14652439,null,2020,7958040,771040,650250,428088,1490750,285000,1171886,12755054,12755054]
["LYNNFIELD     ",164,2019,2776000,525000,65000,515000,61000,60000,82000,4084000,null,2020,2775000,500000,90000,530000,45000,80000,75000,4095000,4095000]
["MALDEN        ",165,2019,5503810.79,808000,702000,333000,1555000,147000,780000,9828810.7899999991,null,2020,4912854.07,725000,525000,285000,1400000,275000,720000,8842854.0700000003,8842854.0700000003]
["MANCHESTER    ",166,2019,700000,60000,36000,4000,30000,13000,8000,851000,null,2020,1000000,65000,60000,4000,30000,13000,4000,1176000,1176000]
["MANSFIELD     ",167,2019,3650000,755000,190000,714699,90000,350000,411500,6161199,null,2020,3700000,861807,185000,704478,81500,523004,423845,6479634,6479634]
["MARBLEHEAD    ",168,2019,2844821.39,0,105000,12000,51000,80000,0,3092821.39,null,2020,2792745.47,0,105000,12000,51000,80000,0,3040745.47,3040745.47]
["MARION        ",169,2019,600000,30000,75000,0,200,20000,0,725200,null,2020,600000,30000,75000,0,200,20000,0,725200,725200]
["MARLBOROUGH   ",170,2019,5526591.5499999998,2188000,560000,255000,150000,500000,460000,9639591.5500000007,null,2020,5600000,2250493,600000,300000,135000,750000,440000,10075493,10075493]
["MARSHFIELD    ",171,2019,4060000,472000,350000,45000,10000,200000,245000,5382000,null,2020,3925000,439000,375000,45000,10000,225000,150000,5169000,5169000]
["MASHPEE       ",172,2019,1482650,351500,200000,20000,39000,100000,195000,2388150,null,2020,1610475,545000,200000,20000,39000,150000,210000,2774475,2774475]
["MATTAPOISETT  ",173,2019,1007300,0,125000,6969,2000,40000,320550,1501819,null,2020,1186309,0,111000,7077,1000,70000,301203,1676589,1676589]
["MAYNARD       ",174,2019,1319900,108000,95000,30000,86000,36000,50000,1724900,null,2020,1340000,112000,98000,36000,69000,82000,100000,1837000,1837000]
["MEDFIELD      ",175,2019,2010000,150000,58000,3396,20435,200000,0,2441831,null,2020,2190000,175517,67000,3450,18694,215000,0,2669661,2669661]
["MEDFORD       ",176,2019,7000056,1742460,675100,1753000,160000,239000,520000,12089616,null,2020,7029750,2195875,692282,2257642,165000,385000,260000,12985549,12985549]
["MEDWAY        ",177,2019,1700000,100000,85000,24000,20000,50000,390100,2369100,null,2020,1762565,125000,80000,24000,20000,50000,477535,2539100,2539100]
["MELROSE       ",178,2019,2926242.54,200000,365000,75000,100000,45000,65000,3776242.54,null,2020,2940000,200000,365000,6000,100000,95000,65000,3771000,3771000]
["MENDON        ",179,2019,1100000,154382,50000,0,46000,3600,38355,1392337,null,2020,1100000,138382,50000,0,46000,23567,36833,1394782,1394782]
["MERRIMAC      ",180,2019,940000,0,22000,1200,45000,35000,37000,1080200,null,2020,990000,0,27000,1200,35000,65000,37000,1155200,1155200]
["METHUEN       ",181,2019,6260280,93000,0,256000,294527,555000,430000,7888807,null,2020,6500000,100000,0,256000,294527,675000,530000,8355527,8355527]
["MIDDLEBOROUGH ",182,2019,3000000,654841,323127,239921,98295,356896,105000,4778080,null,2020,3100000,775044,341351,268823,79087,600000,105000,5269305,5269305]
["MIDDLEFIELD   ",183,2019,57000,0,8600,0,100,2100,3500,71300,null,2020,58400,0,4600,0,200,3200,0,66400,66400]
["MIDDLETON     ",184,2019,1950000,430000,80000,130000,12000,70000,54855,2726855,null,2020,1975000,420000,90000,130000,12000,80000,55844,2762844,2762844]
["MILFORD       ",185,2019,4030000,1000000,337000,12713,164900,125000,957227,6626840,null,2020,4000000,1000000,300000,25000,165200,125000,1187236,6802436,6802436]
["MILLBURY      ",186,2019,1900000,312000,60000,2270000,60000,20000,160000,4782000,null,2020,2099805,331800,70000,2300053,70000,23000,160000,5054658,5054658]
["MILLIS        ",187,2019,1175000.58,110000,100000,2500,5000,14000,180100,1586600.58,null,2020,1186750,111100,101000,2525,15058.12,54140,182002,1652575.12,1652575.12]
["MILLVILLE     ",188,2019,397500,0,23900,0,20000,2400,0,443800,null,2020,395000,0,28000,0,10000,1800,0,434800,434800]
["MILTON        ",189,2019,4070000,194000,486000,105000,165000,50000,65000,5135000,null,2020,4230000,205000,535000,244000,175000,160000,90000,5639000,5639000]
["MONROE        ",190,2019,18500,0,1500,168350,0,5000,0,193350,null,2020,13000,0,1500,150000,0,5000,0,169500,169500]
["MONSON        ",191,2019,1160000,36000,46500,88900,18000,21000,5507,1375907,null,2020,1180000,38000,45000,13800,18000,21000,0,1315800,1315800]
["MONTAGUE      ",192,2019,657000,0,70000,5000,7000,5000,187792,931792,null,2020,346037.41,31000,101000,5000,14000,9000,171500,677537.40999999992,677537.40999999992]
["MONTEREY      ",193,2019,137880,0,17500,12000,5000,2000,0,174380,null,2020,140000,0,15000,12000,17000,2000,0,186000,186000]
["MONTGOMERY    ",194,2019,108000,0,7000,27000,1000,1000,0,{"$f":"SUM(D203:J203)","v":144000},null,2020,108000,0,7000,27000,900,1500,0,{"$f":"SUM(N203:T203)","v":144400},{"$f":"SUM(N203:T203)","v":144400}]
["MOUNT WASHINGT",195,2019,18000,0,1000,5000,0,400,0,24400,null,2020,18000,0,1000,5000,0,1000,0,25000,25000]
["NAHANT        ",196,2019,562573,5250,23000,1555,31473,945,0,624796,null,2020,550000,5381,20775,1558,29950,6435,0,614099,614099]
["NANTUCKET     ",197,2019,2450000,3832500,475000,8794,225000,150000,0,7141294,null,2020,2750000,4326733,450000,7000,265500,250000,0,8049233,8049233]
["NATICK        ",198,2019,5900000,2403000,394350,35950,200000,439075,650000,10022375,null,2020,5690000,2513000,330350,35950,100600,1170000,1040000,10879900,10879900]
["NEEDHAM       ",199,2019,4900000,1360000,225000,50000,120000,250000,4000,6909000,null,2020,5200000,1435000,225000,50000,152000,400000,600,7462600,7462600]
["NEW ASHFORD   ",200,2019,38000,3000,0,0,100,1000,0,42100,null,2020,34000,2700,0,0,1000,1500,0,39200,39200]
["NEW BEDFORD   ",201,2019,8358000,1471500,1753300,294400,129600,582000,3023700,15612500,null,2020,8000000,1525000,1239000,364000,230000,869000,3050000,15277000,15277000]
["NEW BRAINTREE ",202,2019,149500,0,22700,0,4800,1060,0,178060,null,2020,155000,0,20000,0,5800,1700,0,182500,182500]
["NEW MARLBOROUG",203,2019,250000,300,35000,0,0,4000,1000,290300,null,2020,260000,300,30000,0,0,4000,0,294300,294300]
["NEW SALEM     ",204,2019,110936,0,9000,632000,740,1600,0,754276,null,2020,131563,0,10359,686241,998,4403,0,833564,833564]
["NEWBURY       ",205,2019,1260000,15000,40000,56000,150000,39000,15000,1575000,null,2020,1300000,14000,36000,58000,120000,73000,24000,1625000,1625000]
["NEWBURYPORT   ",206,2019,2600000,960000,300000,60000,10000,50000,275000,4255000,null,2020,2625000,950000,315000,60000,12000,100000,289500,4351500,4351500]
["NEWTON        ",207,2019,13500000,4441808,1290000,285000,1615000,800000,5529182,27460990,null,2020,13500000,4475000,1290000,285000,1595000,1745064,5814700,28704764,28704764]
["NORFOLK       ",208,2019,2000000,85000,110000,75000,20000,25000,7000,2322000,null,2020,2000000,90000,85000,85000,20000,25000,25000,2330000,2330000]
["NORTH ADAMS   ",209,2019,1135698,571377,213310,82536,93268,5703,0,2101892,null,2020,1187030,626992,280000,14000,90000,5700,0,2203722,2203722]
["NORTH ANDOVER ",210,2019,4600000,554000,369000,116000,55000,130000,372047.28,6196047.2800000003,null,2020,4800000,590000,380600,116000,50000,420000,375836.3,6732436.2999999998,6732436.2999999998]
["NORTH ATTLEBOR",211,2019,4265000,751988,246982,28454,86500,110000,288031,5776955,null,2020,4200000,758000,227500,28500,73600,220000,313365,5820965,5820965]
["NORTH BROOKFIE",212,2019,530000,0,74000,3300,3700,2350,80000,693350,null,2020,530000,0,74000,3300,3700,2350,80000,693350,693350]
["NORTH READING ",213,2019,2500000,200000,200000,254000,15000,254000,50000,3473000,null,2020,2650000,225000,180000,254000,10000,210000,30000,3559000,3559000]
["NORTHAMPTON   ",214,2019,2643710,1305218,160000,155406,726036,109553,719048,5818971,null,2020,2536842,2546500,167406,166406,750000,196576,623000,6986730,6986730]
["NORTHBOROUGH  ",215,2019,2560000,449000,147000,112000,135000,95000,282000,3780000,null,2020,2560000,449000,147000,112000,130000,100000,290000,3788000,3788000]
["NORTHBRIDGE   ",216,2019,2033000,0,215768,1763,10000,50000,251560,2562091,null,2020,2175000,0,209446,1000,10720,100000,75000,2571166,2571166]
["NORTHFIELD    ",217,2019,348000,0,20000,1000,10000,5000,0,384000,null,2020,348000,0,20000,1000,10000,5000,0,384000,384000]
["NORTON        ",218,2019,1900000,351000,283000,37000,27000,60000,97500,2755500,null,2020,2536000,357000,297000,32000,27000,65000,194500,3508500,3508500]
["NORWELL       ",219,2019,1835000,2000,150000,0,47000,114000,0,2148000,null,2020,1739040,2140,270000,0,45000,270000,0,2326180,2326180]
["NORWOOD       ",220,2019,4953422,2361163,0,1157043,160825,356089,10364201,19352743,null,2020,4812877,2569987,0,1158082,160825,322416,9943574,18967761,18967761]
["OAK BLUFFS    ",221,2019,825000,804000,325000,14000,20000,15000,900000,2903000,null,2020,900000,979000,250000,14000,15000,84909,900000,3142909,3142909]
["OAKHAM        ",222,2019,277000,0,18000,140000,7000,0,0,442000,null,2020,277000,0,20000,140000,6000,1500,0,444500,444500]
["ORANGE        ",223,2019,765000,68000,198000,15000,18000,11000,90000,1165000,null,2020,763000,89600,120000,15700,15000,20600,171000,1194900,1194900]
["ORLEANS       ",224,2019,1174097,572718,132965,4606,29579,50236,0,1964201,null,2020,1197578,346304,160985,4625,23086,50000,0,1782578,1782578]
["OTIS          ",225,2019,205000,0,25000,0,0,4000,0,234000,null,2020,210000,0,25000,0,0,5000,0,240000,240000]
["OXFORD        ",226,2018,1750000,130000,147300,4200,69000,25000,208000,2333500,null,2019,1800000,140000,140000,0,56000,25000,203000,2364000,2364000]
["PALMER        ",227,2019,1567117,155000,134500,10000,26500,30000,258000,2181117,null,2020,1725000,163000,139000,10000,31000,54000,254000,2376000,2376000]
["PAXTON        ",228,2019,674000,500,30000,30000,6000,5000,15000,760500,null,2020,675000,13000,26000,30000,20000,5000,15000,784000,784000]
["PEABODY       ",229,2019,8300000,3106000,464000,845000,138000,145000,1418205.56,14416205.560000001,null,2020,8450000,3234000,550000,845000,156500,360000,1390000,14985500,14985500]
["PELHAM        ",230,2019,150000,0,7000,420000,9500,2500,10000,599000,null,2020,135000,0,7500,414601.99,4400,9500,8200,579201.99,579201.99]
["PEMBROKE      ",231,2019,2905134,320000,260000,33000,30500,95000,105000,3748634,null,2020,2965000,345427.31,184000,40000,35000,265000,77000,3911427.31,3911427.31]
["PEPPERELL     ",232,2019,1720622,48000,49000,21500,16500,12000,0,1867622,null,2020,1723523.84,55000,60675,23680,11895,26800,0,1901573.84,1901573.84]
["PERU          ",233,2019,110000,0,15500,2500,2500,2500,0,133000,null,2020,122000,0,10000,2500,1000,1500,0,137000,137000]
["PETERSHAM     ",234,2019,201756,0,16910,522524,6361,2075,0,749626,null,2020,174455,0,23800,525000,4900,4000,0,732155,732155]
["PHILLIPSTON   ",235,2019,240000,0,30000,11912,2000,5000,10000,298912,null,2020,240000,0,30000,11912,2000,13000,0,296912,296912]
["PITTSFIELD    ",236,2019,5225000,1440000,490000,45000,216200,120000,1585000,9121200,null,2020,5434000,1461600,490000,45000,216200,130000,1585000,9361800,9361800]
["PLAINFIELD    ",237,2019,65000,1500,10000,0,0,1500,2000,80000,null,2020,65000,1000,7500,0,0,1500,1200,76200,76200]
["PLAINVILLE    ",238,2019,1497000,387000,130000,145000,16200,208901.79,114850,2498951.79,null,2020,1540072,375000,90000,48000,17900,270000,124000,2464972,2464972]
["PLYMOUTH      ",239,2019,8524668,964338,814232,84900,305000,455991,2122871,13272000,null,2020,8652538,920001,910000,75000,350000,745000,1863208,13515747,13515747]
["PLYMPTON      ",240,2019,515000,2500,65000,165000,200,2500,0,750200,null,2020,526600,1200,50300,8400,450,44500,0,631450,631450]
["PRINCETON     ",241,2019,530556.11,0,25000,305000,9800,3000,5000,878356.11,null,2020,575000,0,50000,305000,5000,12000,10000,957000,957000]
["PROVINCETOWN  ",242,2019,560000,1197500,157000,6000,133000,125000,69000,2247500,null,2020,560000,1233200,157000,6000,133000,153520,44000,2286720,2286720]
["QUINCY        ",243,2019,11300000,1905000,1260000,1190000,670000,750000,4893517.87,21968517.870000001,null,2020,11260000,2000000,1394000,1120000,750000,1083000,6131000,23738000,23738000]
["RANDOLPH      ",244,2019,3885000,785000,365000,150000,135000,125000,900000,6345000,null,2020,3935000,955210,425000,167000,114000,166790,856000,6619000,6619000]
["RAYNHAM       ",245,2019,2000000,841500,165000,0,90000,20000,70000,3186500,null,2020,2000000,841500,165000,35000,90000,22000,70000,3223500,3223500]
["READING       ",246,2019,3900000,385000,200000,370000,95000,350000,2779727,8079727,null,2020,4000000,400000,205000,375000,100000,450000,2792739,8322739,8322739]
["REHOBOTH      ",247,2019,1900000,93600,171000,0,22000,14500,0,2201100,null,2020,1900000,92400,174000,0,27000,34500,0,2227900,2227900]
["REVERE        ",248,2019,5460000,2375000,640000,144000,1500000,400000,625000,11144000,null,2020,5950000,2725000,440000,144000,1500000,1200000,525000,12484000,12484000]
["RICHMOND      ",249,2019,245000,1000,35000,0,6500,7500,2000,297000,null,2020,249000,1800,35000,0,8500,11000,0,305300,305300]
["ROCHESTER     ",250,2019,778000,0,28000,3570000,8000,8000,389601,4781601,null,2020,825000,0,29000,3500000,11000,10000,350070,4725070,4725070]
["ROCKLAND      ",251,2019,2865000,895000,450000,20000,16000,250000,35000,4531000,null,2020,2922300,925000,450000,20000,16192,300000,175000,4808492,4808492]
["ROCKPORT      ",252,2019,850000,491300,95000,12498,120000,37500,63000,1669298,null,2020,975000,530500,118000,12950,306500,40000,30000,2012950,2012950]
["ROWE          ",253,2019,42000,0,1200,0,175,1000,0,44375,null,2020,45000,0,1200,0,60,2000,0,48260,48260]
["ROWLEY        ",254,2019,880000,2400,65000,3500,55000,31565.27,14500,1051965.27,null,2020,920000,152600,70000,13500,60000,54481.43,0,1270581.43,1270581.43]
["ROYALSTON     ",255,2018,160000,0,50000,4000,1000,3000,0,218000,null,2019,160000,0,42000,4000,3000,3000,0,212000,212000]
["RUSSELL       ",256,2019,160400,0,8725,2000,5075,500,0,176700,null,2020,160400,0,8725,2000,5075,500,4000,180700,180700]
["RUTLAND       ",257,2019,1199111,46000,67000,525750,10000,10000,4494,1862355,null,2020,1380000,50000,80000,525750,15000,10000,4105,2064855,2064855]
["SALEM         ",258,2019,4100000,2170000,440000,700000,800000,200000,900000,{"$f":"SUM(D267:J267)","v":9310000},null,2020,4050000,2130000,406028.48,620000,800000,229000,800000,{"$f":"SUM(N267:T267)","v":9035028.4800000004},{"$f":"SUM(N267:T267)","v":9035028.4800000004}]
["SALISBURY     ",259,2019,1470000,382500,158000,0,86400,18000,56200,2171100,null,2020,1515000,454000,180000,0,90000,41500,57200,2337700,2337700]
["SANDISFIELD   ",260,2019,78000,0,5000,0,3000,4000,0,90000,null,2020,78000,0,7000,0,3000,4000,0,92000,92000]
["SANDWICH      ",261,2019,3095500,559500,405000,22500,8000,30000,80000,4200500,null,2020,3430000,699000,370000,11000,7000,328000,100000,4945000,4945000]
["SAUGUS        ",262,2019,4534000,1750000,236000,71326,123500,600000,200000,7514826,null,2020,4500000,1924000,280000,70900,175000,1265000,150000,8364900,8364900]
["SAVOY         ",263,2019,100000,0,7500,0,2300,1000,0,110800,null,2020,110000,0,8000,0,1000,1385,0,120385,120385]
["SCITUATE      ",264,2019,2920530,269000,385500,16000,47700,110870,120000,3869600,null,2020,2949530,269000,330000,16000,40200,173370,75000,3853100,3853100]
["SEEKONK       ",265,2019,2500000,1272500,140000,3000,50000,25000,51000,4041500,null,2020,2835000,1312000,150000,3000,60000,70000,61000,4491000,4491000]
["SHARON        ",266,2019,3016300,317000,283000,1700,80000,279000,0,3977000,null,2020,3100000,300000,200000,1700,50000,368300,0,4020000,4020000]
["SHEFFIELD     ",267,2019,550000,0,85000,6000,12000,15000,0,668000,null,2020,569000,34200,77800,2500,6700,25600,0,715800,715800]
["SHELBURNE     ",268,2019,175000,0,20000,2000,3500,4000,0,204500,null,2020,175000,0,20000,1000,3000,10000,0,209000,209000]
["SHERBORN      ",269,2019,895000,30600,37000,0,0,17000,0,979600,null,2020,790129,29800,22000,0,1000,105000,0,947929,947929]
["SHIRLEY       ",270,2019,991535.63,40000,133000,16000,13000,19000,330000,1542535.63,null,2020,980765.69,40000,100000,17000,14025,24000,341500,1517290.69,1517290.69]
["SHREWSBURY    ",271,2019,6000000,575000,300000,35000,140000,485900,448000,7983900,null,2020,6112454,631000,330000,37000,140000,677370,485800,8413624,8413624]
["SHUTESBURY    ",272,2019,195000,0,14000,340000,5000,11000,11000,576000,null,2020,201579.13,0,22000,336000,2000,17000,18500,597079.13,597079.13]
["SOMERSET      ",273,2019,2200000,345000,190000,0,70000,20000,60000,2885000,null,2020,2200000,345000,130000,0,65000,75000,60000,2875000,2875000]
["SOMERVILLE    ",274,2019,6732124,3190027,629136,1538300,6113400,600000,989572,19792559,null,2020,6776206,3483452,515300,1507019,6158996,900000,667807,20008780,20008780]
["SOUTH HADLEY  ",275,2019,1756223,104000,100000,175000,20000,35000,120000,2310223,null,2020,1750223,104000,100000,175000,20000,50000,120000,2319223,2319223]
["SOUTHAMPTON   ",276,2019,1020000,52500,85000,53000,12000,6500,32125,1261125,null,2020,1015000,52500,90000,53000,5000,15000,15401,1245901,1245901]
["SOUTHBOROUGH  ",277,2019,1900000,85000,70000,400000,75000,65000,0,2595000,null,2020,2075000,85000,70000,400000,75000,165000,0,2870000,2870000]
["SOUTHBRIDGE   ",278,2019,1599838.43,300000,280000,83000,100000,40000,422000,2824838.4299999997,null,2020,1627693.92,324000,280000,85000,125000,50000,488300,2979993.92,2979993.92]
["SOUTHWICK     ",279,2019,1077000,0,44000,7000,17000,8000,0,1153000,null,2020,1050000,0,37000,6000,14300,6700,0,1114000,1114000]
["SPENCER       ",280,2019,1400767,143200,101000,0,26000,12960,0,1683927,null,2020,1452425,144495,101000,0,26000,12500,19375,1755795,1755795]
["SPRINGFIELD   ",281,2019,11300000,3152927,1230350,16119948,6496722,1896859,9550841,49747647,null,2020,12281263,3452927,1420500,16659948,6533999,3261523,9603367,53213527,53213527]
["STERLING      ",282,2019,1230000,20000,57000,775000,35000,25000,0,2142000,null,2020,1520000,17000,70000,775000,31000,65000,0,2478000,2478000]
["STOCKBRIDGE   ",283,2019,300000,420000,28000,22000,8000,15000,0,793000,null,2020,300000,410000,28000,22000,8000,20000,0,788000,788000]
["STONEHAM      ",284,2019,3600000,355000,160000,60000,55500,20000,215499,4465999,null,2020,3700000,355000,150000,51000,65000,50000,106000,4477000,4477000]
["STOUGHTON     ",285,2019,4109933,832445,601843,43365,79256,299916,327749,6294507,null,2020,3996204,945116,557319,66028,66004,300000,308642,6239313,6239313]
["STOW          ",286,2019,1175000,0,35000,90000,6500,16000,0,1322500,null,2020,1200000,0,50000,90000,6000,35000,0,1381000,1381000]
["STURBRIDGE    ",287,2019,1500000,1147800,79100,20000,156700,78000,233109,3214709,null,2020,1450000,1198000,90240,25000,157200,150000,181109,3251549,3251549]
["SUDBURY       ",288,2019,3400000,322000,0,80000,10000,20000,13879,3845879,null,2020,3350000,322200,0,60000,0,20200,9052,3761452,3761452]
["SUNDERLAND    ",289,2019,362784.08,44395.94,15311.24,2284.23,4492.5,4962.66,102162.6,536393.25,null,2020,395991.22,48890.97,14267.68,5083.28,4837.78,9498.9500000000007,112499.32,591069.19999999995,591069.19999999995]
["SUTTON        ",290,2019,1482821,112500,60000,0,50000,22000,30000,1757321,null,2020,1433492,107500,60000,0,40000,42000,30000,1712992,1712992]
["SWAMPSCOTT    ",291,2019,2350000,249500,165500,0,70000,160000,150000,3145000,null,2020,2500000,279000,185890,0,75850,205000,0,3245740,3245740]
["SWANSEA       ",292,2019,1430000,37277,103000,0,17500,14000,9000,1610777,null,2020,1535000,46000,117000,0,23000,39000,16000,1776000,1776000]
["TAUNTON       ",293,2019,7250000,948600,800000,100000,348000,500000,510000,10456600,null,2020,7325000,940600,760000,100000,315000,1000000,510000,10950600,10950600]
["TEMPLETON     ",294,2019,1000000,42000,80000,5000,4750,8500,1843523,2983773,null,2020,1025000,42000,87500,7500,5250,12500,1501173,2680923,2680923]
["TEWKSBURY     ",295,2019,4656094,1507950,302000,7990,97427,68880,81753,6722094,null,2020,4719642,1627631,218090,15997,83995,76510,83100,6824965,6824965]
["TISBURY       ",296,2019,850000,390000,150000,10000,75000,20000,260000,1755000,null,2020,900000,390000,150000,10000,80000,25000,210000,1765000,1765000]
["TOLLAND       ",297,2019,60000,0,8000,30000,2200,1000,0,101200,null,2020,73000,0,12000,30000,1700,3000,0,119700,119700]
["TOPSFIELD     ",298,2019,1000000,0,25000,75000,40000,15000,11000,1166000,null,2020,1000000,30000,25000,75000,30000,18000,12000,1190000,1190000]
["TOWNSEND      ",299,2019,1205879,100000,122803,10000,15500,10000,121,1464303,null,2020,1276004.4099999999,107650,132259,10000,18879,10000,90.64,1554883.0499999998,1554883.0499999998]
["TRURO         ",300,2019,376960,357770,116280,47120,27550,32490,332690,1290860,null,2020,350000,359000,80000,50000,30000,60000,274400,1203400,1203400]
["TYNGSBOROUGH  ",301,2019,1949385.59,290000,87600,36000,31900,49000,277675,2721560.59,null,2020,2140000,316000,350000,36000,20000,138383,225617,3226000,3226000]
["TYRINGHAM     ",302,2019,52000,0,5000,5000,450,1500,0,63950,null,2020,54000,0,6000,3500,450,2000,0,65950,65950]
["UPTON         ",303,2019,1050000,0,115000,186,31000,10000,436,1206622,null,2020,1025192,0,115000,186,31000,10000,308,1181686,1181686]
["UXBRIDGE      ",304,2019,1917352,0,100000,6000,10000,60000,200000,2293352,null,2020,2133229,85000,65000,5400,10000,70300,225000,2593929,2593929]
["WAKEFIELD     ",305,2019,3900000,910000,250000,1960438,75000,130000,0,7225438,null,2020,4100005,935000,270000,2078784,70000,145000,0,7598789,7598789]
["WALES         ",306,2019,190000,0,20000,8000,900,1500,18000,238400,null,2020,190000,0,35000,6000,3000,4000,10000,248000,248000]
["WALPOLE       ",307,2019,3970000,525000,270000,4000,37000,50000,100000,4956000,null,2020,4280000,780000,290000,4000,37000,81000,200000,5672000,5672000]
["WALTHAM       ",308,2019,8178127.1900000004,6421000,650000,70000,500000,600000,1840000,18259127.190000001,null,2020,8100000,7055000,606000,71500,470000,1200000,1140000,18642500,18642500]
["WARE          ",309,2019,935757.21,101800,73000,13000,40000,5000,310000,1478557.21,null,2020,952402.25,101800,80000,13000,20000,25000,310000,1502202.25,1502202.25]
["WAREHAM       ",310,2019,2850000,815000,250000,0,65000,55000,645000,4680000,null,2020,2900000,907000,275000,0,75000,120000,600000,4877000,4877000]
["WARREN        ",311,2019,547112.38,0,108000,2700,15000,13700,15000,701512.38,null,2020,578868.38,0,117000,5413.8,14000,21000,3000,739282.18,739282.18]
["WARWICK       ",312,2019,82000,0,6000,0,2000,1500,25500,117000,null,2020,82000,0,4000,0,2000,1500,30000,119500,119500]
["WASHINGTON    ",313,2019,75000,0,8500,106000,1200,1500,4500,196700,null,2020,80000,0,8600,108000,800,1000,4500,202900,202900]
["WATERTOWN     ",314,2019,4200000,1135000,250000,994240,705000,350000,516543,8150783,null,2020,4350000,1250000,250000,977236,705000,500000,423090,8455326,8455326]
["WAYLAND       ",315,2019,2718596,235000,275000,40000,45000,175000,5404,3494000,null,2020,2820000,245000,267596,75000,40000,350000,5404,3803000,3803000]
["WEBSTER       ",316,2019,2088452,310000,254923,5604,53257,60000,375000,3147236,null,2020,2083000,320000,244000,5604,57000,80000,450000,3239604,3239604]
["WELLESLEY     ",317,2019,5000000,700000,250000,76000,450000,450000,50000,6976000,null,2020,5158524,750000,250000,76000,450000,560430.98,47770,7292724.9800000004,7292724.9800000004]
["WELLFLEET     ",318,2019,463305.78,345000,100000,10000,45000,76000,58105,1097410.78,null,2020,524360.05000000005,373000,78000,10000,30000,77188.399999999994,40840,1133388.45,1133388.45]
["WENDELL       ",319,2018,79116,0,22646.29,18308.02,0,1869.72,0,121940.03000000001,null,2019,76343.210000000006,0,19003.7,19217.18,0,3660.59,0,118224.68,118224.68]
["WENHAM        ",320,2019,492361.85,0,50000,10348,27093,1934,0,581736.85,null,2020,135000,0,51500,10348,29361,1939,0,228148,228148]
["WEST BOYLSTON ",321,2019,1075500,180000,70000,680000,24000,15000,196000,2240500,null,2020,1080700,150000,65000,680000,24000,15000,252000,2266700,2266700]
["WEST BRIDGEWAT",322,2019,1760499.52,100800,150000,0,73000,30000,25000,{"$f":"SUM(D331:J331)","v":2139299.52},null,2020,1825000,128244,195000,0,73000,50000,25000,{"$f":"SUM(N331:T331)","v":2296244},{"$f":"SUM(N331:T331)","v":2296244}]
["WEST BROOKFIEL",323,2019,450000,50000,50000,24000,5000,20000,1000,600000,null,2020,485000,54000,50000,7500,3500,31500,0,631500,631500]
["WEST NEWBURY  ",324,2019,701400,2032,39000,5000,10000,40000,10000,807432,null,2020,810000,1600,39185,14000,15000,70000,26000,975785,975785]
["WEST SPRINGFIE",325,2019,2850000,1450000,150000,0,83000,175000,700000,5408000,null,2020,2850000,1510000,150000,0,83000,200000,800000,5593000,5593000]
["WEST STOCKBRID",326,2019,214000,39500,22000,0,4000,1000,0,280500,null,2020,227000,37500,28000,0,3000,1000,0,296500,296500]
["WEST TISBURY  ",327,2019,560000,0,65000,1600,3200,22000,186850,838650,null,2020,560000,0,50000,3500,2500,23000,183937,822937,822937]
["WESTBOROUGH   ",328,2019,3314068.6,1850000,200000,60000,100000,300000,154000,5978068.5999999996,null,2020,3613907.12,1975000,189000,60000,115000,600000,103000,6655907.1200000001,6655907.1200000001]
["WESTFIELD     ",329,2019,4750000,775000,500000,550000,230625,190000,4375000,11370625,null,2020,4850000,805000,500000,550000,250000,325000,4475000,11755000,11755000]
["WESTFORD      ",330,2019,3626450,1170000,170000,65000,40000,120000,1852250.64,7043700.6399999997,null,2020,3760000,1227800,175000,65000,45000,120000,1857312.14,7250112.1399999997,7250112.1399999997]
["WESTHAMPTON   ",331,2019,250000,0,35000,16000,1200,3600,5000,310800,null,2020,250000,0,29500,18100,200,8000,5000,310800,310800]
["WESTMINSTER   ",332,2019,1258783,0,120000,58000,50000,10000,46217,1543000,null,2020,1275000,0,150000,56864,70000,30000,45000,1626864,1626864]
["WESTON        ",333,2019,2735000,0,150000,38657,95000,200000,159479,3378136,null,2020,2980000,0,150000,39623,85000,235000,0,3489623,3489623]
["WESTPORT      ",334,2019,2635960,350000,250000,16000,90000,10000,250000,3601960,null,2020,2701945,417000,235000,30000,100000,150000,460000,4093945,4093945]
["WESTWOOD      ",335,2019,2673415,0,90000,0,10000,40500,35000,2848915,null,2020,2680000,0,90000,0,25000,80000,35000,2910000,2910000]
["WEYMOUTH      ",336,2019,7219135,749000,712500,725000,102000,80000,690000,10277635,null,2020,7500000,795000,855000,770000,82000,75000,825000,10902000,10902000]
["WHATELY       ",337,2019,250000,22000,18000,0,15000,5000,0,310000,null,2020,250000,22000,18000,0,15000,5000,0,310000,310000]
["WHITMAN       ",338,2019,2067000,165000,170000,0,0,14000,19000,2435000,null,2020,2018000,170000,140000,0,0,32000,0,2360000,2360000]
["WILBRAHAM     ",339,2019,2219468,14300,230000,2500,24000,50000,2500,2542768,null,2020,2260000,19400,262000,0,22000,110000,3000,2676400,2676400]
["WILLIAMSBURG  ",340,2019,295000,0,20000,20000,7000,5000,14000,361000,null,2020,295000,20000,20000,25000,7000,10000,14000,391000,391000]
["WILLIAMSTOWN  ",341,2019,660000,575000,30000,76360,35000,60000,0,1436360,null,2020,675000,652250,27000,76360,33500,85000,0,1549110,1549110]
["WILMINGTON    ",342,2019,3830503,320000,450000,700000,90000,300000,107497,5798000,null,2020,4515048,380000,525000,700000,90000,625000,107497,6942545,6942545]
["WINCHENDON    ",343,2019,1175000,86200,263000,52000,22500,20000,336830,1955530,null,2020,1210000,87062,265630,52520,22725,45707,327705,2011349,2011349]
["WINCHESTER    ",344,2019,3775000,190000,300000,50000,31000,70000,100000,4516000,null,2020,3891000,200000,200000,30000,30000,200000,60000,4611000,4611000]
["WINDSOR       ",345,2019,143000,0,3500,9500,4000,2500,4000,166500,null,2020,135000,0,10000,5500,1200,3500,2000,157200,157200]
["WINTHROP      ",346,2019,2123975,270000,186000,1689214,314000,65000,153000,4801189,null,2020,2119377,274050,186000,2139214,312500,65000,135000,5231141,5231141]
["WOBURN        ",347,2019,6500000,3900000,465000,0,96999.61,475000,400000,11836999.609999999,null,2020,6500000,4000000,400000,0,100000,500000,500000,12000000,12000000]
["WORCESTER     ",348,2019,15600000,3950000,2025000,725000,2650000,1100000,7832009,33882009,null,2020,15850000,4850000,2150000,725000,2550000,1800000,6675000,34600000,34600000]
["WORTHINGTON   ",349,2019,95000,0,7200,5400,925,1000,0,109525,null,2020,95000,0,7200,5400,700,1000,0,109300,109300]
["WRENTHAM      ",350,2019,1663600,250000,160000,6750,50000,50000,61400,2241750,null,2020,1849916.81,253000,99338.96,6750,50000,50000,61400,2370405.77,2370405.77]
["YARMOUTH      ",351,2019,3300000,3374000,140000,0,50000,90000,500000,7454000,null,2020,3300000,3167000,140000,0,50000,100000,400000,7157000,7157000]
[]
[null,null,null,{"$f":"SUM(D10:D360)","v":828780891.82000017},{"$f":"SUM(E10:E360)","v":347295262.94},79615957.25,151340287.81999999,134245737.61000001,43254265.419999994,135780974.23000002,1720313377.0899992,null,null,849182428.87,397938781.2700001,78201157.629999995,159128024.46000001,133409728.87,77017042.610000014,136469373.63,{"$f":"SUM(U10:U360)","v":1831346537.3400006},{"$f":"SUM(V10:V360)","v":1831346537.3400006}]

{"sheet":"MRGF Calculation","index":10,"n_rows":362,"n_cols":21,"rows_kept":362,"cut":false,"hidden":true,"merged":[]}
["1997-01-21",null,null,null,null,null,null,null,"Municipal Revenue Growth Factor"]
[null,null,null,null,null,null,null,null,null,"Massaschusetts Department of Revenue, Division of Local Services"]
[null,null,null,null,null,null,null,null,null,null,null,null,null,null,null,null,null,null,null,null," "]
[]
[]
[]
[]
["MUNICIPALITY  ","DOR Code","FY2020 MRGF Levy Limit (* = Est)",null,"FY2020 General Revenue Sharing","Budgeted Recurring Local Receipts FY2019 (*=2018)",null,"Total, Base Municipal Revenues",null,"FY2020Levy Limit x 1.025","Estimated New Growth FY2021","Percent Change In Levy Limit","FY2021 General Revenue Sharing","Percent Change In GRS","Budgeted Recurring Local Receipts FY2020 (*=2019)",null,"Percent Change In Receipts","Total, Estimated Current Municipal Revenues",null,"Calculated Change, Base to Current","Calculated FY2021 Municipal Revenue Growth Factor Preliminary"]
[null,null,null,null,null,null,null,null,null,null," "]
["ABINGTON      ",1,32788179,"",2227078,2744723,"",37759980,null,33607883,508217,4.0499992390550261,2285567,2.6262663454086477,3501824,"",27.583876405742949,39903491,null,2143511,5.6800000000000006]
["ACTON         ",2,77655148,"",1554927,4120000,"",83330075,null,79596527,823145,3.5600009415988749,1596518,2.6747879482445156,4152000,"",0.77669902912621358,86168190,null,2838115,3.4099999999999997]
["ACUSHNET      ",3,18027438,"",1610078,1208500,"",20846016,null,18478124,306466,4.1999978033484293,1655159,2.7999264631899821,1408500,"",16.549441456350849,21848249,null,1002233,4.8099999999999996]
["ADAMS         ",4,11708307,"",2552680,1213273,"",15474260,null,12001015,110058,3.4400020429939189,2622288,2.7268596142093799,1256000,"",3.5216311580328581,15989361,null,515101,3.3300000000000005]
["AGAWAM        ",5,76081914,"",4009668,5317950,"",85409532,null,76712052,0,0.82823626124863259,4119203,2.731772306335587,5716483,"",7.4941095722975959,86547738,null,1138206,1.3299999999999998]
["ALFORD        ",6,1689068,"",14902,129500,"",1833470,null,1731295,10810,3.140015677284751,15319,2.7982821097839214,109700,"",-15.289575289575289,1867124,null,33654,1.8399999999999999]
["AMESBURY      ",7,47359518,"",2065799,3251000,"",52676317,null,48543506,710393,4.0000005912222329,2123641,2.7999819924397293,3338606,"",2.694740079975392,54716146,null,2039829,3.8699999999999997]
["AMHERST       ",8,50089984,"",9143343,4145954,"",63379281,null,51342234,871566,4.2400013543625805,9393657,2.7376638938296418,4647128,"",12.088267260080551,66254585,null,2875304,4.54]
["ANDOVER       ",9,150531622,"",2120778,8789461,"",161441861,null,154294913,3492334,4.8200005444703171,2173906,2.5051184046609309,10008414,"",13.868347558513543,169969567,null,8527706,5.28]
["ARLINGTON     ",10,106869736,"",8056055,5744000,"",120669791,null,109541479,1164880,3.589999511180602,8281625,2.800005709990808,6244000,"",8.7047353760445674,125231984,null,4562193,3.7800000000000002]
["ASHBURNHAM    ",11,9501460,"",945116,1138977,"",11585553,null,9738997,157724,4.1600027785203535,968756,2.5012802661260629,1215692,"",6.7354301272106456,12081169,null,495616,4.2799999999999994]
["ASHBY         ",12,5884703,"",569321,445400,"",6899424,null,6031821,64732,3.6000117593020411,582340,2.286759139395877,456000,"",2.3798832510103276,7134893,null,235469,3.4099999999999997]
["ASHFIELD      ",13,3938120,"",208962,207500,"",4354582,null,4036573,47651,3.7099936010075876,214482,2.6416286214718467,233105.09,"",12.339802409638551,4531811.09,null,177229.08999999985,4.07]
["ASHLAND       ",14,46224897,"",1535807,3210000,"",50970704,null,47380519,1146377,4.979998116599373,1576015,2.6180372924462514,3455135.77,"",7.6366283489096576,53558046.770000003,null,2587342.7700000033,5.08]
["ATHOL         ",15,11659210,"",2859298,1363000,"",15881508,null,11950690,272826,4.8400020241508646,2938014,2.7529834246028222,1425000,"",4.5487894350696996,16586530,null,705022,4.4400000000000004]
["ATTLEBORO     ",16,76079548,"",6057887,6709563.0700000003,"",88846998.069999993,null,77981537,1164017,4.0300002833875936,6227508,2.8000027072145781,6817961.1500000004,"",1.6155758410659082,92191023.150000006,null,3344025.0800000131,3.7600000000000002]
["AUBURN        ",17,44093695,"",1818556,4443215.7300000004,"",50355466.730000004,null,45196037,793687,4.3000002608082628,1869476,2.8000237551111979,4510500,"",1.5143147235842078,52369700,null,2014233.2699999958,4]
["AVON          ",18,19542594,"",735982,1566223,"",21844799,null,20031159,383255,4.4611273201500268,756589,2.7999326070474551,1611214,"",2.8725794474988557,22782217,null,937418,4.29]
["AYER          ",19,24559228,"",818688,1422900,"",26800816,null,25173209,884132,6.1000003746046092,841196,2.7492768918073796,1456000,"",2.3262351535596317,28354537,null,1553721,5.8000000000000007]
["BARNSTABLE    ",20,125537222,"",2344044,11788259,"",139669525,null,128675653,1431124,3.640000094951918,2406585,2.6680813158797361,11757377,"",-0.26197252707121554,144270739,null,4601214,3.29]
["BARRE         ",21,8401060,"",1023653,931585,"",10356298,null,8611087,128536,4.0300033567192708,1050393,2.6122133183803498,1020180.57,"",9.5101971371372382,10810196.57,null,453898.5700000003,4.38]
["BECKET        ",22,5753200,"",141754,359000,"",6253954,null,5897030,63285,3.5999965236737816,144454,1.9047081563835941,359000,"",0,6463769,null,209815,3.35]
["BEDFORD       ",23,72855273,"",2241816,5014518,"",80111607,null,74676655,1726670,4.8700002812425121,2275947,1.5224710680983631,5094184,"",1.5887070302669171,83773456,null,3661849,4.5699999999999994]
["BELCHERTOWN   ",24,28624718,"",1963310,2771293,"",33359321,null,29340336,520970,4.3200006372115176,2013900,2.5767708614533618,2933293,"",5.8456467793192566,34808499,null,1449178,4.34]
["BELLINGHAM    ",25,41820156,"",1802698,3548299,"",47171153,null,42865660,828039,4.4800000267813447,1853149,2.7986384852038446,3777936,"",6.4717488576920941,49324784,null,2153631,4.5699999999999994]
["BELMONT       ",26,79495329,"",2397629,3910195,"",85803153,null,81482712,1510411,4.3999994012226811,2464763,2.8000161826537799,4518255,"",15.550631106632789,89976141,null,4172988,4.8599999999999994]
["BERKLEY       ",27,8929537,"",677144,737605,"",10344286,null,9152775,183948,4.559990064434472,695235,2.6716621575322237,826690,"",12.077602510828967,10858648,null,514362,4.97]
["BERLIN        ",28,12051641,"",214087,758795,"",13024523,null,12352932,322984,5.1799999684690246,220081,2.7997963444767779,783413,"",3.2443545358100674,13679410,null,654887,5.0299999999999994]
["BERNARDSTON   ",29,4570462,"",332478,394100,"",5297040,null,4684724,61701,3.850004660360375,341126,2.6010743567995478,395953,"",0.47018523217457497,5483504,null,186464,3.52]
["BEVERLY       ",30,108035190,"",6201104,7131917,"",121368211,null,110736070,2085079,4.4300000768268193,6374735,2.8000014191021472,6913717,"",-3.0594859699012202,126109601,null,4741390,3.91]
["BILLERICA     ",31,141531357,"",6323878,8665000,"",156520235,null,145069641,3127843,4.7100000602693299,6497013,2.7377979145075222,8875000,"",2.4235429890363531,163569497,null,7049262,4.5]
["BLACKSTONE    ",32,19444909,"",1479815,1160000,"",22084724,null,19931032,324730,4.1700015155637908,1520511,2.7500734889158442,1345000,"",15.948275862068966,23121273,null,1036549,4.6899999999999995]
["BLANDFORD     ",33,2631588,"",155403,437800,"",3224791,null,2697378,40000,4.0200061711787711,159178,2.4291680340791362,528300,"",20.671539515760621,3424856,null,200065,6.2]
["BOLTON        ",34,19992283,"",221862,975438,"",21189583,null,20492090,381853,4.4100015991170194,227732,2.6457888236831906,1074000,"",10.104383876781508,22175675,null,986092,4.6500000000000004]
["BOSTON        ",35,2509114748,"",201589823,354823496,"",3065528067,null,2571842617,95095449,6.2900000139810262,207222895,2.7943236003535752,384512338,"",8.3672142162761389,3258673299,null,193145232,6.3]
["BOURNE        ",36,45900739,"",2157316,4411791,"",52469846,null,47048257,610480,3.8299993383548792,2200901,2.0203345267916246,5068895.84,"",14.894287603379214,54928533.840000004,null,2458687.8400000036,4.6899999999999995]
["BOXBOROUGH    ",37,20576812,"",271331,1027000,"",21875143,null,21091232,327171,4.0899970316101442,278831,2.764151534472655,1147500,"",11.733203505355403,22844734,null,969591,4.43]
["BOXFORD       ",38,24460487,"",678851,1867000,"",27006338,null,25071999,239713,3.4800002142230446,693305,2.1291859332902212,1862283,"",-0.25265131226566684,27867300,null,860962,3.19]
["BOYLSTON      ",39,12718273,"",363726,1841000,"",14922999,null,13036230,361199,5.3400017439474681,373910,2.7999098222288206,1785000,"",-3.041825095057034,15556339,null,633340,4.24]
["BRAINTREE     ",40,96036025,"",6107179,15104000,"",117247204,null,98436926,1085207,3.6300003045732057,6277317,2.7858688929864344,14805386,"",-1.9770524364406781,120604836,null,3357632,2.86]
["BREWSTER      ",41,29129227,"",734978,3425684,"",33289889,null,29857458,355377,3.720002593958295,746718,1.5973267227046253,3005063,"",-12.278453003838065,33964616,null,674727,2.0299999999999998]
["BRIDGEWATER   ",42,40927756,"",4228453,4130782,"",49286991,null,41950950,892225,4.6800000469119292,4336745,2.5610311856369221,4197347.9000000004,"",1.6114600092670195,51377267.899999999,null,2090276.8999999985,4.24]
["BRIMFIELD     ",43,7716005,"",498118,668394.48,"",8882517.4800000004,null,7908905,64814,3.3399926516377323,509710,2.3271594280873207,596361,"",-10.777090798236392,9079790,null,197272.51999999955,2.2200000000000002]
["BROCKTON      ",44,149036481,"",22233988,14865000,"",186135469,null,152762393,2235547,3.9999998389656022,22856533,2.7999700278690445,14280000,"",-3.9354187689202824,192134473,null,5999004,3.2199999999999998]
["BROOKFIELD    ",45,5668022,"",615171,569759.94999999995,"",6852952.9500000002,null,5809723,117328,4.5700069618642978,629851,2.386328354229962,544668.39,"",-4.4038827228905681,7101570.3899999997,null,248617.43999999948,3.63]
["BROOKLINE     ",46,204707848,"",6741760,15676822,"",227126430,null,209825544,2743085,3.8399998225764165,6930529,2.7999958467818491,16059806,"",2.4429951427655427,235558964,null,8432534,3.71]
["BUCKLAND      ",47,3755552,"",327547,189500,"",4272599,null,3849441,24036,3.140017765697293,336651,2.7794484455665907,189500,"",0,4399628,null,127029,2.97]
["BURLINGTON    ",48,130007610,"",2780883,9613515.3399999999,"",142402008.34,null,133257800,3757220,5.3899998623157526,2858748,2.8000099249051469,10062757.1,"",4.6730227613076218,149936525.09999999,null,7534516.7599999905,5.29]
["CAMBRIDGE     ",49,628478895,"",22812246,50016235,"",701307376,null,644190867,16151908,5.070000003739187,23450989,2.8000004909643708,52114395,"",4.1949578971707888,735908159,null,34600783,4.93]
["CANTON        ",50,74125029,"",2315718,5422736,"",81863483,null,75978155,1460263,4.4700002748059635,2379478,2.7533577059037415,6003804,"",10.715402704465053,85821700,null,3958217,4.84]
["CARLISLE      ",51,24396248,"",396688,986585,"",25779521,null,25006154,353746,3.9500008361941559,403210,1.6441132577743718,1035000,"",4.9073318568597735,26798110,null,1018589,3.95]
["CARVER        ",52,25987764,"",1726117,2261817,"",29975698,null,26637458,465181,4.2899997090938644,1769552,2.516341592140046,2302314,"",1.7904631541809086,31174505,null,1198807,4]
["CHARLEMONT    ",53,3207212,"",204575,217632,"",3629419,null,3287392,60937,4.3999897730489907,209772,2.5403886105340341,213000,"",-2.1283634759594179,3771101,null,141682,3.9]
["CHARLTON      ",54,21031164,"",1543629,2915700,"",25490493,null,21556943,590976,5.3100009110289852,1586705,2.7905669043533128,3123150,"",7.114929519497891,26857774,null,1367281,5.36]
["CHATHAM       ",55,28160604,"",159810,2890000,"",31210414,null,28864619,515339,4.3299994559775774,164285,2.8002002377823665,2977500,"",3.027681660899654,32521743,null,1311329,4.2]
["CHELMSFORD    ",56,101789687,"",5395125,8241800,"",115426612,null,104334429,1659172,4.1299999281852591,5546034,2.7971363036074233,8236800,"",-6.066635929044626E-2,119776435,null,4349823,3.7699999999999996]
["CHELSEA       ",57,61485089,"",8858851,20966509,"",91310449,null,63022216,2219612,6.1100001010000975,9103043,2.7564748520998941,22111250,"",5.4598550478765917,96456121,null,5145672,5.64]
["CHESHIRE      ",58,3613907,"",763222,572800,"",4949929,null,3704255,26743,3.2400114336091104,781487,2.3931438035067125,608800,"",6.2849162011173183,5121285,null,171356,3.46]
["CHESTER       ",59,2671146,"",208138,184050,"",3063334,null,2737925,17630,3.1600294405472407,213491,2.571851367842489,195900,"",6.4384678076609614,3164946,null,101612,3.32]
["CHESTERFIELD  ",60,3301345,"",217837,198689.12,"",3717871.12,null,3383879,42917,3.7999966680246988,221942,1.8844365282298232,201832,"",1.5818078010512124,3850570,null,132698.87999999989,3.5700000000000003]
["CHICOPEE      ",61,95030164,"",12227779,9890000,"",117147943,null,97405918,1187877,3.7499998421553813,12570157,2.8000015374828084,10607008,"",7.2498281092012133,121770960,null,4623017,3.95]
["CHILMARK      ",62,6144147,"",3983,363000,"",6511130,null,6297751,96463,4.0700035334441056,4095,2.8119507908611601,391000,"",7.7134986225895315,6789309,null,278179,4.2700000000000005]
["CLARKSBURG    ",63,2018524,"",405175,272951.27,"",2696650.27,null,2068987,31085,4.0399816895910083,415991,2.6694638119331153,274240,"",0.47214654835640857,2790303,null,93652.729999999981,3.47]
["CLINTON       ",64,27155562,"",2502102,2020000,"",31677664,null,27834451,901565,5.8200010738131658,2572093,2.7972880402157867,2453879,"",21.479158415841585,33761988,null,2084324,6.58]
["COHASSET      ",65,36056433,"",546320,1579285,"",38182038,null,36957844,739157,4.5500008278689128,561617,2.8000073217162105,1938000,"",22.713759707715834,40196618,null,2014580,5.28]
["COLRAIN       ",66,3722805,"",348715,147000,"",4218520,null,3815875,34250,3.4200018534411551,357296,2.4607487489783919,147000,"",0,4354421,null,135901,3.2199999999999998]
["CONCORD       ",67,79896943,"",1802507,5175601,"",86875051,null,81894367,1358248,4.2000004931352626,1837000,1.9136125407557363,5976800,"",15.480308470455896,91066415,null,4191364,4.82]
["CONWAY        ",68,4977761,"",235448,236000,"",5449209,null,5102205,86115,4.2299941680607001,240762,2.2569739390438652,237000,"",0.42372881355932202,5666082,null,216873,3.9800000000000004]
["CUMMINGTON    ",69,1970288,"",139956,109500,"",2219744,null,2019545,25023,3.7700072273698058,142436,1.771985481151219,112500,"",2.7397260273972601,2299504,null,79760,3.5900000000000003]
["DALTON        ",70,12984294,"",1263271,865150,"",15112715,null,13308901,146723,3.6300009842660681,1297099,2.6778102244094892,865150,"",0,15617873,null,505158,3.34]
["DANVERS       ",71,80994021,"",3304647,8893000,"",93191668,null,83018872,907133,3.6200005430030444,3389330,2.5625429887065092,9079077.8800000008,"",2.0924084111098709,96394412.879999995,null,3202744.8799999952,3.44]
["DARTMOUTH     ",72,61564845,"",2975356,5481000,"",70021201,null,63103966,763404,3.7399996702663669,3050307,2.5190599040921491,5583000,"",1.8609742747673783,72500677,null,2479476,3.54]
["DEDHAM        ",73,96531276,"",3472478,5063000,"",105066754,null,98944558,1341785,3.890000376665486,3569707,2.7999889416146049,5160000,"",1.9158601619593127,109016050,null,3949296,3.7600000000000002]
["DEERFIELD     ",74,10260285,"",596281,1037000,"",11893566,null,10516792,181607,4.2699983479991053,610562,2.3950117478168851,1160000,"",11.861137897782063,12468961,null,575395,4.84]
["DENNIS        ",75,37932691,"",586423,3643000,"",42162114,null,38881008,314841,3.3299983910975364,602616,2.7613173426008188,3643000,"",0,43441465,null,1279351,3.0300000000000002]
["DIGHTON       ",76,18525532,"",825579,1222104.42,"",20573215.420000002,null,18988670,531683,5.3699996307798337,848569,2.7847123049399269,1463003.3399999999,"",19.711811532438443,21831925.34,null,1258709.9199999981,6.12]
["DOUGLAS       ",77,14434360,"",983567,1249327,"",16667254,null,14795219,307452,4.6300009144846044,1005265,2.2060520533934138,1277212,"",2.2320017097205134,17385148,null,717894,4.3099999999999996]
["DOVER         ",78,31203977,"",269881,1327000,"",32800858,null,31984076,480541,4.0399978502740215,275600,2.1190821139687492,1502400,"",13.217784476262246,34242617,null,1441759,4.3999999999999995]
["DRACUT        ",79,49198678,"",3763375,5593418,"",58555471,null,50428645,772419,4.069999604460917,3867549,2.7681004417577308,5866742,"",4.8865291312038543,60935355,null,2379884,4.0599999999999996]
["DUDLEY        ",80,10178293,"",1897257,1813865,"",13889415,null,10432750,128246,3.7599919750787287,1950380,2.7999896692962523,2036570,"",12.277925865486131,14547946,null,658531,4.74]
["DUNSTABLE     ",81,7574022,"",303611,605000,"",8482633,null,7763373,169658,4.7400047161204446,310924,2.4086742575203139,601000,"",-0.66115702479338845,8844955,null,362322,4.2700000000000005]
["DUXBURY       ",82,57123110,"",1042034,3820994,"",61986138,null,58551188,708327,3.7400012009150063,1068389,2.5291881071059104,4170130.2,"",9.1373134843969961,64498034.200000003,null,2511896.200000003,4.05]
["EAST BRIDGEWATER",83,28364047,"",1592817,2349159,"",32306023,null,29073148,320514,3.6300003310528997,1637322,2.7941062909298431,2464159,"",4.8953689384158334,33495143,null,1189120,3.6799999999999997]
["EAST BROOKFIELD",84,3870757,"",311397,333000,"",4515154,null,3967526,69674,4.3000115997981787,320020,2.7691339351374613,337500,"",1.3513513513513513,4694720,null,179566,3.9800000000000004]
["EAST LONGMEADOW",85,44321187,"",1537043,3404169.06,"",49262399.060000002,null,45429217,527422,3.6900004505745749,1580080,2.7999867277623331,3610508.13,"",6.0613637678734982,51147227.130000003,null,1884828.0700000003,3.83]
["EASTHAM       ",86,17928494,"",160102,1452500,"",19541096,null,18376706,145221,3.3099991555342014,164532,2.7669860463954228,1470000,"",1.2048192771084338,20156459,null,615363,3.15]
["EASTHAMPTON   ",87,23717269,"",2988106,2065909,"",28771284,null,24310201,277492,3.6700009600599461,3071678,2.7968217994943956,2352575.3200000003,"",13.876038102355926,30011946.32,null,1240662.3200000003,4.3099999999999996]
["EASTON        ",88,52401801,"",2421137,5069000,"",59891938,null,53711846,1021835,4.4499997242461191,2486247,2.689232373054478,5206000,"",2.7027027027027026,62425928,null,2533990,4.2299999999999995]
["EDGARTOWN     ",89,22745023,"",1536105,1925500.17,"",26206628.170000002,null,23313649,484469,4.630001912945966,1538086,0.12896253836814542,2070718.5699999998,"",7.5418533980186515,27406922.57,null,1200294.3999999985,4.58]
["EGREMONT      ",90,4485945,"",223204,263700,"",4972849,null,4598094,33645,3.2500175548295842,225080,0.84048672962850124,263200,"",-0.18960940462646947,5120019,null,147170,2.96]
["ERVING        ",91,10909997,"",118855,302392,"",11331244,null,11182747,39276,2.8600007864346799,120853,1.6810399225947583,241000,"",-20.30212439482526,11583876,null,252632,2.23]
["ESSEX         ",92,9938252,"",261837,961275,"",11161364,null,10186708,107333,3.5799957578052961,269117,2.7803557174883613,986190,"",2.591870172427245,11549348,null,387984,3.4799999999999995]
["EVERETT       ",93,144152596,"",7336124,6549000,"",158037720,null,147756411,4137180,5.3700004126183059,7541535,2.799993566084761,35114000,"",436.1734615971904,194549126,null,36511406,23.1]
["FAIRHAVEN     ",94,28484856,"",2560686,2869000,"",33914542,null,29196977,299091,3.5499986378727,2627732,2.6182827570424489,3425000,"",19.379574764726385,35548800,null,1634258,4.82]
["FALL RIVER    ",95,106816456,"",25638233,15853030,"",148307719,null,109486867,2125647,4.4899991813995399,26346772,2.7636030923035921,16731667.51,"",5.5423947977137473,154690953.50999999,null,6383234.5099999905,4.3]
["FALMOUTH      ",96,95461519,"",1933401,6460000,"",103854920,null,97848057,1011892,3.5599999199677517,1974622,2.1320460680427908,7036000,"",8.9164086687306501,107870571,null,4015651,3.8699999999999997]
["FITCHBURG     ",97,55682046,"",9109619,6448668.4199999999,"",71240333.420000002,null,57074097,779549,3.9000003699576702,9363353,2.785341516478351,7338032.7400000002,"",13.79144130347456,74555031.739999995,null,3314698.3199999928,4.6500000000000004]
["FLORIDA       ",98,2471839,"*",88668,269000,"*",2829507,null,2533635,12854,3.0200186986288347,90148,1.669147832363423,266000,"*",-1.1152416356877324,2902637,null,73130,2.58]
["FOXBOROUGH    ",99,49768722,"",1704115,8847959,"",60320796,null,51012940,1413432,5.3400004926789162,1748402,2.5988269571008997,9422584,"",6.4944356093874305,63597358,null,3276562,5.43]
["FRAMINGHAM    ",100,207062248,"",11029714,16554636,"",234646598,null,212238804,3499352,4.189999907660618,11325523,2.6819281080180319,15854898,"",-4.2268401431478164,242918577,null,8271979,3.53]
["FRANKLIN      ",101,73595444,"",2759871,6306450,"",82661765,null,75435330,1781010,4.9200002108826197,2833338,2.661972244354899,6690143,"",6.0841360828992537,86739821,null,4078056,4.93]
["FREETOWN      ",102,21671372,"",1206813,1993333,"",24871518,null,22213156,650141,5.4999978773840441,1235046,2.3394676722905703,1957661,"",-1.7895655166497519,26056004,null,1184486,4.7600000000000007]
["GARDNER       ",103,28240124,"",4550629,2941562,"",35732315,null,28946127,513970,4.319998736549457,4676622,2.7686941739262858,3439366,"",16.923117717729561,37576085,null,1843770,5.16]
["AQUINNAH      ",104,3209351,"",4709,123500,"",3337560,null,3289585,32414,3.5099931419156083,4778,1.4652792524952218,123500,"",0,3450277,null,112717,3.38]
["GEORGETOWN    ",105,17663734,"",900927,2522000,"",21086661,null,18105327,249059,3.9100000033967901,922226,2.364120511428784,2518000,"",-0.15860428231562251,21794612,null,707951,3.36]
["GILL          ",106,2764477,"*",276566,174900,"*",3215943,null,2833589,33450,3.7099965020508399,283798,2.6149273591113875,171900,"*",-1.7152658662092624,3322737,null,106794,3.32]
["GLOUCESTER    ",107,82035573,"",4264996,7252291,"",93552860,null,84086462,1025445,3.7500000152372923,4383744,2.7842464565031246,7294792,"",0.58603550243640246,96790443,null,3237583,3.46]
["GOSHEN        ",108,2443882,"",120915,163200,"",2727997,null,2504979,32504,3.8300130693707799,123294,1.9674978290534673,163200,"",0,2823977,null,95980,3.52]
["GOSNOLD       ",109,526687,"*",25864,58140,"*",610691,null,539854,2317,2.9398864980529233,25926,0.23971543458088462,56220,"*",-3.3023735810113517,624317,null,13626,2.23]
["GRAFTON       ",110,37083854,"",1665268,3618756,"",42367878,null,38010950,808428,4.6799990098116551,1711757,2.7916827801891348,3511317.36,"",-2.9689384970967958,44042452.359999999,null,1674574.3599999994,3.95]
["GRANBY        ",111,11354129,"",1005421,570023.65,"",12929573.65,null,11637982,166906,3.9700006931399141,1031673,2.6110455222240234,604347,"",6.0213905159899905,13440908,null,511334.34999999963,3.95]
["GRANVILLE     ",112,3402034,"",223897,427400,"",4053331,null,3487085,31639,3.4300068723593005,228664,2.1291040076463732,419600,"",-1.8249883013570425,4166988,null,113657,2.8000000000000003]
["GREAT BARRINGTON",113,23576289,"",1054826,965000,"",25596115,null,24165696,381936,4.1199995470024993,1077391,2.1392153777021043,975000,"",1.0362694300518134,26600023,null,1003908,3.92]
["GREENFIELD    ",114,35435096,"",3401077,3430003,"",42266176,null,36320973,510265,3.9399977920195277,3495472,2.775444366593288,3356500,"",-2.1429427321200594,43683210,null,1417034,3.35]
["GROTON        ",115,28741001,"",900536,2066389,"",31707926,null,29459526,571946,4.4900001917121815,923568,2.5575879254133094,2193905,"",6.1709581303423509,33148945,null,1441019,4.54]
["GROVELAND     ",116,12256841,"",892236,1309000,"",14458077,null,12563262,174047,3.9199986358638412,913879,2.4257035134202161,1276000,"",-2.5210084033613445,14927188,null,469111,3.2399999999999998]
["HADLEY        ",117,11621843,"",702275,1658616,"",13982734,null,11912389,235923,4.5299958018706672,715769,1.9214695098074117,2328357,"",40.37950918114862,15192438,null,1209704,8.6499999999999986]
["HALIFAX       ",118,15758854,"",1011902,1419490,"",18190246,null,16152825,167044,3.5599987156426476,1038892,2.6672543388589012,1453990,"",2.4304503730212965,18812751,null,622505,3.42]
["HAMILTON      ",119,21645646,"",857162,1281550,"",23784358,null,22186787,235938,3.5900014256908759,877138,2.3304812859179478,1289540,"",0.62346377433576528,24589403,null,805045,3.38]
["HAMPDEN       ",120,12454681,"",730571,590027,"",13775279,null,12766048,171875,3.8800030285801781,751027,2.8000016425508267,612727,"",3.84728156508092,14301677,null,526398,3.82]
["HANCOCK       ",121,2410484,"",109942,455244,"",2975670,null,2470746,21694,3.3999810826373458,111621,1.5271688708591804,627050,"",37.739322209628241,3231111,null,255441,8.58]
["HANOVER       ",122,40766305,"",2257814,2750571,"",45774690,null,41785463,611495,4.0000019624049816,2320798,2.7896009148672123,3099186,"",12.674277450027649,47816942,null,2042252,4.46]
["HANSON        ",123,20106487,"",1403211,1566000,"",23075698,null,20609149,418215,4.5799994797698869,1441286,2.7134194358510588,1603000,"",2.362707535121328,24071650,null,995952,4.32]
["HARDWICK      ",124,4101377,"",552843,721892,"",5376112,null,4203911,48806,3.6899802188386972,566685,2.5037849805460142,712895.66,"",-1.2462168856283167,5532297.6600000001,null,156185.66000000015,2.91]
["HARVARD       ",125,16667075,"",1577386,1228049,"",19472510,null,17083752,161671,3.4700029849268694,1621418,2.7914537088575657,1078492,"",-12.17842284794825,19945333,null,472823,2.4299999999999997]
["HARWICH       ",126,41490683,"",539428,4220000,"",46250111,null,42527950,394161,3.4499986418637651,552235,2.3741815404465472,4419832.75,"",4.735373222748815,47894178.75,null,1644067.75,3.55]
["HATFIELD      ",127,7623786,"",335798,733698,"",8693282,null,7814381,114357,4.0000073454317837,345075,2.762672797336494,744200,"",1.4313791232905091,9018013,null,324731,3.74]
["HAVERHILL     ",128,110211975,"",10437422,13418000,"",134067397,null,112967274,1664201,4.0099998207998722,10729643,2.7997430783195312,14343760,"",6.8993888806081385,139704878,null,5637481,4.2]
["HAWLEY        ",129,949471,"",103589,39300,"",1092360,null,973208,11489,3.7100659209180691,104876,1.2424099083879563,45800,"",16.539440203562339,1135373,null,43013,3.94]
["HEATH         ",130,2067685,"",93255,94750,"",2255690,null,2119377,12199,3.0899774385363341,95743,2.6679534609404323,92700,"",-2.1635883905013191,2320019,null,64329,2.85]
["HINGHAM       ",131,79423977,"",1680191,6329829,"",87433997,null,81409576,1032512,3.7999998413577298,1727115,2.7927777258656903,7468335,"",17.986362664773409,91637538,null,4203541,4.8099999999999996]
["HINSDALE      ",132,4983986,"",268249,292000,"",5544235,null,5108586,82734,4.1600036597213554,274869,2.4678563573396359,292000,"",0,5758189,null,213954,3.8600000000000003]
["HOLBROOK      ",133,22532031,"",1566803,2237313,"",26336147,null,23095332,351500,4.0600024028015937,1610673,2.7999691090711467,2032148,"",-9.1701518741454588,27089653,null,753506,2.86]
["HOLDEN        ",134,39897093,"",2132823,3774610,"",45804526,null,40894520,869757,4.6800001193069383,2189669,2.6652938382603715,3862207,"",2.3206900845385352,47816153,null,2011627,4.3900000000000006]
["HOLLAND       ",135,5160183,"",218225,405900,"",5784308,null,5289188,53666,3.540010112044476,224226,2.749914079505098,448800,"",10.56910569105691,6015880,null,231572,4]
["HOLLISTON     ",136,43275822,"",1646755,2412339,"",47334916,null,44357718,973706,4.7500010513953956,1692798,2.7959836162634999,2449885,"",1.5564147493366396,49474107,null,2139191,4.5199999999999996]
["HOLYOKE       ",137,53918766,"",10862256,8087000,"",72868022,null,53918766,0,0,11164220,2.7799381638584104,7934000,"",-1.8919253122295041,73016986,null,148964,0.2]
["HOPEDALE      ",138,15361867,"",692455,1195500,"",17249822,null,15745914,201240,3.8099991361727059,711843,2.7998931338498529,1087000,"",-9.0757005437055618,17745997,null,496175,2.88]
["HOPKINTON     ",139,61955508,"*",1180213,3856894,"*",66992615,null,63504396,2781802,6.989999985150634,1203569,1.9789648139784937,3869675,"*",0.3313806394471821,71359442,null,4366827,6.52]
["HUBBARDSTON   ",140,7273006,"",545625,1051200,"",8869831,null,7454831,88731,3.7200024309068356,559018,2.4546162657502864,1083638.7,"",3.0858732876712285,9186218.6999999993,null,316387.69999999925,3.5700000000000003]
["HUDSON        ",141,51902188,"",2170140,4893311,"",58965639,null,53199743,871957,4.1800010435012878,2229430,2.7320818011741177,5143972,"",5.1225233793641971,61445102,null,2479463,4.2]
["HULL          ",142,29976106,"",2274038,2991444,"",35241588,null,30725509,257795,3.3600027968942996,2337049,2.7708859746407053,3075000,"",2.7931661097449929,36395353,null,1153765,3.27]
["HUNTINGTON    ",143,3559687,"",403001,331400,"",4294088,null,3648679,28833,3.3099820293188698,413248,2.5426735913806664,293100,"",-11.55703077851539,4383860,null,89772,2.09]
["IPSWICH       ",144,35583750,"",2079649,2798000,"",40461399,null,36473344,334487,3.44,2127376,2.2949545812778984,2778000,"",-0.71479628305932807,41713207,null,1251808,3.09]
["KINGSTON      ",145,32106154,"",1051342,2743900,"",35901396,null,32908808,539383,4.1799992612008277,1079880,2.7144354548757681,3012500,"",9.7889864790990924,37540571,null,1639175,4.5699999999999994]
["LAKEVILLE     ",146,19656669,"",882193,2048800.76,"",22587662.760000002,null,20148086,379374,4.4300028656940809,906521,2.7576732075634243,2071004,"",1.0837188482885955,23504985,null,917322.23999999836,4.0599999999999996]
["LANCASTER     ",147,15064170,"",1140116,1270133,"",17474419,null,15440774,289232,4.4199979155837994,1168537,2.4928165204242374,1349050,"",6.2132863251328798,18247593,null,773174,4.42]
["LANESBOROUGH  ",148,9002151,"",474703,864540,"",10341394,null,9227205,105325,3.670000647622996,484959,2.1605087812800847,883022,"",2.1377842552108635,10700511,null,359117,3.47]
["LAWRENCE      ",149,80249851,"",20856383,12256694,"",113362928,null,82256097,2118596,5.1399995745786491,21440172,2.799090331242958,12005446.190000001,"",-2.0498823744804158,117820311.19,null,4457383.1899999976,3.93]
["LEE           ",150,16278394,"",728017,1630115,"",18636526,null,16685354,265338,4.1300020137121631,746534,2.5434845614868884,1726650,"",5.9219748299966568,19423876,null,787350,4.22]
["LEICESTER     ",151,15292785,"",1853658,2059000,"",19205443,null,15675105,279858,4.3300026777333231,1905283,2.7850337009308084,2098000,"",1.8941233608547838,19958246,null,752803,3.92]
["LENOX         ",152,18419626,"",606771,2638091,"",21664488,null,18880117,338921,4.3400012573545199,622619,2.6118585100474481,2684734,"",1.7680587970619663,22526391,null,861903,3.9800000000000004]
["LEOMINSTER    ",153,80298856,"",6218379,3406000,"",89923235,null,82306327,1349021,4.1799997748411259,6388546,2.736517024774463,3456000,"",1.467997651203758,93499894,null,3576659,3.9800000000000004]
["LEVERETT      ",154,5296674,"",206038,244838.9,"",5747550.9000000004,null,5429091,84217,4.0900006305844006,211345,2.5757384560129686,256251.34,"",4.6612037547955012,5980904.3399999999,null,233353.43999999948,4.0599999999999996]
["LEXINGTON     ",155,163232408,"",1627400,8563500,"",173423308,null,167313218,3754345,4.7999996422279088,1672967,2.7999877104583999,9018892.379999999,"",5.3178300928358606,181759422.38,null,8336114.3799999952,4.8099999999999996]
["LEYDEN        ",156,1932264,"",117004,110454.31,"",2159722.31,null,1980571,8309,2.9300344052365515,119452,2.0922361628662269,116418.64,"",5.3998164489914453,2224750.64,null,65028.330000000075,3.01]
["LINCOLN       ",157,25937914,"",1135489,972504,"",28045907,null,26586362,98564,2.8800002960916595,1155730,1.7825800161868588,784578,"",-19.323930801312901,28625234,null,579327,2.0699999999999998]
["LITTLETON     ",158,37973455,"",760519,2786116,"",41520090,null,38922791,1583493,6.6699988189117896,781654,2.7790232722653871,2974116,"",6.7477448893010914,44262054,null,2741964,6.6000000000000005]
["LONGMEADOW    ",159,44067400,"",1483570,3750187,"",49301157,null,45169085,304065,3.1899998638449283,1525110,2.8000026961990332,3735000,"",-0.40496647233857941,50733260,null,1432103,2.9000000000000004]
["LOWELL        ",160,158905239,"",26955751,16281912,"",202142902,null,162877870,2558374,4.1099997967971342,27704654,2.7782679844460652,15266087.840000002,"",-6.2389734080370793,208406985.84,null,6264083.8400000036,3.1]
["LUDLOW        ",161,42772547,"",3277539,5418000,"",51468086,null,43841861,697193,4.1300018911663132,3368368,2.7712561162506382,5486000,"",1.2550756736803248,53393422,null,1925336,3.74]
["LUNENBURG     ",162,23794447,"",1149150,2005833,"",26949430,null,24389308,480648,4.519999981508291,1180592,2.7361092981769133,2020438,"",0.72812641929811706,28070986,null,1121556,4.16]
["LYNN          ",163,136429137,"",23776699,14652439,"",174858275,null,139839865,1950937,3.9299999383562767,24442395,2.7997830985705794,12755054,"",-12.949277591259721,178988251,null,4129976,2.36]
["LYNNFIELD     ",164,38404725,"",1147136,4084000,"",43635861,null,39364843,510783,3.830000084625004,1178059,2.6956699118500334,4095000,"",0.26934378060724778,45148685,null,1512824,3.47]
["MALDEN        ",165,94569307,"",13322297,9828810.7899999991,"",117720414.78999999,null,96933540,1834645,4.4400008133717215,13695321,2.7999976280366665,8842854.0700000003,"",-10.031292096935349,121306360.06999999,null,3585945.2800000012,3.05]
["MANCHESTER    ",166,22372852,"",236147,851000,"",23459999,null,22932173,257288,3.6499995619691221,242759,2.7999508780547711,1176000,"",38.190364277320796,24608220,null,1148221,4.8899999999999997]
["MANSFIELD     ",167,62548558,"",2368619,6161199,"",71078376,null,64112272,988267,4.0799997339666891,2434940,2.7999859833936989,6479634,"",5.1683933597989613,74015113,null,2936737,4.1300000000000008]
["MARBLEHEAD    ",168,56294235,"",1209205,3092821.39,"",60596261.390000001,null,57701591,354654,3.1300007896012798,1243063,2.8000215017304759,3040745.47,"",-1.683767454802811,62340053.469999999,null,1743792.0799999982,2.88]
["MARION        ",169,17620938,"",263780,725200,"",18609918,null,18061461,207927,3.6799970580453776,270489,2.5434073849419971,725200,"",0,19265077,null,655159,3.52]
["MARLBOROUGH   ",170,144113359,"",5855609,9639591.5500000007,"",159608559.55000001,null,147716193,1310885,3.4096207555609053,6017461,2.7640506734653902,10075493,"",4.52199087211324,165120032,null,5511472.4499999881,3.45]
["MARSHFIELD    ",171,62435562,"",2303734,5382000,"",70121296,null,63996451,711765,3.639999268365679,2368144,2.7958957067091945,5169000,"",-3.9576365663322184,72245360,null,2124064,3.0300000000000002]
["MASHPEE       ",172,49968699,"",798542,2388150,"",53155391,null,51217916,809493,4.1199992019003737,809481,1.3698715909745511,2774475,"",16.176747691727908,55611365,null,2455974,4.62]
["MATTAPOISETT  ",173,20842029,"",605331,1501819,"",22949179,null,21363080,310546,3.9900002058340864,617382,1.9908116385911179,1676589,"",11.63722126301505,23967597,null,1018418,4.4400000000000004]
["MAYNARD       ",174,28986815,"",1668251,1724900,"",32379966,null,29711485,489877,4.1899981077603732,1714962,2.7999983215954911,1837000,"",6.4989274740564671,33753324,null,1373358,4.24]
["MEDFIELD      ",175,34793822,"",1587079,2441831,"",38822732,null,35663668,469717,3.8500024515846518,1630179,2.7156808199213778,2669661,"",9.3302935379229766,40433225,null,1610493,4.1500000000000004]
["MEDFORD       ",176,118138663,"",12933547,12089616,"",143161826,null,121092130,1724824,3.9599999536138308,13294199,2.7885003240023791,12985549,"",7.4107647422382978,149096702,null,5934876,4.1500000000000004]
["MEDWAY        ",177,38635928,"",1295508,2369100,"",42300536,null,39601826,687720,4.2800007288552768,1331782,2.7999827094853909,2539100,"",7.1757207378329326,44160428,null,1859892,4.3999999999999995]
["MELROSE       ",178,64738724,"",5446992,3776242.54,"",73961958.540000007,null,66357192,770391,3.6900001303701937,5599475,2.7993982733956648,3771000,"",-0.13882953609224574,76498058,null,2536099.4599999934,3.4299999999999997]
["MENDON        ",179,13093429,"",438508,1392337,"",14924274,null,13420765,371853,5.3399991705763252,450658,2.7707590283415584,1394782,"",0.17560403839013111,15638058,null,713784,4.78]
["MERRIMAC      ",180,11229037,"",896533,1080200,"",13205770,null,11509763,197631,4.2600002119504996,921550,2.7904159690719696,1155200,"",6.9431586743195703,13784144,null,578374,4.38]
["METHUEN       ",181,93348857,"",5773605,7888807,"",107011269,null,95682578,1166861,3.7499998527030707,5935266,2.8000010392120696,8355527,"",5.9162304262228753,111140232,null,4128963,3.8600000000000003]
["MIDDLEBOROUGH ",182,44431811,"",2777987,4778080,"",51987878,null,45542606,959727,4.6599991163988346,2851292,2.6387812469964764,5269305,"",10.280803167799618,54622930,null,2635052,5.07]
["MIDDLEFIELD   ",183,1463886,"",113335,71300,"",1648521,null,1500483,6734,2.9599982512299454,114916,1.3949794855958,66400,"",-6.8723702664796633,1688533,null,40012,2.4299999999999997]
["MIDDLETON     ",184,27689363,"",603127,2726855,"",31019345,null,28381597,742075,5.1799999877209162,619395,2.6972760297582434,2762844,"",1.3197988158519613,32505911,null,1486566,4.79]
["MILFORD       ",185,73699324,"",3243398,6626840,"",83569562,null,75541807,1157079,4.069999339478338,3334213,2.799995560211852,6802436,"",2.6497697243331664,86835535,null,3265973,3.91]
["MILLBURY      ",186,26788885,"",1893940,4782000,"",33464825,null,27458607,755447,5.3200011870594839,1946590,2.7799191104258845,5054658,"",5.7017565872020075,35215302,null,1750477,5.2299999999999995]
["MILLIS        ",187,19041464,"",1111757,1586600.58,"",21739821.579999998,null,19517501,672164,6.0300037854232214,1142886,2.7999823702481748,1652575.12,"",4.1582324393200487,22985126.120000001,null,1245304.5400000028,5.7299999999999995]
["MILLVILLE     ",188,5015056,"",435174,443800,"",5894030,null,5140432,48145,3.4600012442533044,447285,2.7830247211460244,434800,"",-2.0279405137449302,6070662,null,176632,3]
["MILTON        ",189,62709536,"",4304073,5135000,"",72148609,null,64277274,859121,3.8699999311109559,4399609,2.2196649545674529,5639000,"",9.8149951314508268,75175004,null,3026395,4.1900000000000004]
["MONROE        ",190,650306,"",27169,193350,"",870825,null,650306,0,0,27716,2.0133240089808235,169500,"",-12.335143522110164,847522,null,-23303,-2.68]
["MONSON        ",191,14084185,"",1474398,1375907,"",16934490,null,14436290,214080,4.0200054174238691,1513210,2.6323964085681073,1315800,"",-4.3685365362629884,17479380,null,544890,3.2199999999999998]
["MONTAGUE      ",192,18037588,"",1743152,931792,"",20712532,null,18488528,634923,6.0200011221012479,1785763,2.4444798847145859,677537.40999999992,"",-27.286625126637713,21586751.41,null,874219.41000000015,4.22]
["MONTEREY      ",193,3196706,"",293914,174380,"",3665000,null,3276624,35483,3.6099972909613833,295289,0.46782392128309641,186000,"",6.6636082119509119,3793396,null,128396,3.5000000000000004]
["MONTGOMERY    ",194,1775205,"",97786,144000,"",2016991,null,1819585,13137,3.2400201666849746,100366,2.6384144969627554,144400,"",0.27777777777777779,2077488,null,60497,3]
["MOUNT WASHINGTON",195,479619,"",271323,24400,"",775342,null,491609,5564,3.659988449164858,272214,0.32839088466514083,25000,"",2.459016393442623,794387,null,19045,2.46]
["NAHANT        ",196,8896456,"",402437,624796,"",9923689,null,9118867,62275,3.1999933456648355,413671,2.7914928299336292,614099,"",-1.7120788225276731,10208912,null,285223,2.87]
["NANTUCKET     ",197,70423348,"",269158,7141294,"",77833800,null,72183932,1302832,4.3500005140340674,271514,0.87532230139917822,8049233,"",12.713928316072689,81807511,null,3973711,5.1100000000000003]
["NATICK        ",198,106193025,"",4161618,10022375,"",120377018,null,108847851,1656611,4.0600001742110647,4274918,2.7224987973427641,10879900,"",8.5561057134661187,125659280,null,5282262,4.3900000000000006]
["NEEDHAM       ",199,131526186,"",1853722,6909000,"",140288908,null,134814341,5274200,6.5100002215528399,1905626,2.7999883477673566,7462600,"",8.0127370096974957,149456767,null,9167859,6.5299999999999994]
["NEW ASHFORD   ",200,471713,"",52432,42100,"",566245,null,483506,3962,3.339954591033107,53036,1.1519682636557826,39200,"",-6.8883610451306412,579704,null,13459,2.3800000000000003]
["NEW BEDFORD   ",201,134165825,"",24448155,15612500,"",174226480,null,137519971,2133237,4.0900005645998148,25132124,2.7976303324320382,15277000,"",-2.1489191353082466,180062332,null,5835852,3.35]
["NEW BRAINTREE ",202,2068476,"",193268,178060,"",2439804,null,2120188,33923,4.1400045250706317,197193,2.0308587039758264,182500,"",2.4935415028642032,2533804,null,94000,3.85]
["NEW MARLBOROUGH",203,4676430,"",103425,290300,"",5070155,null,4793341,56585,3.7100095585735273,105166,1.6833454193860284,294300,"",1.3778849466069583,5249392,null,179237,3.54]
["NEW SALEM     ",204,1652039,"",121150,754276,"",2527465,null,1693340,19329,3.6700102116233335,124235,2.5464300453982665,833564,"",10.51180204593544,2670468,null,143003,5.66]
["NEWBURY       ",205,15135430,"",863601,1575000,"",17574031,null,15513816,201301,3.8300002048174382,878999,1.7829993249197256,1625000,"",3.1746031746031744,18219116,null,645085,3.6700000000000004]
["NEWBURYPORT   ",206,56390995,"",2846229,4255000,"",63492224,null,57800770,964286,4.2100001959532722,2922060,2.6642620815120637,4351500,"",2.2679200940070507,66038616,null,2546392,4.01]
["NEWTON        ",207,331342536,"",6240334,27460990,"",365043860,null,339626099,6129837,4.3499999046304154,6415063,2.7999943592762824,28704764,"",4.5292394775279403,380875763,null,15831903,4.34]
["NORFOLK       ",208,28416056,"",1245493,2322000,"",31983549,null,29126457,642203,4.7599990653171576,1274006,2.2892942794539994,2330000,"",0.34453057708871665,33372666,null,1389117,4.34]
["NORTH ADAMS   ",209,18133108,"",4796383,2101892,"",25031383,null,18133108,0,0,4928292,2.7501765392797028,2203722,"",4.8446827905525121,25265122,null,233739,0.92999999999999994]
["NORTH ANDOVER ",210,69283431,"",2438137,6196047.2800000003,"",77917615.280000001,null,71015517,1205532,4.240000758622938,2499070,2.4991622702087701,6732436.2999999998,"",8.6569549223969045,81452555.299999997,null,3534940.0199999958,4.54]
["NORTH ATTLEBOROUGH",211,53714829,"",3055029,5776955,"",62546813,null,55057700,553263,3.5300009984207525,3140570,2.8000061537877383,5820965,"",0.76182002456311326,64572498,null,2025685,3.2399999999999998]
["NORTH BROOKFIELD",212,6092243,"",872339,693350,"",7657932,null,6244549,84682,3.8899958521024196,896031,2.7159166333271814,693350,"",0,7918612,null,260680,3.4000000000000004]
["NORTH READING ",213,44897945,"",1933365,3473000,"",50304310,null,46020394,880000,4.4600014544095501,1986158,2.7306276879947657,3559000,"",2.476245321048085,52445552,null,2141242,4.26]
["NORTHAMPTON   ",214,56252803,"",4767324,5818971,"",66839098,null,57659123,1074429,4.4100006892101007,4898007,2.7412233781467337,6986730,"",20.068135758023196,70618289,null,3779191,5.65]
["NORTHBOROUGH  ",215,51381434,"",1321266,3780000,"",56482700,null,52665970,714202,3.8900004231100285,1354431,2.5100925930130646,3788000,"",0.21164021164021163,58522603,null,2039903,3.61]
["NORTHBRIDGE   ",216,22299325,"",2327756,2562091,"",27189172,null,22856808,303271,3.8600002466442369,2390517,2.696201835587579,2571166,"",0.35420287569801384,28121762,null,932590,3.4299999999999997]
["NORTHFIELD    ",217,7959062,"",446562,384000,"",8789624,null,8158039,280159,6.0200058750641725,457304,2.4054890474335031,384000,"",0,9279502,null,489878,5.57]
["NORTON        ",218,38391163,"",2228574,2755500,"",43375237,null,39350942,1036561,5.1999987601313356,2290371,2.7729391081471828,3508500,"",27.327163854109962,46186374,null,2811137,6.4799999999999995]
["NORWELL       ",219,43541859,"",1140664,2148000,"",46830523,null,44630405,522502,3.6999982017304314,1172537,2.794249665107341,2326180,"",8.2951582867783991,48651624,null,1821101,3.8899999999999997]
["NORWOOD       ",220,83324094,"",4939252,19352743,"",107616089,null,85407196,1533163,4.3399991843895718,5077551,2.7999988662250885,18967761,"",-1.9892890635709883,110985671,null,3369582,3.1300000000000003]
["OAK BLUFFS    ",221,20082735,"",186621,2903000,"",23172356,null,20584803,261076,3.8000003485581022,188783,1.1584977039025619,3142909,"",8.2641749913882183,24177571,null,1005215,4.34]
["OAKHAM        ",222,2792471,"",291125,442000,"",3525596,null,2862283,32393,3.6600201040583769,296829,1.9592958351223702,444500,"",0.56561085972850678,3636005,null,110409,3.1300000000000003]
["ORANGE        ",223,10846603,"",1779373,1165000,"",13790976,null,11117768,93281,3.3600012833511101,1827424,2.7004456064018054,1194900,"",2.5665236051502145,14233373,null,442397,3.2099999999999995]
["ORLEANS       ",224,22590464,"",203166,1964201,"",24757831,null,23155226,264308,3.6699998725125789,208273,2.5137080023232232,1782578,"",-9.2466606014353925,25410385,null,652554,2.64]
["OTIS          ",225,4848898,"",171522,234000,"",5254420,null,4970120,38791,3.2999869248641649,172603,0.63023985261365889,240000,"",2.5641025641025643,5421514,null,167094,3.18]
["OXFORD        ",226,24377687,"*",2193056,2333500,"*",28904243,null,24987129,541185,4.7200007121266259,2254194,2.7877993083623949,2364000,"*",1.3070494964645383,30146508,null,1242265,4.3]
["PALMER        ",227,19780028,"",2208226,2181117,"",24169371,null,20274529,247250,3.7499997472197713,2267854,2.7002670922269734,2376000,"",8.9350089885136832,25165633,null,996262,4.12]
["PAXTON        ",228,9545237,"",652541,760500,"",10958278,null,9783868,152724,4.1000029648294749,668630,2.4655922003368369,784000,"",3.0900723208415517,11389222,null,430944,3.93]
["PEABODY       ",229,122866207,"",7675986,14416205.560000001,"",144958398.56,null,125937862,1240949,3.510000109305889,7890613,2.7960837864998713,14985500,"",3.9489894732050383,150054924,null,5096525.4399999976,3.52]
["PELHAM        ",230,3881125,"",207928,599000,"",4688053,null,3978153,18241,2.9699893716383778,212661,2.2762687083990611,579201.99,"",-3.3051769616026725,4788256.99,null,100203.99000000022,2.1399999999999997]
["PEMBROKE      ",231,39499337,"",1785006,3748634,"",45032977,null,40486820,552991,3.899999637968607,1834986,2.79999058826693,3911427.31,"",4.3427368476090242,46786224.310000002,null,1753247.3100000024,3.8899999999999997]
["PEPPERELL     ",232,21176319,"",1623576,1867622,"",24667517,null,21705727,349409,4.1499988737419375,1667953,2.7332875085613484,1901573.84,"",1.8179181868707952,25624662.84,null,957145.83999999985,3.88]
["PERU          ",233,2168834,"",169539,133000,"",2471373,null,2223055,18001,3.3299920602498854,172935,2.003078937589581,137000,"",3.007518796992481,2550991,null,79618,3.2199999999999998]
["PETERSHAM     ",234,2756054,"",182843,749626,"",3688523,null,2824955,20946,3.2599869233331424,186252,1.8644410778646161,732155,"",-2.3306288735983012,3764308,null,75785,2.0500000000000003]
["PHILLIPSTON   ",235,2572875,"",237353,298912,"",3109140,null,2637197,60977,4.8699995141621724,242838,2.3109040121675313,296912,"",-0.6690932448346002,3237924,null,128784,4.1399999999999997]
["PITTSFIELD    ",236,89534132,"",9262334,9121200,"",107917666,null,89534132,0,0,9519045,2.7715584430447011,9361800,"",2.6378108143665306,108414977,null,497311,0.45999999999999996]
["PLAINFIELD    ",237,1890204,"",89813,80000,"",2060017,null,1937459,36103,4.4100001904556336,91305,1.6612294433990624,76200,"",-4.75,2141067,null,81050,3.93]
["PLAINVILLE    ",238,21757359,"",834055,2498951.79,"",25090365.789999999,null,22301293,591800,5.2199993574587795,856612,2.7044979048144309,2464972,"",-1.3597617263356665,26214677,null,1124311.2100000009,4.4799999999999995]
["PLYMOUTH      ",239,179332150,"",4858938,13272000,"",197463088,null,183815454,4268105,4.8800000446099601,4975443,2.3977461741639838,13515747,"",1.8365506329113923,206574749,null,9111661,4.6100000000000003]
["PLYMPTON      ",240,10053825,"",251921,750200,"",11055946,null,10305171,94506,3.440004177514528,258975,2.8000841533655394,631450,"",-15.82911223673687,11290102,null,234156,2.12]
["PRINCETON     ",241,9554494,"",508011,878356.11,"",10940861.109999999,null,9793356,141407,3.9800014527195264,516814,1.7328364936979712,957000,"",8.9535313871727968,11408577,null,467715.8900000006,4.2700000000000005]
["PROVINCETOWN  ",242,20041863,"",223331,2247500,"",22512694,null,20542910,252527,3.7599997565096617,227444,1.8416610322794418,2286720,"",1.7450500556173527,23309601,null,796907,3.54]
["QUINCY        ",243,272751243,"",20665168,21968517.870000001,"",315384928.87,null,279570024,7009707,5.069999992630648,21232907,2.7473234188079187,23738000,"",8.0546268094689566,331550638,null,16165709.129999995,5.13]
["RANDOLPH      ",244,57058211,"",5604271,6345000,"",69007482,null,58484666,781697,3.8699986580371402,5758817,2.75764680187664,6619000,"",4.318360914105595,71644180,null,2636698,3.82]
["RAYNHAM       ",245,32858631,"",1224380,3186500,"",37269511,null,33680097,686745,4.5899995042398452,1258190,2.7613976053186104,3223500,"",1.1611485956378471,38848532,null,1579021,4.24]
["READING       ",246,58049650,"",3478899,8079727,"",69608276,null,59500891,824305,3.9199995176542837,3575290,2.7707329244108552,8322739,"",3.0076758781577646,72223225,null,2614949,3.7600000000000002]
["REHOBOTH      ",247,23332148,"",1134339,2201100,"",26667587,null,23915452,391980,4.1800009154750777,1165333,2.7323401558088016,2227900,"",1.2175730316659852,27700665,null,1033078,3.8699999999999997]
["REVERE        ",248,90539665,"",10923799,11144000,"",112607464,null,92803157,1828901,4.5200001568373374,11229653,2.7998867426982135,12484000,"",12.024407753050969,118345711,null,5738247,5.0999999999999996]
["RICHMOND      ",249,5318609,"",129842,297000,"",5745451,null,5451574,50527,3.4499998025799603,133059,2.4776266539332421,305300,"",2.7946127946127945,5940460,null,195009,3.39]
["ROCHESTER     ",250,12327242,"",525268,4781601,"",17634111,null,12635423,330370,5.1799988999972584,537896,2.4041060944127568,4725070,"",-1.1822609205577796,18228759,null,594648,3.37]
["ROCKLAND      ",251,30946342,"",2807181,4531000,"",38284523,null,31720001,358978,3.6600028526796478,2885782,2.7999975776410571,4808492,"",6.124299271683955,39773253,null,1488730,3.8899999999999997]
["ROCKPORT      ",252,19672313,"",485476,1669298,"",21827087,null,20164121,204592,3.5400006089777039,498486,2.6798441117583569,2012950,"",20.586617847741984,22880149,null,1053062,4.82]
["ROWE          ",253,4369678,"",11065,44375,"",4425118,null,4478920,19664,2.9500114196057465,11182,1.0573881608676006,48260,"",8.7549295774647895,4558026,null,132908,3]
["ROWLEY        ",254,13851903,"",662004,1051965.27,"",15565872.27,null,14198201,205008,3.9800018813299514,678061,2.4255140452323549,1270581.43,"",20.781689874609636,16351851.43,null,785979.16000000015,5.0500000000000007]
["ROYALSTON     ",255,1549644,"*",260879,218000,"*",2028523,null,1588385,19526,3.7600248831344492,266224,2.0488425668604986,212000,"*",-2.7522935779816513,2086135,null,57612,2.8400000000000003]
["RUSSELL       ",256,3550260,"",265874,176700,"",3992834,null,3615276,0,1.8313024961552111,273217,2.7618345532094151,180700,"",2.2637238256932655,4069193,null,76359,1.91]
["RUTLAND       ",257,14993230,"",1040287,1862355,"",17895872,null,15368061,530760,6.0399993863897237,1067792,2.6439819011484329,2064855,"",10.873329735737816,19031468,null,1135596,6.35]
["SALEM         ",258,107591472,"",7386797,9310000,"",124288269,null,110281259,2313217,4.6500005130518147,7591903,2.7766567837183018,9035028.4800000004,"",-2.953507196562831,129221407.48,null,4933138.4800000042,3.9699999999999998]
["SALISBURY     ",259,21513215,"",1034080,2171100,"",24718395,null,22051045,387238,4.2999988611651023,1052867,1.8167840012378154,2337700,"",7.6735295472341214,25828850,null,1110455,4.49]
["SANDISFIELD   ",260,3227269,"",116418,90000,"",3433687,null,3307951,22914,3.2100206087561962,117448,0.88474290917212117,92000,"",2.2222222222222223,3540313,null,106626,3.11]
["SANDWICH      ",261,57938685,"",1776017,4200500,"",63915202,null,59387152,869080,3.9999993096149833,1809529,1.8869188752134693,4945000,"",17.724080466611117,67010761,null,3095559,4.84]
["SAUGUS        ",262,68007835,"",3903618,7514826,"",79426279,null,69708031,1115328,4.1399994574154579,4012700,2.7943820322582793,8364900,"",11.31195852039688,83200959,null,3774680,4.75]
["SAVOY         ",263,1275917,"",202292,110800,"",1589009,null,1307815,16077,3.7600408177020919,205737,1.702983805587962,120385,"",8.6507220216606502,1650014,null,61005,3.84]
["SCITUATE      ",264,52662121,"",2136257,3869600,"",58667978,null,53978674,863659,4.1400003619299728,2196070,2.7998972033795559,3853100,"",-0.42640066156708706,60891503,null,2223525,3.7900000000000005]
["SEEKONK       ",265,42777102,"",1306706,4041500,"",48125308,null,43846530,1069428,5.0000021039293401,1343294,2.8000177545675919,4491000,"",11.122108128170234,50750252,null,2624944,5.45]
["SHARON        ",266,55764024,"",1649668,3977000,"",61390692,null,57158125,585522,3.5500002654040892,1691290,2.5230531234163478,4020000,"",1.0812169977369877,63454937,null,2064245,3.36]
["SHEFFIELD     ",267,10571830,"",358567,668000,"",11598397,null,10836126,188179,4.2800063943517817,365811,2.020263995292372,715800,"",7.1556886227544911,12105916,null,507519,4.38]
["SHELBURNE     ",268,4029212,"",280028,204500,"",4513740,null,4129942,86225,4.6399891591705771,287804,2.7768651706257947,209000,"",2.2004889975550124,4712971,null,199231,4.41]
["SHERBORN      ",269,20408518,"",244448,979600,"",21632566,null,20918731,293883,3.9400019148867154,250888,2.6345071344416811,947929,"",-3.2330543078807676,22411431,null,778865,3.5999999999999996]
["SHIRLEY       ",270,10177100,"",1485596,1542535.63,"",13205231.629999999,null,10431528,169958,4.170009138163131,1524606,2.6258821375394117,1517290.69,"",-1.6365871561747942,13643382.689999999,null,438151.06000000052,3.32]
["SHREWSBURY    ",271,68742114,"",3071070,7983900,"",79797084,null,70460667,1471081,4.6399998696577764,3153895,2.6969427593640001,8413624,"",5.3823820438632746,83499267,null,3702183,4.6399999999999997]
["SHUTESBURY    ",272,4684879,"",199056,576000,"",5459935,null,4802001,66057,3.9100049328915434,204098,2.5329555501969296,597079.13,"",3.6595711805555564,5669235.1299999999,null,209300.12999999989,3.83]
["SOMERSET      ",273,54438515,"",1628780,2885000,"",58952295,null,54438515,0,0,1674383,2.7998256363658691,2875000,"",-0.34662045060658581,58987898,null,35603,0.06]
["SOMERVILLE    ",274,168272052,"",26755389,19792559,"",214820000,null,172478853,7639551,7.0399997261577338,27504540,2.8000004036569979,20008780,"",1.0924357987261779,227631724,null,12811724,5.96]
["SOUTH HADLEY  ",275,27987337,"",2802693,2310223,"",33100253,null,28687020,307861,3.5999995283581288,2880347,2.770692330554934,2319223,"",0.3895727815020455,34194451,null,1094198,3.3099999999999996]
["SOUTHAMPTON   ",276,11813272,"",686589,1261125,"",13760986,null,12108604,167748,3.9199977787695062,705534,2.7592926772785464,1245901,"",-1.2071761324214492,14227787,null,466801,3.39]
["SOUTHBOROUGH  ",277,42035158,"",468069,2595000,"",45098227,null,43086037,786057,4.369999037472394,481074,2.7784365125654551,2870000,"",10.597302504816955,47223168,null,2124941,4.71]
["SOUTHBRIDGE   ",278,22413899,"",3739575,2824838.4299999997,"",28978312.43,null,22974246,345174,4.0399976817955681,3844177,2.7971627791928229,2979993.92,"",5.4925438691373314,30143590.920000002,null,1165278.4900000021,4.0199999999999996]
["SOUTHWICK     ",279,20110144,"",1372606,1153000,"",22635750,null,20612898,347905,4.2299995464975284,1410111,2.7323937094840036,1114000,"",-3.3824804856895057,23484914,null,849164,3.75]
["SPENCER       ",280,13269186,"",2474901,1683927,"",17428014,null,13600916,232211,4.2500044840730995,2542151,2.7172804083880528,1755795,"",4.2678809710872265,18131073,null,703059,4.03]
["SPRINGFIELD   ",281,205316171,"",40221937,49747647,"",295285755,null,205316171,0,0,41347530,2.7984554796552934,53213527,"",6.9669224757504615,299877228,null,4591473,1.55]
["STERLING      ",282,18699541,"",760366,2142000,"",21601907,null,19167030,256184,3.8700040819183745,780979,2.7109313146563627,2478000,"",15.686274509803921,22682193,null,1080286,5]
["STOCKBRIDGE   ",283,8788113,"",147581,793000,"",9728694,null,9007816,78214,3.3899996506644827,150545,2.0083886137104372,788000,"",-0.63051702395964693,10024575,null,295881,3.04]
["STONEHAM      ",284,50503191,"",3949072,4465999,"",58918262,null,51765771,666642,3.8200002055315672,4059574,2.7981763816916989,4477000,"",0.24632786527717537,60968987,null,2050725,3.4799999999999995]
["STOUGHTON     ",285,68706812,"",3400457,6294507,"",78401776,null,70424482,886318,3.789999745585634,3495670,2.8000059991936377,6239313,"",-0.87685977630972534,81045783,null,2644007,3.37]
["STOW          ",286,26472126,"",447024,1322500,"",28241650,null,27133929,637978,4.9099985395959509,459541,2.8000733741365118,1381000,"",4.4234404536862,29612448,null,1370798,4.8500000000000005]
["STURBRIDGE    ",287,25017150,"",966043,3214709,"",29197902,null,25642579,352742,3.9100017388071784,989078,2.3844694283794823,3251549,"",1.1459824201817335,30235948,null,1038046,3.56]
["SUDBURY       ",288,68383233,"",1524230,3845879,"",73753342,null,70092814,1196707,4.2500008737521959,1565851,2.7306246432624999,3761452,"",-2.1952588731990788,76616824,null,2863482,3.88]
["SUNDERLAND    ",289,4612595,"",670305,536393.25,"",5819293.25,null,4727910,52122,3.6299956965655991,685333,2.24196447885664,591069.19999999995,"",10.193258397640156,6056434.2000000002,null,237140.95000000019,4.08]
["SUTTON        ",290,20291607,"",973300,1757321,"",23022228,null,20798897,468736,4.8099985378191095,996510,2.3846707079009555,1712992,"",-2.5225328781708067,23977135,null,954907,4.1500000000000004]
["SWAMPSCOTT    ",291,44831939,"",1376074,3145000,"",49353013,null,45952737,515567,3.649998274667531,1414560,2.7967972652633506,3245740,"",3.2031796502384737,51128604,null,1775591,3.5999999999999996]
["SWANSEA       ",292,35127161,"",1994435,1610777,"",38732373,null,36005340,656878,4.3700001830492363,2050279,2.7999909748876246,1776000,"",10.257347851378558,40488497,null,1756124,4.53]
["TAUNTON       ",293,106324574,"",9082108,10456600,"",125863282,null,108982688,2626217,4.9699996916987415,9332186,2.7535237414045284,10950600,"",4.7242889658206302,131891691,null,6028409,4.79]
["TEMPLETON     ",294,7158112,"",1561627,2983773,"",11703512,null,7337065,107372,4.0000072644853839,1603089,2.6550514303351567,2680923,"",-10.149900813500222,11728449,null,24937,0.21]
["TEWKSBURY     ",295,81546456,"",3173236,6722094,"",91441786,null,83585117,2144672,5.1299997635703507,3255990,2.6078741070629476,6824965,"",1.5303415870114283,95810744,null,4368958,4.78]
["TISBURY       ",296,23590055,"",116576,1755000,"",25461631,null,24179806,396313,4.179998732516732,119492,2.501372495196267,1765000,"",0.56980056980056981,26460611,null,998980,3.92]
["TOLLAND       ",297,1065217,"",86317,101200,"",1252734,null,1091847,19067,4.2899240248700501,86867,0.63718618580349173,119700,"",18.280632411067195,1317481,null,64747,5.17]
["TOPSFIELD     ",298,19855552,"",791874,1166000,"",21813426,null,20351941,180686,3.4100034086184055,810111,2.303017904363573,1190000,"",2.0583190394511148,22532738,null,719312,3.3000000000000003]
["TOWNSEND      ",299,15285466,"",1595567,1464303,"",18345336,null,15667603,166612,3.5900050413902984,1634643,2.4490353585903946,1554883.0499999998,"",6.1858816105682921,19023741.050000001,null,678405.05000000075,3.6999999999999997]
["TRURO         ",300,10189584,"",32209,1290860,"",11512653,null,10444324,137559,3.8500001570230933,33104,2.7787264429196807,1203400,"",-6.7753280758564056,11818387,null,305734,2.6599999999999997]
["TYNGSBOROUGH  ",301,28178290,"",1053394,2721560.59,"",31953244.59,null,28882747,453670,4.1099974483902324,1082128,2.7277542875695135,3226000,"",18.534932194913956,33644545,null,1691300.4100000001,5.29]
["TYRINGHAM     ",302,1533632,"",25808,63950,"",1623390,null,1571973,10429,3.1800327588365396,26185,1.4607873527588344,65950,"",3.1274433150899141,1674537,null,51147,3.15]
["UPTON         ",303,14360859,"",766496,1206622,"",16333977,null,14719880,394924,5.2499993210712539,782326,2.0652423496013026,1181686,"",-2.066595835315451,17078816,null,744839,4.5600000000000005]
["UXBRIDGE      ",304,28122469,"",1487898,2293352,"",31903719,null,28825531,722747,5.069999365987389,1528809,2.7495836408140879,2593929,"",13.106448552162947,33671016,null,1767297,5.54]
["WAKEFIELD     ",305,74317122,"",3609891,7225438,"",85152451,null,76175050,1449184,4.4500000955365309,3710058,2.7747929231104207,7598789,"",5.167174640485463,88933081,null,3780630,4.4400000000000004]
["WALES         ",306,3419431,"",292059,238400,"",3949890,null,3504917,34536,3.5099991782258511,299082,2.4046511150144321,248000,"",4.026845637583893,4086535,null,136645,3.46]
["WALPOLE       ",307,68863605,"",2779763,4956000,"",76599368,null,70585195,1363499,4.4799992681184788,2855541,2.7260597396252848,5672000,"",14.447134786117838,80476235,null,3876867,5.0599999999999996]
["WALTHAM       ",308,231970809,"",10204896,18259127.190000001,"",260434832.19,null,237770079,6379197,5.2499997963105782,10490416,2.7978727073749696,18642500,"",2.0996228681180384,273282192,null,12847359.810000002,4.93]
["WARE          ",309,15473335,"",1852745,1478557.21,"",18804637.210000001,null,15860168,116050,3.2499974956917819,1904077,2.7705917436020608,1502202.25,"",1.5991968278319131,19382497.25,null,577860.03999999911,3.0700000000000003]
["WAREHAM       ",310,42001479,"",2207608,4680000,"",48889087,null,43051516,508218,3.7100003073701284,2266435,2.6647393921384595,4877000,"",4.2094017094017095,50703169,null,1814082,3.71]
["WARREN        ",311,8333966,"",965933,701512.38,"",10001411.380000001,null,8542315,105841,3.7699937820720653,992834,2.7849757695409516,739282.18,"",5.3840532365230738,10380272.18,null,378860.79999999888,3.7900000000000005]
["WARWICK       ",312,1799561,"",233452,117000,"",2150013,null,1844550,7558,2.9199899308775863,237233,1.6196048866576427,119500,"",2.1367521367521367,2208841,null,58828,2.74]
["WASHINGTON    ",313,1125692,"",172495,196700,"",1494887,null,1153834,18461,4.1399423643412234,175303,1.6278732716890345,202900,"",3.1520081342145398,1550498,null,55611,3.7199999999999998]
["WATERTOWN     ",314,117181127,"",7083057,8150783,"",132414967,null,120110655,5273151,7.0000000938717717,7281383,2.8000057037519253,8455326,"",3.7363649602743689,141120515,null,8705548,6.5699999999999994]
["WAYLAND       ",315,58453859,"",1059266,3494000,"",63007125,null,59915205,602075,3.5299996190157437,1086142,2.5372286092445147,3803000,"",8.8437321121923294,65406422,null,2399297,3.81]
["WEBSTER       ",316,23233170,"",2655097,3147236,"",29035503,null,23813999,339204,3.9599977101704158,2728714,2.772667062634623,3239604,"",2.9348927122084265,30121521,null,1086018,3.74]
["WELLESLEY     ",317,110269797,"",1375608,6976000,"",118621405,null,113026542,2216423,4.5100001408363886,1414125,2.7999982553169218,7292724.9800000004,"",4.5402090022935848,123949814.98,null,5328409.9800000042,4.49]
["WELLFLEET     ",318,12984127,"",70467,1097410.78,"",14152004.779999999,null,13308730,140229,3.5800019516136894,72205,2.4664027133268056,1133388.45,"",3.2784141231052901,14654552.449999999,null,502547.66999999993,3.55]
["WENDELL       ",319,2373737,"*",294531,121940.03000000001,"*",2790208.03,null,2373737,0,0,299713,1.7594073289399079,118224.68,"*",-3.0468665621945639,2791674.68,null,1466.6500000003725,0.05]
["WENHAM        ",320,12818529,"",457919,581736.85,"",13858184.85,null,13138992,265344,4.5700017529312449,470655,2.7812779115957187,228148,"",-60.781580193862574,14103139,null,244954.15000000037,1.77]
["WEST BOYLSTON ",321,17966588,"",846068,2240500,"",21053156,null,18415753,300042,4.1700015606747369,869758,2.8000113466057104,2266700,"",1.1693818344119615,21852253,null,799097,3.8]
["WEST BRIDGEWATER",322,25240719,"",733363,2139299.52,"",28113381.52,null,25871737,610825,4.9199985150977676,752806,2.6512109282851739,2296244,"",7.3362555608856486,29531612,null,1418230.4800000004,5.04]
["WEST BROOKFIELD",323,6218609,"",570486,600000,"",7389095,null,6374074,144894,4.8300029797660535,584968,2.5385373173048946,631500,"",5.25,7735436,null,346341,4.6899999999999995]
["WEST NEWBURY  ",324,11731588,"",358962,807432,"",12897982,null,12024878,130221,3.6100057383535802,367772,2.4542987837152679,975785,"",20.850424555875914,13498656,null,600674,4.66]
["WEST SPRINGFIELD",325,70938030,"",3806257,5408000,"",80152287,null,70938030,0,0,3912819,2.7996533076983505,5593000,"",3.4208579881656807,80443849,null,291562,0.36]
["WEST STOCKBRIDGE",326,6121927,"",177046,280500,"",6579473,null,6274975,59383,3.4700021741520275,179937,1.6329089615128272,296500,"",5.7040998217468806,6810795,null,231322,3.52]
["WEST TISBURY  ",327,11747230,"",1026954,838650,"",13612834,null,12040911,184432,4.0700062908447352,1032477,0.53780403017077683,822937,"",-1.8736063912239909,14080757,null,467923,3.44]
["WESTBOROUGH   ",328,87805268,"",1341294,5978068.5999999996,"",95124630.599999994,null,90000400,1483909,4.1900003084097417,1375749,2.5687880509418517,6655907.1200000001,"",11.338754459927083,99515965.120000005,null,4391334.5200000107,4.62]
["WESTFIELD     ",329,81172571,"",6803848,11370625,"",99347044,null,81584315,0,0.50724523681774225,6991025,2.751046172695216,11755000,"",3.3804210410597482,100330340,null,983296,0.9900000000000001]
["WESTFORD      ",330,70584010,"",2256951,7043700.6399999997,"",79884661.640000001,null,72348610,769366,3.5900000580868103,2320139,2.7997063294683846,7250112.1399999997,"",2.9304411210752424,82688227.140000001,null,2803565.5,3.51]
["WESTHAMPTON   ",331,4047857,"",155051,310800,"",4513708,null,4149053,64766,4.0999966154930867,159360,2.7790855911925751,310800,"",0,4683979,null,170271,3.7699999999999996]
["WESTMINSTER   ",332,16205119,"",841605,1543000,"",18589724,null,16610247,256041,4.0800008935448115,861069,2.3127239025433548,1626864,"",5.4351263771872977,19354221,null,764497,4.1099999999999994]
["WESTON        ",333,75116342,"",397212,3378136,"",78891690,null,76994251,1337071,4.2800007487052554,408334,2.80001611230275,3489623,"",3.3002519732775708,82229279,null,3337589,4.2299999999999995]
["WESTPORT      ",334,27688761,"",1962996,3601960,"",33253717,null,28380980,509473,4.3399991787281493,1999170,1.842795400500052,4093945,"",13.658813534853246,34983568,null,1729851,5.2]
["WESTWOOD      ",335,71075739,"",774708,2848915,"",74699362,null,72852632,1393084,4.4599986501723183,796400,2.8000227182370647,2910000,"",2.1441496148533741,77952116,null,3252754,4.3499999999999996]
["WEYMOUTH      ",336,111575293,"",9279496,10277635,"",131132424,null,114364675,2242663,4.5099993598045041,9538755,2.7938909613194509,10902000,"",6.0749870957666818,137048093,null,5915669,4.51]
["WHATELY       ",337,4947548,"",174451,310000,"",5431999,null,5071237,116762,4.8600033794518014,178441,2.2871751953270545,310000,"",0,5676440,null,244441,4.5]
["WHITMAN       ",338,25470647,"",2571344,2435000,"",30476991,null,26107413,300554,3.6800007475271439,2643342,2.800014311581803,2360000,"",-3.0800821355236141,31411309,null,934318,3.0700000000000003]
["WILBRAHAM     ",339,35548343,"",1556697,2542768,"",39647808,null,36437052,494122,3.8900012864172036,1600212,2.7953416753549343,2676400,"",5.2553752446153172,41207786,null,1559978,3.93]
["WILLIAMSBURG  ",340,5328559,"",329075,361000,"",6018634,null,5461773,67673,3.7700061123466964,338077,2.7355466079161284,391000,"",8.310249307479225,6258523,null,239889,3.9899999999999998]
["WILLIAMSTOWN  ",341,16490774,"",1173220,1436360,"",19100354,null,16903043,230871,3.8999988720966039,1201607,2.4195803003699221,1549110,"",7.8497034169706756,19884631,null,784277,4.1099999999999994]
["WILMINGTON    ",342,84206856,"",2640489,5798000,"",92645345,null,86312027,1894654,4.7499992162158389,2714423,2.8000116645060822,6942545,"",19.740341497067956,97863649,null,5218304,5.63]
["WINCHENDON    ",343,11808108,"",1879173,1955530,"",15642811,null,12103311,134612,3.6399988888990515,1929194,2.6618624256521355,2011349,"",2.8544179838713801,16178466,null,535655,3.42]
["WINCHESTER    ",344,82746318,"",1591357,4516000,"",88853675,null,84814976,1059153,3.7800002170489324,1635349,2.7644331221718321,4611000,"",2.1036315323294952,92120478,null,3266803,3.6799999999999997]
["WINDSOR       ",345,1791336,"",203831,166500,"",2161667,null,1836119,30274,4.1900012058039362,206919,1.5149805476105205,157200,"",-5.5855855855855854,2230512,null,68845,3.18]
["WINTHROP      ",346,23171226,"",4476634,4801189,"",32449049,null,23750507,254883,3.5999994130651523,4601980,2.8000055398766128,5231141,"",8.9551150767028744,33838511,null,1389462,4.2799999999999994]
["WOBURN        ",347,133532009,"",6359403,11836999.609999999,"",151728411.61000001,null,136870309,3725543,5.2899997932330969,6537407,2.7990677741291123,12000000,"",1.3770414409940206,159133259,null,7404847.3899999857,4.88]
["WORCESTER     ",348,335601504,"",44322773,33882009,"",413806286,null,338145373,0,0.75800286044010101,45558380,2.7877475084873411,34600000,"",2.1190921707151427,418303753,null,4497467,1.0900000000000001]
["WORTHINGTON   ",349,2758056,"",208620,109525,"",3076201,null,2827007,23995,3.3699823353840532,212355,1.7903364969801554,109300,"",-0.2054325496461995,3172657,null,96456,3.1399999999999997]
["WRENTHAM      ",350,34103831,"",1042728,2241750,"",37388309,null,34956427,644562,4.3899994695610589,1070449,2.6585073000820922,2370405.77,"",5.7390775064124018,39041843.770000003,null,1653534.7700000033,4.42]
["YARMOUTH      ",351,52398062,"",1341897,7454000,"",61193959,null,53708014,482062,3.4200005336075217,1379437,2.7975321503811394,7157000,"",-3.9844378856989535,62726513,null,1532554,2.5]
[]
["State Totals",null,{"$f":"SUM(C10:C360)","v":17553788274},null,972520001,1375725631.3300002,null,16314364977.329998,null,14303099018,227481722,4.0416480845989788,1006567001,3.5009048621098744,1445079219.5499995,null,5.0412369036804856,16982226960.549999,null,667861983.22000027,4.09]