{"text_format":"1","workbook":"xlsx","n_sheets":8,"sheets":["Instructions","CMFs","Input","Input Summary","Output","Intersection Tables","Calibration Factors","Construction - do not delete"],"not_rendered":{"charts":0,"images":0,"macros":1,"external_links":0,"defined_names":42,"comments":2,"pivot_tables":0},"unopened":[],"bounds":{"document_bytes":16777216,"sheet_cells":100000,"rows_first":2000,"rows_last":500,"rows_between":2000,"halvings":0,"cell_chars":16384,"cell_head_chars":4096},"cells_cut":0,"cells_raw":0,"read":"whole","date_system":"1900"}

{"sheet":"Instructions","index":0,"n_rows":39,"n_cols":14,"rows_kept":39,"cut":false,"hidden":false,"merged":[[1,1,1,19],[2,1,2,19],[11,13,12,17],[14,13,15,17],[33,4,36,9],[6,11,7,19],[17,13,18,17],[17,4,18,9],[20,4,22,9],[24,4,26,9],[6,1,8,9],[10,1,10,9],[20,13,20,17],[28,4,28,9],[30,4,30,9]]}
[]
[null,"MassDOT Safety Alternatives Analysis Guide Spreadsheet Tool"]
[null,"Method 3 - Observed Crash Frequency"]
[]
[null,"Overview",null,null,null,null,null,null,null,null,null,"Color Coding Rules"]
[]
[null,"This Excel file has been developed to assist analyis in conducting Safety Alternative Analysis. The SPFs were developed as a part of the project entitled \"Calibration of Safety Performance Functions and Crash Modification Factors for Massachusetts’ Urban Intersections\". ",null,null,null,null,null,null,null,null,null,"The worksheets include three color options to help users identify locations where input data is required."]
[]
[]
[null,null,null,null,null,null,null,null,null,null,null,"Color Used",null,"Type of Information Required from User"]
[null,"Macros must be enable to use this spreadsheet"]
[null,null,null,null,null,null,null,null,null,null,null,"Sample",null,"Required input information as identified in the HSM. To be keyed in manually."]
[null,null,null,null,null,null,null,null,null,null,null,"Text"]
[null,"The contents of this Excel file include the following:"]
[null,null,null,null,null,null,null,null,null,null,null,"Sample",null,"Input data required from the user but restricted to options provided in the pull-down menu."]
[null,"Worksheet Name",null,null,"Contents",null,null,null,null,null,null,"Text"]
[]
[null,"Instructions",null,null,"The worksheet you are seeing now provides an overview of the Excel file, summary of the worksheets and the color coding rules.",null,null,null,null,null,null,"Sample",null,"Optional input information that can be used to supplement the analysis if this information is available.  "]
[null,null,null,null,null,null,null,null,null,null,null,"Text"]
[]
{"$rows_left_out":20}
{"sheet":"CMFs","index":1,"n_rows":169,"n_cols":12,"rows_kept":169,"cut":false,"hidden":false,"merged":[[108,0,117,0],[118,0,127,0],[128,0,129,0],[130,0,149,0],[150,0,168,0],[91,0,107,0],[1,0,20,0],[21,0,30,0],[31,0,50,0],[51,0,70,0],[71,0,90,0]]}
["Facility","Countermeasure","Crash Type","All Severity CMF","FI CMF","Area Type","Prior Condition","Site Description","Notes","Resource 1 ","Resource 2","Resource 3"]
["Pedestrian and Bicycle","Add Separated Bike Lane","Vehicle-Bicycle",0.26,0.26,"Urban","No Bicycle Infrastructure","Urban Street","Assumed KABC CMF applies to all because all Bike crashes are assumed to be KABC","http://www.cmfclearinghouse.org/detail.cfm?facid=4097"]
[null,"Add Separation between Road and Bike Lane","Vehicle-Bicycle",0.63,0.63,"Urban","Bike Lane with No Buffer","Urban Street",null,"Cross-Sectional Comparison of Cycle Track and Bike Lane CMF"]
[null,"Add Shared Use Path","Vehicle-Bicycle",0.75,0.75,"Urban","No Shared Use Path Present","Principal Arterial Other, Minor arterial, major and minor collectors",null,"http://www.cmfclearinghouse.org/detail.cfm?facid=9250"]
[null,"Add Sidewalk - Urban","Vehicle-Pedestrian",0.12,0.12,"Urban/Suburban","No Sidewalk Present",null,null,"https://www.pedbikeinfo.org/cms/downloads/WalkingAlongRoadways_Study_Guidelines.pdf"]
[null,"Add Wide Paved Shoulder for Pedestrian Walkway","Vehicle-Pedestrian",0.28999999999999998,0.28999999999999998,"Rural","Narrow, Unwalkable Shoulder","Rural Highway with Pedestrian Traffic",null,"https://safety.fhwa.dot.gov/speedmgt/ref_mats/fhwasa1304/resources/CRF%20Desktop%20Reference.pdf"]
[null,"Advanced Pedestrian Crossing Signage","Vehicle-Pedestrian",0.75,0.75,"Urban and Suburban","No Advanced Warning Signage or Markings","Mid-Block and Intersection Crossings","Minimum of 340 to Maximum of 52892 Annual Average Daily Traffic (AADT)","http://www.cmfclearinghouse.org/detail.cfm?facid=9017"]
[null,"Bike box","Vehicle-Bicycle",0.65,0.65,"Urban","No Bike Box","Signalized Intersection",null,"Herrstedt, L., M.A. Nielsen, L. Agústson, K.M.L. Krogsgaard, E. Jørgensen, and N.O. Jørgensen. Safety of Cyclists in Urban Areas: Danish Experiences. Copenhagen, Denmark: Danish Road Directorate, 1994 via Signalized Intersections Informational Guide"]
[null,"Bike lane","All",{"$f":"AVERAGE(0.7859,1.3065,0.901,0.558,0.435,0.51,0.643,0.734,0.694,0.649)","v":0.72164000000000006},0.93,"Urban","No Bike Lane","Urban Street","FI CMF only applicable for Method 3. Weighted average from http://www.cmfclearinghouse.org/study_detail.cfm?stid=618. KABC CMF is a weighted average of all KABC CMFs in the study","http://www.cmfclearinghouse.org/study_detail.cfm?stid=618"]
[null,"Convert to High-Visibility Crosswalk","Vehicle-Pedestrian",0.52,0.52,"Urban","Standard Crosswalk Markings","Three or Four Leg Intersection","Signalized and unsignalized intersections. ","https://www.sciencedirect.com/science/article/abs/pii/S0001457512001613","http://www.cmfclearinghouse.org/detail.cfm?facid=4123"]
[null,"Exclusive Pedestrian Phase","Vehicle-Pedestrian",0.49,0.49,"Urban","Signalized Intersection without Exclusive Phase","Signalized Intersection","3-leg,4-leg,More than 4 legs intersection","http://www.cmfclearinghouse.org/detail.cfm?facid=4117"]
[null,"Implement Leading Pedestrian Interval","All",0.9,0.83,"Urban and Suburban","No Leading Pedestrian Interval","Urban Signalized Intersection","FI CMF only applicable for Method 3","http://www.cmfclearinghouse.org/detail.cfm?facid=9902","http://www.cmfclearinghouse.org/detail.cfm?facid=9901"]
[null,"Increase Pedestrian Crossing Time","Vehicle-Pedestrian",0.49,0.49,"Urban","Standard Crossing Time","Signalized Intersection with Pedestrian Crossing Phase","3-leg,4-leg,More than 4 legs","http://www.cmfclearinghouse.org/detail.cfm?facid=4115"]
[null,"Install Crosswalk Lighting","Vehicle-Pedestrian",0.41,0.41,"All","No Lighting Present","Intersection",null,"http://www.cmfclearinghouse.org/detail.cfm?facid=440","http://www.cmfclearinghouse.org/detail.cfm?facid=441"]
[null,"Install Grade-Separated Pedestrian Crossing","Vehicle-Pedestrian",0.14000000000000001,0.14000000000000001,"Urban","At-Grade Pedestrian Crossing","Pedestrian Crossing",null,"https://lctr.eng.fiu.edu/Documents/CRFFinalReport.pdf"]
[null,"Install Median Island for Pedestrian Crossing at Controlled Crossing","Vehicle-Pedestrian",0.71099999999999997,0.73399999999999999,"Urban and Suburban","Two-Way Left-Turn Lane","Signalized Pedestrian Crossing","FI CMF only applicable for Method 3. Minimum of 10500 to Maximum of 57000 Annual Average Daily Traffic (AADT)","http://www.cmfclearinghouse.org/detail.cfm?facid=5075","http://www.cmfclearinghouse.org/detail.cfm?facid=5076"]
[null,"Install Median Island for Pedestrian Crossing at Uncontrolled Crossing","Vehicle-Pedestrian",0.68500000000000005,0.68500000000000005,"Urban and Suburban","No Raised Median Present","Uncontrolled Pedestrian Crossing",null,"http://www.cmfclearinghouse.org/detail.cfm?facid=8799"]
[null,"Install Pedestrian Countdown Timer","All",0.91200000000000003,0.95199999999999996,null,"No Pedestrian Countdown Timer","4- legged signalized Intersection with Pedestrian Crossing","FI CMF only applicable for Method 3. ","http://www.cmfclearinghouse.org/detail.cfm?facid=8791","http://www.cmfclearinghouse.org/detail.cfm?facid=8790"]
[null,"Install Pedestrian Hybrid Beacon (or HAWK Crossing)","Vehicle-Pedestrian",0.54300000000000004,0.55000000000000004,"Urban and Suburban","No PHB/HAWK","Uncontrolled Pedestrian Crossing",null,"http://www.cmfclearinghouse.org/detail.cfm?facid=10608","http://www.cmfclearinghouse.org/detail.cfm?facid=10607"]
[null,"Install Raised Pedestrian Crossing","All",0.7,0.64,null,"Flat Pedestrian Crossing","Pedestrian Crossing","FI CMF only applicable for Method 3."," Bahar, G., Parkhill, M., Hauer, E., Council, F., Persaud, B., Zegeer, C., Elvik, R., Smiley, A., and\nScott, B. “Prepare Parts I and II of a Highway Safety Manual: Knowledge Base for Part II”.\nUnpublished material from NCHRP Project 17-27, (May 2007). ","https://safety.fhwa.dot.gov/ped_bike/tools_solve/fhwasa18041/fhwasa18041.pdf"]
{"$rows_left_out":150}
{"sheet":"Input","index":2,"n_rows":119,"n_cols":13,"rows_kept":119,"cut":false,"hidden":false,"merged":[[75,2,75,3],[74,2,74,3],[74,4,74,5],[75,4,75,5],[14,0,14,6],[13,0,13,6],[59,2,59,3],[15,0,15,5],[28,0,28,5],[27,0,27,5],[19,0,19,5],[35,3,35,12],[16,0,16,5],[20,0,20,5],[18,0,18,6],[48,0,48,3],[53,0,53,2],[24,0,24,5],[26,0,26,5],[25,0,25,5],[23,0,23,5],[22,0,22,5],[21,0,21,5],[72,2,72,3],[72,4,72,5],[73,2,73,3],[73,4,73,5],[52,0,52,2],[30,0,30,5],[29,0,29,5],[32,0,32,5],[31,0,31,5],[49,0,49,2],[51,0,51,2],[50,0,50,2],[60,4,60,6],[54,0,54,2],[72,1,74,1],[82,4,82,5],[81,4,81,5],[78,2,78,3],[76,2,76,3],[78,4,78,5],[81,2,81,3],[82,2,82,3],[79,2,79,3],[80,2,80,3],[77,2,77,3],[77,4,77,5],[80,4,80,5],[76,4,76,5],[79,4,79,5],[0,4,0,6],[2,0,2,6],[3,0,3,3],[3,4,3,6],[9,0,9,6],[11,0,11,1],[10,0,10,1],[10,4,10,5],[7,0,7,1],[4,2,4,3],[4,5,4,6],[5,2,5,3],[5,5,5,6],[6,2,6,3],[6,5,6,6],[0,0,0,1],[0,2,0,3],[5,0,5,1],[4,0,4,1],[6,0,6,1],[7,5,7,6],[7,2,7,3],[11,2,11,3],[10,2,10,3],[92,2,92,3],[92,4,92,5],[84,2,84,3],[84,4,84,5],[84,1,86,1],[85,2,85,3],[85,4,85,5],[86,2,86,3],[86,4,86,5],[118,2,118,3],[118,4,118,5],[114,2,114,3],[114,4,114,5],[115,2,115,3],[115,4,115,5],[116,2,116,3],[116,4,116,5],[96,1,98,1],[97,2,97,3],[97,4,97,5],[98,2,98,3],[98,4,98,5],[96,4,96,5],[99,2,99,3],[99,4,99,5],[100,2,100,3],[100,4,100,5],[113,2,113,3],[113,4,113,5],[108,1,110,1],[109,2,109,3],[109,4,109,5],[110,2,110,3],[117,2,117,3],[117,4,117,5],[110,4,110,5],[105,2,105,3],[105,4,105,5],[106,2,106,3],[106,4,106,5],[108,2,108,3],[108,4,108,5],[111,2,111,3],[111,4,111,5],[112,2,112,3],[112,4,112,5],[1,2,1,3],[102,4,102,5],[103,2,103,3],[103,4,103,5],[104,2,104,3],[104,4,104,5],[102,2,102,3],[101,2,101,3],[101,4,101,5],[93,2,93,3],[93,4,93,5],[94,2,94,3],[94,4,94,5],[96,2,96,3],[87,2,87,3],[87,4,87,5],[88,2,88,3],[88,4,88,5],[89,2,89,3],[89,4,89,5],[90,2,90,3],[90,4,90,5],[91,2,91,3],[91,4,91,5]]}
["Required Manual Input",null,"Optional Manual Input",null,"Select from Drop-Down List"]
[null,null,"Method 3","Method 3"]
["General Information"]
["General Information",null,null,null,"Location Information"]
["Analyst",null,null,null,"City"]
["Agency or Company",null,null,null,"Intersection"]
["Date Performed",null,null,null,"Jurisdiction"]
["Study Period (Years, 5 minimum - 10 maximum):",null,1,null,"Analysis Year"]
[]
["Intersection Data"]
["Intersection Type:",null,"3ST HSM"]
["Intersection Lighting (Present/Not Present):",null,"Not Present"]
[]
[]
["Stop Controlled - This information not needed for Method 3"]
["Number of major-road approaches with left-turn lanes (0,1,2)"]
["Number of major-road approaches with right-turn lanes (0,1,2)"]
[]
["Signal Controlled - This information not needed for Method 3"]
["Number of approaches with left-turn lanes (0,1,2,3,4) \n[for 3SG, use maximum value of 3]"]
{"$rows_left_out":100}
{"sheet":"Input Summary","index":3,"n_rows":37,"n_cols":5,"rows_kept":37,"cut":false,"hidden":true,"merged":[[14,0,14,3],[13,0,13,3],[12,0,12,3],[36,0,36,3],[35,0,35,3],[25,0,25,3],[24,0,24,3],[23,0,23,3],[31,0,31,3],[30,0,30,3],[29,0,29,3],[28,0,28,3],[27,0,27,3],[10,2,10,3],[9,2,9,3],[8,2,8,3],[26,0,26,3],[34,0,34,3],[33,0,33,3],[32,0,32,3],[22,0,22,4],[21,0,21,4],[11,0,11,4],[20,0,20,4],[19,0,19,3],[18,0,18,3],[17,0,17,4],[16,0,16,4],[15,0,15,4],[0,0,0,1],[0,2,0,4],[2,0,2,4],[7,3,7,4],[4,3,4,4],[3,0,3,1],[3,2,3,4],[1,0,1,4],[6,3,6,4],[5,3,5,4]]}
["Required Automated Input For Each Year",null,"Single Automated Data Pull"]
["NOTE: This sheet can't be used to calculate when converting to a different intersection type"]
["General Information and Input Data for Urban and Suburban Arterial Intersections"]
["General Information",null,"Location Information"]
["Analyst",{"$f":"Input!C5","v":0},"City",{"$f":"Input!F5","v":0}]
["Agency or Company",{"$f":"Input!C6","v":0},"Intersection",{"$f":"Input!F6","v":0}]
["Date Performed",{"$f":"Input!C7","v":"00:00:00"},"Jurisdiction",{"$f":"Input!F7","v":0}]
[null,null,"Analysis Year",{"$f":"Input!F8","v":0}]
["Facility Type:",{"$f":"Input!C60","v":"Please Select Facility Type"},"Discount Rate (i)",null,{"$f":"Input!B61","v":7.0000000000000007E-2}]
["Sheet to Pull Data From:",{"$f":"Input!C11","v":"3ST HSM"},"Intersection Type:",null,{"$f":"LEFT(B10,3)","v":"3ST"}]
["Number of Proposed Alternatives:",{"$f":"Input!D61","v":0},"Study Period:",null,{"$f":"Input!C8","v":1}]
["Present Data:"]
["Present AADT(Major):"]
["Present AADT(Minor):"]
["Intersection Lighting (Present/Not Present):",null,null,null,{"$f":"Input!C12","v":"Not Present"}]
[]
["Stop Controlled"]
["Present Data:"]
["Number of major-road approaches with left-turn lanes (0,1,2)",null,null,null,{"$f":"Input!G16","v":0}]
["Number of major-road approaches with right-turn lanes (0,1,2)",null,null,null,{"$f":"Input!G17","v":0}]
{"$rows_left_out":18}
{"sheet":"Output","index":4,"n_rows":105,"n_cols":9,"rows_kept":105,"cut":false,"hidden":false,"merged":[[92,1,92,2],[92,3,92,4],[92,5,92,6],[92,7,92,8],[91,0,91,8],[54,1,54,2],[54,4,54,6],[72,1,72,2],[72,4,72,6],[1,0,1,5],[16,0,16,6],[18,1,18,2],[18,4,18,6],[36,1,36,2],[36,4,36,6]]}
["Results","Ensure that program at end of Input was run. If any Input values are modified, the program must be run again. If cells display #REF, press the F9 key."]
["Step 1.3C - Calculate Estimated Number of Crashes for the Design Year"]
["Crash Type, Severity","Total Observed Crashes During Study Period","AADTstudy","YYears,study","AADTDesign","Estimated Crashes During the Design Year using Method 3, No-Build"]
["MV, FI",{"$f":"Input!B39","v":"INVALID"},{"$f":"Input!$D$54","v":"Please Input Both AADT's"},{"$f":"Input!$C$8","v":1},{"$f":"Input!$D$55","v":0},{"$f":"B4/(C4*D4)*E4","v":{"$error":"#VALUE!"}}]
["MV, PDO",{"$f":"Input!B40","v":"INVALID"},{"$f":"Input!$D$54","v":"Please Input Both AADT's"},{"$f":"Input!$C$8","v":1},{"$f":"Input!$D$55","v":0},{"$f":"B5/(C5*D5)*E5","v":{"$error":"#VALUE!"}}]
["SV, FI",{"$f":"Input!B41","v":"INVALID"},{"$f":"Input!$D$54","v":"Please Input Both AADT's"},{"$f":"Input!$C$8","v":1},{"$f":"Input!$D$55","v":0},{"$error":"#VALUE!"}]
["SV, PDO",{"$f":"Input!B42","v":"INVALID"},{"$f":"Input!$D$54","v":"Please Input Both AADT's"},{"$f":"Input!$C$8","v":1},{"$f":"Input!$D$55","v":0},{"$f":"B7/(C7*D7)*E7","v":{"$error":"#VALUE!"}}]
["Ped, FI",{"$f":"Input!B43","v":"INVALID"},{"$f":"Input!$D$54","v":"Please Input Both AADT's"},{"$f":"Input!$C$8","v":1},{"$f":"Input!$D$55","v":0},{"$error":"#VALUE!"}]
["Ped, PDO",{"$f":"Input!B44","v":"INVALID"},{"$f":"Input!$D$54","v":"Please Input Both AADT's"},{"$f":"Input!$C$8","v":1},{"$f":"Input!$D$55","v":0},{"$error":"#VALUE!"}]
["Bike, FI",{"$f":"Input!B45","v":"INVALID"},{"$f":"Input!$D$54","v":"Please Input Both AADT's"},{"$f":"Input!$C$8","v":1},{"$f":"Input!$D$55","v":0},{"$error":"#VALUE!"}]
["Bike, PDO",{"$f":"Input!B46","v":"INVALID"},{"$f":"Input!$D$54","v":"Please Input Both AADT's"},{"$f":"Input!$C$8","v":1},{"$f":"Input!$D$55","v":0},{"$error":"#VALUE!"}]
["Total (FI)",{"$f":"SUM(B4,B6,B8,B10)","v":0},"-","-","-",{"$f":"SUM(F4,F6,F8,F10)","v":{"$error":"#VALUE!"}}]
["Total (PDO)",{"$f":"SUM(B5,B7,B9,B10)","v":0},"-","-","-",{"$f":"SUM(F5,F7,F9,F11)","v":{"$error":"#VALUE!"}}]
[]
[]
[]
["Step 2 – Expected Change in Safety Performance"]
["Alternative 1",null,null,null,null,"Estimated Lifetime of Alternative 1:",{"$f":"IF(Input!B68=\"\",\"\",Input!B68)","v":""}]
["Countermeasure 1:",{"$f":"IF(Input!B66=\"\",\"\",Input!B66)","v":""},null,"Countermeasure 2:",{"$f":"IF(Input!B67=\"\",\"\",Input!B67)","v":""}]
["Crash Type, Severity","Estimated Crashes during the Design Year ","CMF1","CMF2\n(If Applicable)","Resultant CMF","Estimated Crashes during the Design Year for Alternative 1 ","Reduced Crashes for Alternative 1"]
{"$rows_left_out":86}
{"sheet":"Intersection Tables","index":5,"n_rows":137,"n_cols":31,"rows_kept":137,"cut":false,"hidden":true,"merged":[[92,1,92,2],[90,5,90,6],[91,5,91,6],[130,19,132,19],[130,20,132,20],[130,21,132,21],[130,22,132,22],[130,23,132,23],[130,24,132,24],[128,15,129,25],[130,15,132,15],[130,16,132,16],[130,17,132,17],[118,21,120,23],[130,1,130,5],[93,1,93,2],[93,3,93,4],[93,5,93,6],[115,1,116,5],[130,18,132,18],[118,18,120,20],[120,11,120,12],[115,15,116,29],[109,0,109,14],[68,24,69,28],[70,24,71,27],[70,28,71,28],[72,24,72,27],[54,24,54,27],[55,24,55,27],[59,24,60,28],[73,24,73,27],[74,24,74,27],[61,24,62,27],[61,28,62,28],[63,24,63,27],[64,24,64,27],[117,11,119,12],[117,28,117,29],[125,1,125,5],[120,1,120,5],[130,25,132,25],[117,26,117,27],[118,26,120,26],[118,27,120,27],[117,9,119,9],[117,10,119,10],[117,1,119,1],[117,5,119,5],[40,3,40,10],[49,3,49,10],[48,1,48,10],[50,7,50,8],[50,9,50,10],[41,9,41,10],[45,1,45,2],[46,1,46,2],[43,1,43,2],[49,1,51,2],[50,5,50,6],[63,3,63,10],[31,8,31,12],[39,1,40,2],[62,1,63,2],[24,1,24,5],[123,11,123,12],[121,11,121,12],[55,1,55,2],[88,3,89,4],[64,7,64,8],[64,9,64,10],[66,1,66,2],[67,1,67,2],[68,1,68,2],[91,1,91,2],[92,3,92,4],[80,1,80,2],[87,1,88,2],[92,5,92,6],[90,3,90,4],[91,3,91,4],[89,1,89,2],[90,1,90,2],[39,3,39,10],[115,8,116,12],[117,8,119,8],[14,8,14,12],[9,8,10,12],[11,8,13,8],[56,1,56,2],[52,1,52,2],[62,3,62,10],[54,1,54,2],[41,1,42,2],[47,1,47,2],[11,12,13,12],[37,1,38,10],[30,8,30,12],[51,11,51,12],[41,3,41,4],[41,5,41,6],[41,7,41,8],[44,1,44,2],[19,8,19,12],[24,8,24,12],[41,11,41,12],[53,1,53,2],[64,1,65,2],[87,3,87,6],[19,1,19,5],[33,25,33,26],[35,24,35,30],[28,30,29,30],[43,30,44,30],[41,24,42,27],[122,11,122,12],[118,24,120,25],[118,15,120,15],[118,16,120,16],[118,17,120,17],[118,28,120,28],[118,29,120,29],[43,24,43,27],[44,24,44,27],[45,24,45,27],[39,24,40,28],[41,28,42,28],[34,24,34,30],[58,24,58,27],[49,24,50,28],[51,24,52,27],[53,24,53,27],[51,28,52,28],[32,25,32,26],[0,0,0,13],[88,5,89,6],[71,1,71,2],[72,1,72,10],[70,1,70,2],[73,3,73,10],[69,1,69,2],[74,3,74,4],[74,5,74,6],[81,1,81,2],[85,1,86,6],[74,9,74,10],[76,1,76,2],[77,1,77,2],[78,1,78,2],[79,1,79,2],[64,3,64,4],[64,5,64,6],[50,3,50,4],[60,1,61,10],[74,7,74,8],[73,1,75,2],[3,0,4,13],[11,21,13,21],[14,15,14,21],[13,27,14,27],[13,28,14,28],[13,29,14,29],[9,1,10,5],[11,1,13,1],[11,5,13,5],[14,1,14,5],[11,15,13,15],[11,24,14,24],[11,25,14,26],[9,24,10,30],[13,30,14,30],[9,15,10,21],[11,27,12,30],[0,30,0,43],[1,25,1,27],[1,31,1,33],[1,37,1,38],[31,25,31,26],[15,25,15,26],[16,25,16,26],[17,25,17,26],[18,25,18,26],[26,27,27,30],[28,27,29,27],[26,25,29,26],[19,24,19,30],[20,24,20,30],[26,24,29,24],[30,25,30,26],[28,28,29,28],[28,29,29,29],[24,24,25,30],[0,15,0,28],[1,16,1,18],[1,22,1,23]]}
["Legend"]
[]
[]
["This sheet contains all the relevant tables required for prediction of crashes at urban and suburban intersections. Please do not delete this worksheet. "]
[]
[]
[]
[null,"Tables Affiliated with SPF Computation:",null,null,null,null,null,null,null,null,null,null,null,null,null,null,null,null,null,null,null,null,null,null,"Tables Affiliated with Crash Modification Factors:"]
[]
[null,"Table 12-10: SPF Coefficients for Multiple-Vehicle Collisions at Intersections",null,null,null,null,null,null,"Table 12-12: SPF Coefficients for Single-Vehicle Crashes at Intersections",null,null,null,null,null,null,"Table 12-14: SPF for Vehicle-Pedestrian Collisions at Signalized Intersections",null,null,null,null,null,null,null,null,"Table 12-24: Crash Modification Factor (CMF1i) for Installation of Left-Turn Lanes on Intersection Approaches"]
[]
[null,"Intersection type","Coefficients use in Eqn. 12-21",null,null,"Overdispersion    parameter     (k)",null,null,"Intersection type","Coefficients use in Eqn. 12-24",null,null,"Overdispersion    parameter     (k)",null,null,"Intersection type","Coefficients use in Eqn. 12-29",null,null,null,null,"Overdispersion    parameter     (k)",null,null,"Intersection Type","Intersection traffic control",null,"Number of approaches with left-turn lanes a"]
[null,null,"Intercept","AADTmaj","AADTmin",null,null,null,null,"Intercept","AADTmaj","AADTmin",null,null,null,null,"Intercept","AADTtot","AADTmin/AADTmaj","PedVol","nlanesx"]
[null,null,"(a)","(b)","(c)",null,null,null,null,"(a)","(b)","(c)",null,null,null,null,"(a)","(b)","(c)","(d)","(e)",null,null,null,null,null,null," One  approach","Two approaches","Three approaches","Four approaches"]
[null,"Total crashes",null,null,null,null,null,null,"Total crashes",null,null,null,null,null,null,"Total crashes"]
[null,"3ST",-13.36,1.1100000000000001,0.41,0.8,null,null,"3ST",-6.81,0.16,0.51,1.1399999999999999,null,null,"3SG",-6.6,0.05,0.24,0.41,0.09,0.52,null,null,"3ST","Minor-road STOP controlb",null,0.67,0.45,"--","--"]
[null,"3SG",-12.13,1.1100000000000001,0.26,0.33,null,null,"3SG",-9.02,0.42,0.4,0.36,null,null,"4SG",-9.5299999999999994,0.4,0.26,0.45,0.04,0.24,null,null,"3SG","Traffic signal",null,0.93,0.86,0.8]
[null,"4ST",-8.9,0.82,0.25,0.4,null,null,"4ST",-5.33,0.33,0.12,0.65,null,null,null,null,null,null,null,null,null,null,null,"4ST","Minor-road STOP controla",null,0.73,0.53,"--","--"]
[null,"4SG",-10.99,1.07,0.23,0.39,null,null,"4SG",-10.210000000000001,0.68,0.27,0.36,null,null,null,null,null,null,null,null,null,null,null,"4SG","Traffic signal",null,0.9,0.81,0.73,0.66]
[null,"Fatal-and-injury crashes",null,null,null,null,null,null,"Fatal-and-injury crashes",null,null,null,null,null,null,null,null,null,null,null,null,null,null,null,"a STOP-controlled approaches are not considered in determining the number of approaches with left-turn lanes."]
{"$rows_left_out":118}
{"sheet":"Calibration Factors","index":6,"n_rows":8,"n_cols":7,"rows_kept":8,"cut":false,"hidden":true,"merged":[[3,2,4,6]]}
[]
[]
[]
[null,null,"Calibration Factors"]
[]
[null,null,null,"3SG","3ST","4SG","4ST"]
[null,null,"HSM Method",1.5,0.77,1.49,1.03]
[null,null,"MassDOT Method",0.95,1.1299999999999999,1,1.04]

{"sheet":"Construction - do not delete","index":7,"n_rows":188,"n_cols":32,"rows_kept":188,"cut":false,"hidden":true,"merged":[[107,0,108,0],[107,4,107,14],[107,1,108,3],[99,27,99,31],[101,27,101,31],[103,21,103,25],[103,27,103,31],[81,21,81,25],[83,21,83,25],[87,21,87,25],[82,27,82,31],[83,27,83,31],[85,27,85,31],[82,21,82,25],[93,21,93,25],[95,21,95,25],[106,0,106,14],[81,27,81,31],[97,21,97,25],[99,21,99,25],[101,21,101,25],[89,27,89,31],[91,27,91,31],[93,27,93,31],[95,27,95,31],[97,27,97,31],[85,21,85,25],[89,21,89,25],[91,21,91,25],[87,27,87,31],[178,0,178,6],[166,0,166,6],[142,0,142,6],[154,0,154,6],[119,0,119,3],[120,1,120,3],[121,1,121,3],[122,1,122,3],[0,0,0,17],[1,0,1,17],[123,1,123,3],[128,1,128,3],[127,1,127,3],[124,1,124,3],[125,1,125,3],[126,1,126,3],[113,1,113,3],[114,1,114,3],[115,1,115,3],[112,1,112,3],[116,1,116,3],[110,1,110,3],[111,1,111,3],[109,1,109,3]]}
["NOTICE!"]
["This sheet is present to ensure the proper functioning of the excel workbook. Please do not tamper with or delete this worksheet. Doing so, would result in improper functioning of the workbook."]
[]
[null,"Lane Width",null,"Shoulder Width",null,"RHR"]
[null,9,null,0,null,1]
[null,9.5,null,1,null,2]
[null,10,null,2,null,3]
[null,10.5,null,3,null,4]
[null,11,null,4,null,5]
[null,11.5,null,5,null,6]
[null,12,null,6,null,7]
[null,null,null,7]
[null,null,null,8]
[]
[]
[null,null,null,null,null,null,null,"Centerline",null,"Passing",null,"Local"]
[null,null,null,"Shoulder Type",null,"Spiral",null,"Rumble Strips",null,"Lane",null,"Yes"]
[null,null,null,"Paved",null,"Not Present",null,"Not Present",null,"Not Present",null,"No"]
[null,null,null,"Gravel",null,"Present",null,"Present",null,"Present (1 lane)"]
[null,null,null,"Composite",null,null,null,null,null,"Present (2 lanes)"]
{"$rows_left_out":168}