{"text_format":"1","workbook":"xlsx","n_sheets":5,"sheets":["Front Page","Roster","System Data","Reporting Dates","Facilities"],"not_rendered":{"charts":0,"images":0,"macros":1,"external_links":0,"defined_names":6,"comments":0,"pivot_tables":0},"unopened":[],"bounds":{"document_bytes":16777216,"sheet_cells":100000,"rows_first":2000,"rows_last":500,"rows_between":2000,"halvings":0,"cell_chars":16384,"cell_head_chars":4096},"cells_cut":0,"cells_raw":0,"read":"whole","date_system":"1900"}

{"sheet":"Front Page","index":0,"n_rows":27,"n_cols":4,"rows_kept":27,"cut":false,"hidden":false,"merged":[[23,2,23,3],[24,2,24,3],[25,2,25,3],[26,2,26,3],[2,1,2,2],[20,2,20,3],[21,2,21,3],[22,2,22,3],[0,0,0,2],[10,1,10,3],[17,2,17,3],[18,2,18,3],[19,2,19,3],[11,2,11,3],[12,2,12,3],[13,2,13,3],[14,2,14,3],[15,2,15,3],[16,2,16,3]]}
["Facility Roster Submission"]
[]
[null,"Table A.1: Submission Information"]
[null,"Contact Name:",null,{"$f":"IF(C4=\"\", \"Contact Information Must be Entered\", \"\")","v":"Contact Information Must be Entered"}]
[null,"Contact Email:",null,{"$f":"IF(C5=\"\", \"Contact Information Must be Entered\", \"\")","v":"Contact Information Must be Entered"}]
[null,"Facility Name:",null,{"$f":"IF(C6=\"\", \"Please Select Facility from Dropdown Menu\", \"\")","v":"Please Select Facility from Dropdown Menu"}]
[null,"DPH ID:",{"$f":"IFERROR(VLOOKUP(C6,Facilities!A:B,2,FALSE), \"\")","v":""}]
[null,"Reporting Range:","03/01/2021 - 03/31/2021",{"$f":"IF(C8=\"\", \"Please Select Reporting Period from Dropdown Menu\", \"\")","v":""}]
[null,"Reporting Deadline:",{"$f":"IFERROR(VLOOKUP(C8, 'Reporting Dates'!A:E, 5,FALSE), \"\")","v":"2021-04-14"}]
[]
[null,"Table A.2: Roster Information"]
[null,"Column","Instructions"]
[null,"FIRST_NAME","Enter the individual's first name"]
[null,"MIDDLE_NAME","Enter the individual's middle name (if applicable)"]
[null,"LAST_NAME","Enter the individual's last name"]
[null,"GENDER","Enter 0 if the individual's gender is Female, 1 if Male, 2 if Transgender, and 3 if Unknown"]
[null,"DOB_DAY","Enter the day of the individual's Date of Birth"]
[null,"DOB_MONTH","Enter the month as a number of the individual's Date of Birth"]
[null,"DOB_YEAR","Enter the four digit year of the individual's Date of Birth "]
[null,"CATEGORY","The role of the individual at the facility; enter 1 for Resident, 2 for Staff, 3 for Contractor"]
[null,"STREET_NUMBER","The number of the individual's address"]
[null,"STREET_NAME","The street of the individual's address"]
[null,"STREET_TYPE","The suffix of the individual's address (St, Ave, Rd, etc.)"]
[null,"UNIT","The unit number of the individual's address, if applicable"]
[null,"CITY","The city or town of residence of the individual"]
[null,"STATE","The two letter state code (ex. MA)"]
[null,"ZIP","5 digit ZIP Code"]

{"sheet":"Roster","index":1,"n_rows":2047,"n_cols":16,"rows_kept":2047,"cut":false,"hidden":false,"merged":[]}
["FIRST_NAME","MIDDLE_NAME","LAST_NAME","GENDER","DOB_DAY","DOB_MONTH","DOB_YEAR","CATEGORY","STREET_NUMBER","STREET_NAME","STREET_TYPE","UNIT","CITY","STATE","ZIP","Review"]
[null,null,null,null,null,null,null,null,null,null,null,null,null,"MA",null,{"$f":"IF(AND(A2=\"\", B2=\"\", C2= \"\",D2=\"\", E2=\"\", F2=\"\", G2=\"\", H2=\"\", I2=\"\", J2=\"\", K2 = \"\", L2= \"\", M2 = \"\", N2 = \"\", O2 = \"\"), \"\", IF(AND(D2<>0,D2<>1, D2<>2, D2<>3), \"ERROR: Gender must be entered as 0 for Female, 1 for Male, 2 for Transgender, and 3 for Unknown\", IF(OR(E2<1, E2>31), \"ERROR: Please enter a valid date for DOB\", IF(AND(F2<>1, F2<>2, F2<>3, F2<>4, F2<>5, F2<>6, F2<>7, F2<>8, F2<>9, F2<>10, F2<>11, F2<>12), \"ERROR: Month must be entered as a number\", IF(G2<1890, \"ERROR: Please enter year in 4 digit format\", IF(AND(H2 <> 1, H2 <> 2, H2 <>3), \"ERROR: Enter category as a number, refer to codes on Front Page Table A.2\", IF(LEN(N2) <> 2, \"ERROR: Enter State as 2 letter State Code\", \"\")))))))","v":"ERROR: Please enter a valid date for DOB"}]
[null,null,null,null,null,null,null,null,null,null,null,null,null,null,null,{"$f":"IF(AND(A3=\"\", B3=\"\", C3= \"\",D3=\"\", E3=\"\", F3=\"\", G3=\"\", H3=\"\", I3=\"\", J3=\"\", K3 = \"\", L3= \"\", M3 = \"\", N3 = \"\", O3 = \"\"), \"\", IF(AND(D3<>0,D3<>1), \"ERROR: Sex must be entered as 1 for Male, 0 for Female\", IF(OR(E3<1, E3>31), \"ERROR: Please enter a valid date for DOB\", IF(AND(F3<>1, F3<>2, F3<>3, F3<>4, F3<>5, F3<>6, F3<>7, F3<>8, F3<>9, F3<>10, F3<>11, F3<>12), \"ERROR: Month must be entered as a number\", IF(G3<1890, \"ERROR: Please enter year in 4 digit format\", IF(AND(H3 <> 1, H3 <> 2, H3 <>3), \"ERROR: Enter category as a number, refer to codes on Front Page Table A.2\", IF(LEN(N3) <> 2, \"ERROR: Enter State as 2 letter State Code\", \"\")))))))","v":""}]
[null,null,null,null,null,null,null,null,null,null,null,null,null,null,null,""]
[null,null,null,null,null,null,null,null,null,null,null,null,null,null,null,""]
[null,null,null,null,null,null,null,null,null,null,null,null,null,null,null,""]
[null,null,null,null,null,null,null,null,null,null,null,null,null,null,null,""]
[null,null,null,null,null,null,null,null,null,null,null,null,null,null,null,""]
[null,null,null,null,null,null,null,null,null,null,null,null,null,null,null,""]
[null,null,null,null,null,null,null,null,null,null,null,null,null,null,null,""]
[null,null,null,null,null,null,null,null,null,null,null,null,null,null,null,""]
[null,null,null,null,null,null,null,null,null,null,null,null,null,null,null,""]
[null,null,null,null,null,null,null,null,null,null,null,null,null,null,null,""]
[null,null,null,null,null,null,null,null,null,null,null,null,null,null,null,""]
[null,null,null,null,null,null,null,null,null,null,null,null,null,null,null,""]
[null,null,null,null,null,null,null,null,null,null,null,null,null,null,null,""]
[null,null,null,null,null,null,null,null,null,null,null,null,null,null,null,""]
[null,null,null,null,null,null,null,null,null,null,null,null,null,null,null,""]
[null,null,null,null,null,null,null,null,null,null,null,null,null,null,null,""]
[null,null,null,null,null,null,null,null,null,null,null,null,null,null,null,""]
[null,null,null,null,null,null,null,null,null,null,null,null,null,null,null,""]
[null,null,null,null,null,null,null,null,null,null,null,null,null,null,null,""]
[null,null,null,null,null,null,null,null,null,null,null,null,null,null,null,""]
[null,null,null,null,null,null,null,null,null,null,null,null,null,null,null,""]
[null,null,null,null,null,null,null,null,null,null,null,null,null,null,null,""]
[null,null,null,null,null,null,null,null,null,null,null,null,null,null,null,""]
[null,null,null,null,null,null,null,null,null,null,null,null,null,null,null,""]
[null,null,null,null,null,null,null,null,null,null,null,null,null,null,null,""]
[null,null,null,null,null,null,null,null,null,null,null,null,null,null,null,""]
[null,null,null,null,null,null,null,null,null,null,null,null,null,null,null,""]
[null,null,null,null,null,null,null,null,null,null,null,null,null,null,null,""]
[null,null,null,null,null,null,null,null,null,null,null,null,null,null,null,""]
[null,null,null,null,null,null,null,null,null,null,null,null,null,null,null,""]
[null,null,null,null,null,null,null,null,null,null,null,null,null,null,null,""]
[null,null,null,null,null,null,null,null,null,null,null,null,null,null,null,""]
[null,null,null,null,null,null,null,null,null,null,null,null,null,null,null,""]
[null,null,null,null,null,null,null,null,null,null,null,null,null,null,null,""]
[null,null,null,null,null,null,null,null,null,null,null,null,null,null,null,""]
[null,null,null,null,null,null,null,null,null,null,null,null,null,null,null,""]
[null,null,null,null,null,null,null,null,null,null,null,null,null,null,null,""]
[null,null,null,null,null,null,null,null,null,null,null,null,null,null,null,""]
[null,null,null,null,null,null,null,null,null,null,null,null,null,null,null,""]
[null,null,null,null,null,null,null,null,null,null,null,null,null,null,null,""]
[null,null,null,null,null,null,null,null,null,null,null,null,null,null,null,""]
[null,null,null,null,null,null,null,null,null,null,null,null,null,null,null,""]
[null,null,null,null,null,null,null,null,null,null,null,null,null,null,null,""]
[null,null,null,null,null,null,null,null,null,null,null,null,null,null,null,""]
[null,null,null,null,null,null,null,null,null,null,null,null,null,null,null,""]
[null,null,null,null,null,null,null,null,null,null,null,null,null,null,null,""]
[null,null,null,null,null,null,null,null,null,null,null,null,null,null,null,""]
[null,null,null,null,null,null,null,null,null,null,null,null,null,null,null,""]
[null,null,null,null,null,null,null,null,null,null,null,null,null,null,null,""]
[null,null,null,null,null,null,null,null,null,null,null,null,null,null,null,""]
[null,null,null,null,null,null,null,null,null,null,null,null,null,null,null,""]
[null,null,null,null,null,null,null,null,null,null,null,null,null,null,null,""]
[null,null,null,null,null,null,null,null,null,null,null,null,null,null,null,""]
[null,null,null,null,null,null,null,null,null,null,null,null,null,null,null,""]
[null,null,null,null,null,null,null,null,null,null,null,null,null,null,null,""]
[null,null,null,null,null,null,null,null,null,null,null,null,null,null,null,""]
[null,null,null,null,null,null,null,null,null,null,null,null,null,null,null,""]
[null,null,null,null,null,null,null,null,null,null,null,null,null,null,null,""]
[null,null,null,null,null,null,null,null,null,null,null,null,null,null,null,""]
[null,null,null,null,null,null,null,null,null,null,null,null,null,null,null,""]
[null,null,null,null,null,null,null,null,null,null,null,null,null,null,null,""]
[null,null,null,null,null,null,null,null,null,null,null,null,null,null,null,""]
[null,null,null,null,null,null,null,null,null,null,null,null,null,null,null,""]
[null,null,null,null,null,null,null,null,null,null,null,null,null,null,null,{"$f":"IF(AND(A67=\"\", B67=\"\", C67= \"\",D67=\"\", E67=\"\", F67=\"\", G67=\"\", H67=\"\", I67=\"\", J67=\"\", K67 = \"\", L67= \"\", M67 = \"\", N67 = \"\", O67 = \"\"), \"\", IF(AND(D67<>0,D67<>1), \"ERROR: Sex must be entered as 1 for Male, 0 for Female\", IF(OR(E67<1, E67>31), \"ERROR: Please enter a valid date for DOB\", IF(AND(F67<>1, F67<>2, F67<>3, F67<>4, F67<>5, F67<>6, F67<>7, F67<>8, F67<>9, F67<>10, F67<>11, F67<>12), \"ERROR: Month must be entered as a number\", IF(G67<1890, \"ERROR: Please enter year in 4 digit format\", IF(AND(H67 <> 1, H67 <> 2, H67 <>3), \"ERROR: Enter category as a number, refer to codes on Front Page Table A.2\", IF(LEN(N67) <> 2, \"ERROR: Enter State as 2 letter State Code\", \"\")))))))","v":""}]
[null,null,null,null,null,null,null,null,null,null,null,null,null,null,null,""]
[null,null,null,null,null,null,null,null,null,null,null,null,null,null,null,""]
[null,null,null,null,null,null,null,null,null,null,null,null,null,null,null,""]
[null,null,null,null,null,null,null,null,null,null,null,null,null,null,null,""]
[null,null,null,null,null,null,null,null,null,null,null,null,null,null,null,""]
[null,null,null,null,null,null,null,null,null,null,null,null,null,null,null,""]
[null,null,null,null,null,null,null,null,null,null,null,null,null,null,null,""]
[null,null,null,null,null,null,null,null,null,null,null,null,null,null,null,""]
[null,null,null,null,null,null,null,null,null,null,null,null,null,null,null,""]
[null,null,null,null,null,null,null,null,null,null,null,null,null,null,null,""]
[null,null,null,null,null,null,null,null,null,null,null,null,null,null,null,""]
[null,null,null,null,null,null,null,null,null,null,null,null,null,null,null,""]
[null,null,null,null,null,null,null,null,null,null,null,null,null,null,null,""]
[null,null,null,null,null,null,null,null,null,null,null,null,null,null,null,""]
[null,null,null,null,null,null,null,null,null,null,null,null,null,null,null,""]
[null,null,null,null,null,null,null,null,null,null,null,null,null,null,null,""]
[null,null,null,null,null,null,null,null,null,null,null,null,null,null,null,""]
[null,null,null,null,null,null,null,null,null,null,null,null,null,null,null,""]
[null,null,null,null,null,null,null,null,null,null,null,null,null,null,null,""]
[null,null,null,null,null,null,null,null,null,null,null,null,null,null,null,""]
[null,null,null,null,null,null,null,null,null,null,null,null,null,null,null,""]
[null,null,null,null,null,null,null,null,null,null,null,null,null,null,null,""]
[null,null,null,null,null,null,null,null,null,null,null,null,null,null,null,""]
[null,null,null,null,null,null,null,null,null,null,null,null,null,null,null,""]
[null,null,null,null,null,null,null,null,null,null,null,null,null,null,null,""]
[null,null,null,null,null,null,null,null,null,null,null,null,null,null,null,""]
[null,null,null,null,null,null,null,null,null,null,null,null,null,null,null,""]
[null,null,null,null,null,null,null,null,null,null,null,null,null,null,null,""]
[null,null,null,null,null,null,null,null,null,null,null,null,null,null,null,""]
[null,null,null,null,null,null,null,null,null,null,null,null,null,null,null,""]
[null,null,null,null,null,null,null,null,null,null,null,null,null,null,null,""]
[null,null,null,null,null,null,null,null,null,null,null,null,null,null,null,""]
[null,null,null,null,null,null,null,null,null,null,null,null,null,null,null,""]
[null,null,null,null,null,null,null,null,null,null,null,null,null,null,null,""]
[null,null,null,null,null,null,null,null,null,null,null,null,null,null,null,""]
[null,null,null,null,null,null,null,null,null,null,null,null,null,null,null,""]
[null,null,null,null,null,null,null,null,null,null,null,null,null,null,null,""]
[null,null,null,null,null,null,null,null,null,null,null,null,null,null,null,""]
[null,null,null,null,null,null,null,null,null,null,null,null,null,null,null,""]
[null,null,null,null,null,null,null,null,null,null,null,null,null,null,null,""]
[null,null,null,null,null,null,null,null,null,null,null,null,null,null,null,""]
[null,null,null,null,null,null,null,null,null,null,null,null,null,null,null,""]
[null,null,null,null,null,null,null,null,null,null,null,null,null,null,null,""]
[null,null,null,null,null,null,null,null,null,null,null,null,null,null,null,""]
[null,null,null,null,null,null,null,null,null,null,null,null,null,null,null,""]
[null,null,null,null,null,null,null,null,null,null,null,null,null,null,null,""]
[null,null,null,null,null,null,null,null,null,null,null,null,null,null,null,""]
[null,null,null,null,null,null,null,null,null,null,null,null,null,null,null,""]
[null,null,null,null,null,null,null,null,null,null,null,null,null,null,null,""]
[null,null,null,null,null,null,null,null,null,null,null,null,null,null,null,""]
[null,null,null,null,null,null,null,null,null,null,null,null,null,null,null,""]
[null,null,null,null,null,null,null,null,null,null,null,null,null,null,null,""]
[null,null,null,null,null,null,null,null,null,null,null,null,null,null,null,""]
{"$rows_left_out":1928}
{"sheet":"System Data","index":2,"n_rows":11,"n_cols":2,"rows_kept":11,"cut":false,"hidden":true,"merged":[]}
[true,"OnSaveFlag"]
[{"$f":"A3&\"_\"&A4&\".xlsm\"","v":"_0.xlsm"},"vFileName"]
[{"$f":"'Front Page'!C7","v":""},"DPHID"]
[{"$f":"'Front Page'!C6","v":0},"FacilityName"]
[]
[{"$f":"IF(AND(A7=TRUE,A8=TRUE, A9=TRUE,A10=TRUE),TRUE,FALSE)","v":false},"cfSubmissionInfoRequiredFields"]
[{"$f":"IF('Front Page'!C4=\"\",FALSE,TRUE)","v":false},"cfContactName"]
[{"$f":"IF('Front Page'!C5=\"\",FALSE,TRUE)","v":false},"cfContactEmail"]
[{"$f":"IF('Front Page'!C6=\"\", FALSE,TRUE)","v":false},"cfFacilityName"]
[{"$f":"IF('Front Page'!C8=\"\", FALSE,TRUE)","v":true},"cfReportingPeriodStartDate"]
[null,"cfReportingPeriodStartDate"]

{"sheet":"Reporting Dates","index":3,"n_rows":23,"n_cols":5,"rows_kept":23,"cut":false,"hidden":false,"merged":[]}
["Range","Start","End","Period","Deadline"]
[{"$f":"CONCATENATE(TEXT(B2, \"mm/dd/yyyy\"), \" - \", TEXT(C2, \"mm/dd/yyyy\"))","v":"03/01/2021 - 03/31/2021"},"2021-03-01","2021-03-31",1,{"$f":"WORKDAY(C2, 10)","v":"2021-04-14"}]
[{"$f":"CONCATENATE(TEXT(B3, \"mm/dd/yyyy\"), \" - \", TEXT(C3, \"mm/dd/yyyy\"))","v":"04/01/2021 - 04/30/2021"},"2021-04-01","2021-04-30",2,"2021-05-14"]
[{"$f":"CONCATENATE(TEXT(B4, \"mm/dd/yyyy\"), \" - \", TEXT(C4, \"mm/dd/yyyy\"))","v":"05/01/2021 - 05/31/2021"},"2021-05-01","2021-05-31",3,"2021-06-14"]
["06/01/2021 - 06/30/2021","2021-06-01","2021-06-30",4,"2021-07-14"]
["07/01/2021 - 07/31/2021","2021-07-01","2021-07-31",5,"2021-08-13"]
["08/01/2021 - 08/31/2021","2021-08-01","2021-08-31",6,"2021-09-14"]
["09/01/2021 - 09/30/2021","2021-09-01","2021-09-30",7,"2021-10-14"]
["10/01/2021 - 10/31/2021","2021-10-01","2021-10-31",8,"2021-11-12"]
["11/01/2021 - 11/30/2021","2021-11-01","2021-11-30",9,"2021-12-14"]
["12/01/2021 - 12/31/2021","2021-12-01","2021-12-31",10,"2022-01-14"]
[{"$f":"CONCATENATE(TEXT(B12, \"mm/dd/yyyy\"), \" - \", TEXT(C12, \"mm/dd/yyyy\"))","v":"01/01/2022 - 01/31/2022"},"2022-01-01","2022-01-31",11,"2022-02-14"]
["02/01/2022 - 02/28/2022","2022-02-01","2022-02-28",12,"2022-03-14"]
["03/01/2022 - 03/31/2022","2022-03-01","2022-03-31",13,"2022-04-14"]
["04/01/2022 - 04/30/2022","2022-04-01","2022-04-30",14,"2022-05-13"]
["05/01/2022 - 05/31/2022","2022-05-01","2022-05-31",15,"2022-06-14"]
["06/01/2022 - 06/30/2022","2022-06-01","2022-06-30",16,"2022-07-14"]
["07/01/2022 - 07/31/2022","2022-07-01","2022-07-31",17,"2022-08-12"]
["08/01/2022 - 08/31/2022","2022-08-01","2022-08-31",18,"2022-09-14"]
["09/01/2022 - 09/30/2022","2022-09-01","2022-09-30",19,"2022-10-14"]
["10/01/2022 - 10/31/2022","2022-10-01","2022-10-31",20,"2022-11-14"]
["11/01/2022 - 11/30/2022","2022-11-01","2022-11-30",21,"2022-12-14"]
[{"$f":"CONCATENATE(TEXT(B23, \"mm/dd/yyyy\"), \" - \", TEXT(C23, \"mm/dd/yyyy\"))","v":"12/01/2022 - 12/31/2022"},"2022-12-01","2022-12-31",22,"2023-01-13"]

{"sheet":"Facilities","index":4,"n_rows":447,"n_cols":2,"rows_kept":447,"cut":false,"hidden":true,"merged":[]}
["Facility Name_Publication","DPHFacilityID"]
["16 ACRES HEALTHCARE CENTER","0899"]
["ABERJONA NURSING CENTER INC","0848"]
["ACADEMY MANOR","0247"]
["ADVINIA CARE AT PROVINCETOWN","0849"]
["ADVINIA CARE AT WILMINGTON","0947"]
["ADVOCATE HEALTHCARE OF EAST BOSTON LLC","0479"]
["AGAWAM HEALTHCARE","0967"]
["ALDEN COURT NURSING CARE & REHABILITATION CENTER","0912"]
["ALLIANCE HEALTH AT ABBOTT","0320"]
["ALLIANCE HEALTH AT BALDWINVILLE","0843"]
["ALLIANCE HEALTH AT BRAINTREE","0445"]
["ALLIANCE HEALTH AT DEVEREUX","0290"]
["ALLIANCE HEALTH AT MARIE ESTHER","0960"]
["ALLIANCE HEALTH AT MARINA BAY","0542"]
["ALLIANCE HEALTH AT ROSEWOOD","0975"]
["ALLIANCE HEALTH AT WEST ACRES","0587"]
["ANN'S REST HOME","1025"]
["APPLE VALLEY CENTER","0915"]
["APPLEWOOD-A HOME FOR ELDERS","1427"]
["ARMENIAN NURSING & REHABILITATION CENTER","0454"]
["ARNOLD HOUSE INC","0311"]
["ATTLEBORO HEALTHCARE","0789"]
["BAKER-KATZ SKILLED NURSING AND REHABILITATION CTR","0271"]
["BAYPATH AT DUXBURY NURSING & REHABILITATION CTR","0867"]
["BAYPOINTE REHAB CENTER","0E4B"]
["BEAR HILL HEALTHCARE AND REHABILITATION CENTER","0861"]
["BEAR MOUNTAIN AT ANDOVER","0937"]
["BEAR MOUNTAIN AT READING","0892"]
["BEAR MOUNTAIN AT SUDBURY","0FE3"]
["BEAR MOUNTAIN AT WEST SPRINGFIELD","0068"]
["BEAR MOUNTAIN AT WORCESTER","0723"]
["BEAUMONT AT UNIVERSITY CAMPUS","0954"]
["BEAUMONT REHAB & SKILLED NURSING CTR - NATICK","037H"]
["BEAUMONT REHAB & SKILLED NURSING CTR - NORTHBORO","0100"]
["BEAUMONT REHAB & SKILLED NURSING CTR - NORTHBRIDGE","0160"]
["BEAUMONT REHAB & SKILLED NURSING CTR - WESTBORO","0865"]
["BEAVEN KELLY HOME","1105"]
["BELMONT MANOR NURSING HOME IN","0208"]
["BELVIDERE HEALTHCARE CENTER","0846"]
["BENCHMARK SNR LIVING AT THE COMMONS IN LINCOLN SNF","0UPQ"]
["BENJAMIN HEALTHCARE CENTER","0785"]
["BERKELEY RETIREMENT HOMETHE","0802"]
["BERKSHIRE PLACE","0742"]
["BERKSHIRE REHABILITATION & SKILLED CARE CENTER","0020"]
["BETHANY SKILLED NURSING FACILITY","0928"]
["BLAIRE HOUSE OF MILFORD","0156"]
["BLAIRE HOUSE OF TEWKSBURY","0808"]
["BLAIRE HOUSE OF WORCESTER","0134"]
["BLUE HILLS HEALTH AND REHABILITATION CENTER","0592"]
["BLUEBERRY HILL REHABILITATION AND HEALTHCARE CTR","0279"]
["BOSTON HOME INC (THE)","0463"]
["BOSTONIAN NURSING CARE & REHABILITATION CTR THE","0794"]
["BOURNE MANOR EXTENDED CARE FACILITY","0903"]
["BRAINTREE MANOR HEALTHCARE","0710"]
["BRANDON WOODS OF DARTMOUTH","0728"]
["BRANDON WOODS OF NEW BEDFORD","0656"]
["BRENTWOOD REHABILITATION AND HEALTHCARE CTR (THE)","0781"]
["BRIARWOOD REHABILITATION & HEALTHCARE CENTER","0784"]
["BRIDGEWATER NURSING HOME","0574"]
["BRIGHAM HEALTH AND REHABILITATION CENTER","0275"]
["BRIGHTON HOUSE REHABILITATION & NURSING CENTER","02YF"]
["BROCKTON HEALTH CENTER","0695"]
["BROOK HAVEN ASSISTED LIVING LLC","1247"]
["BROOKHAVEN AT LEXINGTON","0913"]
["BROOKHOUSE HOME FOR AGED WOMEN IN S","1210"]
["BROOKSIDE REHABILITATION AND HEALTHCARE CENTER","0141"]
["BRUSH HILL CARE CENTER","0859"]
["BUCKLEY-GREENFIELD HEALTHCARE CENTER","0866"]
["BURGOYNE REST HOME","1027"]
["CALDWELL HOME - EXTENDED CARE","1369"]
["CAMBRIDGE REHABILITATION & NURSING CENTER","0233"]
["CAMPION HEALTH & WELLNESS INC","0833"]
["CAPE HERITAGE REHABILITATION & HEALTH CARE CENTER","0890"]
["CAPE REGENCY REHABILITATION & HEALTH CARE CENTER","0858"]
["CAPE WINDS REST HOME OF HYANNIS","1422"]
["CAPE WINDS REST HOME OF SANDWICH","1336"]
["CARDIGAN NURSING & REHABILITATION CENTER","0440"]
["CARE ONE AT BROOKLINE","0696"]
["CARE ONE AT CONCORD","0983"]
["CARE ONE AT ESSEX PARK","0280"]
["CARE ONE AT HOLYOKE","0816"]
["CARE ONE AT LEXINGTON","0204"]
["CARE ONE AT LOWELL","0754"]
["CARE ONE AT MILLBURY","01WF"]
["CARE ONE AT NEW BEDFORD","0973"]
["CARE ONE AT NEWTON","0736"]
["CARE ONE AT NORTHAMPTON","0818"]
["CARE ONE AT PEABODY","0900"]
["CARE ONE AT RANDOLPH","0901"]
["CARE ONE AT REDSTONE","0886"]
["CARE ONE AT WEYMOUTH","0965"]
["CARE ONE AT WILMINGTON","0911"]
["CARLETON-WILLARD VILLAGE RETIREMENT & NURSING CTR","0860"]
["CARLYLE HOUSE","0778"]
["CARVALHO GROVE HEALTH AND REHABILITATION CENTER","0716"]
["CASA DE RAMANA REHABILITATION CENTER","0698"]
["CATHOLIC MEMORIAL HOME","0627"]
["CEDAR VIEW REHABILITATION AND HEALTHCARE CENTER","0261"]
["CEDARWOOD GARDENS","0148"]
["CENTER FOR EXTENDED CARE AT AMHERST","0024"]
["CHAPIN CENTER","0737"]
["CHARLENE MANOR EXTENDED CARE FACILITY","0894"]
["CHARLTON MANOR REST HOME","1059"]
["CHESTNUT HILL OF EAST LONGMEADOW","0879"]
["CHESTNUT WOODS REHABILITATION AND HEALTHCARE CTR","0719"]
["CHETWYNDE HEALTHCARE","0389"]
["CHICOPEE REHABILITATION AND NURSING CENTER","0044"]
["CHILTON HOUSE REST HOME (THE)","1198"]
["CHRISTOPHER HOUSE OF WORCESTER","0693"]
["CLIFTON REHABILITATION NURSING CENTER","0854"]
["COLEMAN HOUSE","0098"]
["COLONY CENTER FOR HEALTH & REHABILITATION","0572"]
["COMMONS RESIDENCE AT ORCHARD COVE","0974"]
["CONTINUING CARE AT BROOKSBY VILLAGE","0KEK"]
["COPLEY AT STOUGHTON - BAYSTATE CONSOLIDATED PROPER","0977"]
["COUNTRY CENTER FOR HEALTH & REHABILITATION","0703"]
["COUNTRY GARDENS HEALTH AND REHABILITATION CENTER","0706"]
["COUNTRYSIDE HEALTH CARE OF MILFORD","0688"]
["COURTYARD NURSING CARE CENTER","0933"]
{"$rows_left_out":327}