Name,AQID#,Next SR Submittal (for YOR),SR/GHG Due Date in 2024,CONTACT MASSDEP,Required eDEP Submittal Type,Last SR Submittal (for YOR),MassDEP Region,Site Account No,YOR,Reporting Frequency,GHG Reporter,GHGREQ End Date,Current Class,Address1,Address2,Town,State,Zip,Current Mail_Address1,Current Mail_Address2,Current Mail_Town,Current Mail_State,Current Mail_Zip,AQ Emission Contact FName,AQ Emission Contact LName
100 SIMPLEX LLC,1180619,2023,01-Apr-24,Call,AQ Source Registration Package (SR),2005,CE,132466,2023,Triennial-2023,,,NM25,100 SIMPLEX DR,,WESTMINSTER,MA,014730000,,,,,,RENEE,DUVAL
102ND INTELLIGENCE WING,1200055,2024,,,,2021,SE,54228,2024,Triennial-2024,,,SM50,158 REILLY ST,,OTIS ANGB,MA,025420000,158 REILLY ST,,OTIS ANGB,MA,025420000,THURMAN,DEANE
1200 CROWN COLONY,1193314,2023,01-Apr-24,,AQ Source Registration Package (SR),2020,NE,467805,2023,Triennial-2023,,,SM25,1200 CROWN COLONY DR,,QUINCY,MA,021690000,,,,,,BRANDON,BINSFIELD
185 FRANKLIN STREET CONDOMINIUM CORPORAT,1193842,2023,01-Apr-24,,AQ Source Registration Package (SR),2020,NE,574459,2023,Triennial-2023,,,SM25,185 FRANKLIN ST,,BOSTON,MA,021100000,50 POST OFFICE SQ,C/O JLL,BOSTON,MA,021100000,JENNIFER,GUBER
200 BERKELEY ST,1190129,2023,01-Apr-24,,AQ Source Registration Package (SR),2020,NE,2461,2023,Triennial-2023,,,NM99,200 BERKELEY ST,,BOSTON,MA,021170000,197 CLARENDON STREET,,BOSTON,MA,021160000,WAYNE,TALBOT
2001 WASHINGTON ST LLC,1190081,2023,03-Jun-24,,AQ Source Registration Package (SR),2022,SE,375876,2023,Annual-RES,,,SM79-R,2001 WASHINGTON ST,,BRAINTREE,MA,021840000,2001 WASHINGTON ST,,BRAINTREE,MA,021840000,BRAD,WRIGHT
230 CITY POINT,1193859,2023,01-Apr-24,,AQ Source Registration Package (SR),2020,NE,578859,2023,Triennial-2023,,,NM25,230 THIRD AVE,,WALTHAM,MA,024510000,230 THIRD AVE,,WALTHAM,MA,024510000,DANIEL,DOYLE
365 DATACENTERS,1190984,2023,03-Jun-24,,AQ Source Registration Package (SR),2022,CE,397167,2023,Annual-RES,,,SM79-R,250 LOCKE DR,,MARLBOROUGH,MA,017520000,250 LOCKE DR,,MARLBOROUGH,MA,017520000,MICHAEL,GRASSMICK
380 UNION LLC,0420762,2025,,,,2022,WE,50602,2025,Triennial-2025,,,SM50,380 UNION ST,,WEST SPRINGFIELD,MA,010890000,380 UNION ST,SUITE 108,WEST SPRINGFIELD,MA,010890000,MARIA,NADEAU
3M CHELMSFORD,1210145,2023,01-Apr-24,,SR and Greenhouse Gas (GHG),2020,NE,2531,2023,Triennial-2023 & Annual-GHG,GHGREQ,,NM25,279 BILLERICA RD,,CHELMSFORD,MA,018240000,279 BILLERICA RD,,CHELMSFORD,MA,018240000,TRAVIS,BRENNER
3M COMPANY,1192436,2025,01-Apr-24,,Greenhouse Gas Package(GHG),2022,SE,130325,2023,Triennial-2025 & Annual-GHG,GHGREQ,,SM80-7,30 COMMERCE RD,,ROCKLAND,MA,023700000,,,,,,PETER,MASTERSON
446 MAIN STREET,1180680,2023,01-Apr-24,,AQ Source Registration Package (SR),2020,CE,51459,2023,Triennial-2023,,,NM50,446 MAIN ST,,WORCESTER,MA,016080000,,,,,,CHRISTOPHER,RICE
5 SLATER LLC,1180533,2024,,,,2021,CE,51355,2024,Triennial-2024,,,SM25,340 MAIN ST,RM 366,WORCESTER,MA,016080000,340 MAIN STREET,SUITE 302,WORCESTER,MA,016080000,WILL,HAVER
620 SPRING ST LLC,1200013,2023,01-Apr-24,,AQ Source Registration Package (SR),2020,SE,396611,2023,Triennial-2023,,,NM25,620 SPRING ST,,DIGHTON,MA,027150000,620 SPRING STREET LLC,103 CLAYTON STREET,DORCHESTER,MA,021220000,MICHAEL,SHEEHAN
6K INC,1210870,2023,01-Apr-24,,AQ Source Registration Package (SR),,NE,579212,2023,Triennial-2023,,,SM25,25 COMMERCE WAY,STE 1,NORTH ANDOVER,MA,018450000,,,,,,,
700 MAIN STREET LEASEHOLD LLC,1191865,2024,,,,2021,NE,387975,2024,Triennial-2024,,,NM99,700 MAIN ST,,CAMBRIDGE,MA,021390000,116  HUNTINGTON AVE,C/O BULFINCH PROPERTY MANAGEMENT LLC,BOSTON,MA,021160000,JONATHAN,MARENO
75 LINDALL STREET LLC,1190654,2023,01-Apr-24,Call,AQ Source Registration Package (SR),2010,NE,52442,2023,Triennial-2023,,,SM50,75 LINDALL ST,,DANVERS,MA,019230000,2701 RENAISSANCE BLVD,4TH FL,KING OF PRUSSIA,PA,194060000,STEPHEN,HENDRY
77 LEICESTER STREET LLC,1181394,2024,,,,2021,CE,512394,2024,Triennial-2024,,,SM25,10 STERLING WAY,,NORTH OXFORD,MA,015370000,STERLING CONCRETE CORP,PO BOX 786,NORTH OXFORD,MA,015370000,KAREN,OLSON
99 HAYDEN LLC,1191598,2024,,,,2021,NE,130974,2024,Triennial-2024,,,NM25,99 HAYDEN AVE,FMR 128 SPRING ST,LEXINGTON,MA,021730000,99 HAYDEN AVE,,LEXINGTON,MA,021730000,DAVID,BOWEN
99 HIGH STREET,1193520,2023,01-Apr-24,,AQ Source Registration Package (SR),2020,NE,522623,2023,Triennial-2023,,,NM25,99 HIGH ST,,BOSTON,MA,021100000,99 HIGH ST,CUSHMAN AND WAKEFIELD,BOSTON,MA,021100000,STEPHEN,SLOCOMB
ABBVIE BIORESEARCH CENTER INC,1180186,2025,01-Apr-24,,Greenhouse Gas Package(GHG),2022,CE,344828,2023,Triennial-2025 & Annual-GHG,GHGREQ,,SM50,100 RESEARCH DR,,WORCESTER,MA,016050000,100 RESEARCH DRIVE,,WORCESTER,MA,016050000,KENNY,HARTUNG
ABIOMED,1190950,2024,,,,2021,NE,365895,2024,Triennial-2024,,,NM25,22 CHERRY HILL DR,,DANVERS,MA,019230000,22 CHERRY HILL DRIVE,,DANVERS,MA,019230000,CAITLIN,MORENO
ACADEMY AVE SCHOOL,1191040,2024,,,,2021,SE,221376,2024,Triennial-2024,,,NM25,94 ACADEMY AVE,,WEYMOUTH,MA,021890000,89 MIDDLE ST.,,WEYMOUTH,MA,021890000,MICHAEL,MANNING
ACTON METAL PROCESS,1190321,2023,01-Apr-24,,AQ Source Registration Package (SR),2020,NE,131800,2023,Triennial-2023,,,NM50,41 ATHLETIC FIELD RD,,WALTHAM,MA,024510000,PO BOX 540671,,WALTHAM,MA,024540000,TODD,WALSH
ACTON REFINISHING COMPANY,1194003,2023,01-Apr-24,,AQ Source Registration Package (SR),2020,CE,177050,2023,Triennial-2023,,,NM25,63 HARRIS ST,,ACTON,MA,017200000,63 HARRIS ST,,ACTON,MA,017200000,MICHAEL,WHALEN
ACUSHNET CO,1200015,2024,,,,2021,SE,54197,2024,Triennial-2024,,,NM25,333 BRIDGE ST,,FAIRHAVEN,MA,027190000,PO BOX 965,,FAIRHAVEN,MA,027190000,ERIC,LASTOWKA
ACUSHNET COMPANY,1200875,2024,,,,2021,SE,38027,2024,Triennial-2024,,,SM79-7,700 BELLEVILLE AVE,,NEW BEDFORD,MA,027400000,PO BOX 965,,FAIRHAVEN,MA,027190000,ERIC,LASTOWKA
ACUSHNET COMPANY - BALL PLANT III,1200619,2024,01-Apr-24,,Greenhouse Gas Package(GHG),2021,SE,314531,2023,Triennial-2024 & Annual-GHG,GHGREQ,,SM80-7,215 DUCHAINE BLVD,,NEW BEDFORD,MA,027450000,PO BOX 965,,FAIRHAVEN,MA,027190000,DANIEL,KIRICHOK
ACUSHNET COMPANY PLANT #2,1200254,2024,01-Apr-24,,Greenhouse Gas Package(GHG),2021,SE,130016,2023,Triennial-2024 & Annual-GHG,GHGREQ,,SM80-7,256 SAMUEL BARNETT BLVD,,DARTMOUTH,MA,027140000,PO BOX 965,,FAIRHAVEN,MA,027190000,ERIC,LASTOWKA
ADAMS ROAD ASPHALT PLANT,1181558,2023,01-Apr-24,,AQ Source Registration Package (SR),,CE,616360,2023,Triennial-2023,,,SM50,1 ADAMS RD,,EAST BROOKFIELD,MA,015150000,,,,,,,
ADDISON GILBERT HOSPITAL,1191068,2023,01-Apr-24,,AQ Source Registration Package (SR),2020,NE,130734,2023,Triennial-2023,,,SM25,298 WASHINGTON ST,,GLOUCESTER,MA,019300000,ADDISON GILBERT HOSPITAL,298 WASHINGTON ST,GLOUCESTER,MA,019300000,PETER,GIRARD
ADESA AUCTION OF BOSTON,1190427,2023,01-Apr-24,,AQ Source Registration Package (SR),2020,NE,52220,2023,Triennial-2023,,,SM50,63 WESTERN AVE,,FRAMINGHAM,MA,017010000,63 WESTERN AVE,,FRAMINGHAM,MA,017010000,JACK,NESHE
ADHESIVE APPLICATIONS INC,0420558,2023,03-Jun-24,,AQ Source Registration Package (SR),2022,WE,25961,2023,Annual-APC,,,SM80-7,41 ONEILL ST,,EASTHAMPTON,MA,010270000,,,,,,MIKE,BAILEY
ADOLF JANDRIS & SONS,1180413,2023,01-Apr-24,,AQ Source Registration Package (SR),2020,CE,345216,2023,Triennial-2023,,,NM25,202 HIGH ST,,GARDNER,MA,014400000,202 HIGH ST,,GARDNER,MA,014400000,DAVID,LACROIX
ADVANCE COATINGS COMPANY,1180501,2023,03-Jun-24,,AQ Source Registration Package (SR),2022,CE,130201,2023,Annual-APC,,,SM25,42 DEPOT RD,,WESTMINSTER,MA,014730000,P.O.BOX 457,,WESTMINSTER,MA,014730000,MARK,COOK
AE ELLIS INC,1200110,2024,,,,2021,SE,398988,2024,Triennial-2024,,,NM99,113 GRIFFIN ST,,FALL RIVER,MA,027240000,113 GRIFFIN ST,,FALL RIVER,MA,027240000,MICHAEL,ELLIS
AFFORDABLE INTERIOR SYSTEMS INC,1181280,2025,,,,2022,CE,282001,2025,Triennial-2025,,,NM25,25 TUCKER DR,,LEOMINSTER,MA,014530000,25 TUCKER DR,,LEOMINSTER,MA,014530000,VOLKER,BRAUN
AGGREGATE INDUSTRIES,1200367,2023,01-Apr-24,,AQ Source Registration Package (SR),2020,SE,131578,2023,Triennial-2023,,,SM79-7,KING PHILLIP ST,,RAYNHAM,MA,027670000,,,,,,JARRETT,TEMPLE
AGGREGATE INDUSTRIES,1200211,2023,01-Apr-24,,AQ Source Registration Package (SR),2020,SE,133741,2023,Triennial-2023,,,NM50,GREAT WESTERN RD,,DENNIS,MA,026380000,1715 BROADWAY,,SAUGUS,MA,019060000,JARRETT,TEMPLE
AGGREGATE INDUSTRIES,1200201,2023,01-Apr-24,,AQ Source Registration Package (SR),2020,SE,54361,2023,Triennial-2023,,,SM25,OFF PHINNEYS LN,,HYANNIS,MA,026010000,1715 BROADWAY,ATTN: LISA YOUNG,SAUGUS,MA,019060000,JARRETT,TEMPLE
AGGREGATE INDUSTRIES,1192502,2023,01-Apr-24,,AQ Source Registration Package (SR),2020,SE,131205,2023,Triennial-2023,,,SM80-7,1101 TURNPIKE ST,,STOUGHTON,MA,020720000,,,,,,JARRETT,TEMPLE
AGGREGATE INDUSTRIES,1200386,2023,01-Apr-24,,AQ Source Registration Package (SR),2020,SE,230104,2023,Triennial-2023,,,SM25,203 FREMONT ST,,TAUNTON,MA,027800000,1715 BROADWAY,,SAUGUS,MA,019060000,JARRETT,TEMPLE
AGGREGATE INDUSTRIES,1210908,2023,01-Apr-24,,AQ Source Registration Package (SR),2020,CE,377537,2023,Triennial-2023,,,SM25,149 AYER RD,,LITTLETON,MA,014600000,1715 BROADWAY,,SAUGUS,MA,019060000,JARRETT,TEMPLE
AGGREGATE INDUSTRIES,1180137,2023,03-Jun-24,,AQ Source Registration Package (SR),2022,CE,130476,2023,Annual-APC,,,SM50,651 LAKE ST,,SHREWSBURY,MA,015450000,,,,,,JARRETT,TEMPLE
AGGREGATE INDUSTRIES,1200404,2023,01-Apr-24,,SR and Greenhouse Gas (GHG),2020,SE,131278,2023,Triennial-2023 & Annual-GHG,GHGREQ,,SM80-7,400 GREEN ST,,WRENTHAM,MA,020930000,,,,,,JARRETT,TEMPLE
AGGREGATE INDUSTRIES,1210018,2023,01-Apr-24,,SR and Greenhouse Gas (GHG),2020,NE,388021,2023,Triennial-2023 & Annual-GHG,GHGREQ,,SM79-7,16 OAK ST,,CHELMSFORD,MA,018240000,1715 BROADWAY,,SAUGUS,MA,019060000,JARRETT,TEMPLE
AGGREGATE INDUSTRIES,1190344,2023,01-Apr-24,,SR and Greenhouse Gas (GHG),2020,NE,362154,2023,Triennial-2023 & Annual-GHG,GHGREQ,,SM79-7,1831 BROADWAY,,SAUGUS,MA,019060000,1715 BROADWAY,,SAUGUS,MA,019060000,JARRETT,TEMPLE
AGGREGATE INDUSTRIES NORTHEAST,1191209,2023,01-Apr-24,,AQ Source Registration Package (SR),2020,NE,362171,2023,Triennial-2023,,,SM50,537 SOUTH ST,,WALTHAM,MA,021540000,1715 BROADWAY,,SAUGUS,MA,019060000,JARRETT,TEMPLE
AGGREGATE INDUSTRIES NORTHEAST,1191704,2024,,,,2021,NE,362092,2024,Triennial-2024,,,SM50,48 COOLIDGE AVE,,WATERTOWN,MA,024720000,,,,,,JARRETT,TEMPLE
AGGREGATE INDUSTRIES NORTHEAST REGION,1191319,2023,01-Apr-24,,AQ Source Registration Package (SR),2020,NE,119326,2023,Triennial-2023,,,NM99,30 DANVERS RD,,SWAMPSCOTT,MA,019070000,1715 BROADWAY,,SAUGUS,MA,019060000,JARRETT,TEMPLE
AGGREGATE INDUSTRIES NORTHEAST REGION,1191851,2023,01-Apr-24,,AQ Source Registration Package (SR),2020,SE,362145,2023,Triennial-2023,,,SM50,611 PLEASANT ST,,WEYMOUTH,MA,021900000,,,,,,JARRETT,TEMPLE
AGGREGATE INDUSTRIES NORTHEAST REGION,1190727,2023,03-Jun-24,,AQ Source Registration Package (SR),2022,NE,130140,2023,Annual-RES,,,SM79-R,71 SPRING ST,,ASHLAND,MA,017210000,35 VILLAGE ROAD,SUITE 703,MIDDLETON,MA,019490000,JARRETT,TEMPLE
AGRI MARK INC,0420788,2023,01-Apr-24,,SR and Greenhouse Gas (GHG),2020,WE,119081,2023,Triennial-2023 & Annual-GHG,GHGREQ,,SM50,958 RIVERDALE ST,,WEST SPRINGFIELD,MA,010890000,958 RIVERDALE ST,,WEST SPRINGFIELD,MA,010890000,AARON,PAGE
AGT WESTWOOD,1193482,,16-Apr-24,,Greenhouse Gas Package(GHG),,NE,32810,2023,Annual-GHG,GHGREQ,,BLW-AQ,8 WILSON WAY,,WESTWOOD,MA,020900000,915 NORTH ELDRIDGE PARKWAY,,HOUSTON,TX,770790000,,
AGT WEYMOUTH COMPRESSOR STATION,1193820,2024,01-Apr-24,Call,Greenhouse Gas Package(GHG),2021,SE,571926,2023,Triennial-2024 & Annual-GHG,GHGREQ,,SM25,6 BRIDGE ST,,WEYMOUTH,MA,021910000,915 NORTH ELDRIDGE PARKWAY,,HOUSTON,TX,770790000,CAITLIN,SHAW
AIR LIQUIDE ADVANCED TECHNOLOGIES,1193671,2024,01-Apr-24,,Greenhouse Gas Package(GHG),2021,NE,544032,2023,Triennial-2024 & Annual-GHG,GHGREQ,,SM79-7,35A CABOT ST,,WOBURN,MA,018010000,35A CABOT ST,,WOBURN,MA,018010000,HARRISON,ABINETH
AIRLOC CORPORATION,1201271,2024,,,,2021,CE,628722,2024,Triennial-2024,,,SM80-7,42 HAYWARD ST,,FRANKLIN,MA,020380000,42 HAYWARD ST,,FRANKLIN,MA,020380000,JAMES,AIMONE
ALADCO LINEN SERVICES,1170173,2023,01-Apr-24,,AQ Source Registration Package (SR),2020,WE,410660,2023,Triennial-2023,,,SM25,82 COMMERCIAL ST,,ADAMS,MA,012200000,P.O. BOX 151,,ADAMS,MA,012200000,DAVID,DESMARAIS
ALEXANDRIA REAL ESTATE,1191855,2023,01-Apr-24,,AQ Source Registration Package (SR),2020,NE,325629,2023,Triennial-2023,,,SM25,19 PRESIDENTIAL WAY,,WOBURN,MA,018015140,266 SECOND AVENUE,SUITE,WALTHAM,MA,024510000,JOHN,PAULY
ALL FAITHS CEMETERY,1180006,2023,01-Apr-24,Call,AQ Source Registration Package (SR),2017,CE,50934,2023,Triennial-2023,,,SM25,7 ISLAND RD,,WORCESTER,MA,016030000,9 ISLAND RD,,WORCESTER,MA,016030000,PAUL,DRUIN
ALLCOAT TECHNOLOGY INC,1190308,2024,,,,2021,NE,131254,2024,Triennial-2024,,,SM80-7,100 EAMES ST,,WILMINGTON,MA,018870000,100 EAMES STREET,,WILMINGTON,MA,018870000,NICHOLAS,DEFILIPPO
ALLIED WASTE SERVICES OF MASSACHUSETTS,1191069,2023,01-Apr-24,,AQ Source Registration Package (SR),2020,NE,134029,2023,Triennial-2023,,,NM50,22 NIGHTINGALE AVE,,QUINCY,MA,021690000,320A CHARGER STREET,,REVERE,MA,021510000,CHRISTOPHER,FORD
ALNYLAM PHARMACEUTICALS INC,1201200,2024,,,,2021,SE,589816,2024,Triennial-2024,,,SM25,20 COMMERCE WAY,,NORTON,MA,027660000,20 COMMERCE WAY,,NORTON,MA,027660000,JEFFREY,KAMINSKI
ALPHA ANALYTICAL,1181444,2023,01-Apr-24,,AQ Source Registration Package (SR),2020,CE,178625,2023,Triennial-2023,,,SM79-7,8 WALKUP DR,,WESTBOROUGH,MA,015810000,8 WALKUP DR,,WESTBOROUGH,MA,015810000,JIM,TODARO
ALPHA ANALYTICAL INC,1201109,2023,01-Apr-24,,AQ Source Registration Package (SR),2020,SE,409478,2023,Triennial-2023,,,SM25,320 FORBES BLVD,,MANSFIELD,MA,020480000,320 FORBES BLVD,,MANSFIELD,MA,020480000,JIM,TODARO
ALPHA WIRE CO,1181127,2024,,,,2021,CE,306622,2024,Triennial-2024,,,NM25,128 TOLMAN AVE,,LEOMINSTER,MA,014530000,128 TOLMAN AVE,,LEOMINSTER,MA,014530000,MATTHEW,PAWLAK
AMAZON COM SERVICES LLC,1180361,2023,01-Apr-24,,AQ Source Registration Package (SR),2020,CE,341936,2023,Triennial-2023,,,SM50,4400 COMPUTER DR,,WESTBOROUGH,MA,015810000,,,,,,KEVIN,BOUSQUET
AMERESCO CHICOPEE ENERGY INC,0420110,2023,01-May-24,,SR and Greenhouse Gas (GHG),2022,WE,357046,2023,Annual-OP & Annual-GHG,GHGREQ,,OP3,161 NEW LOMBARD RD,,CHICOPEE,MA,010200000,111 SPEEN STREET,SUITE 410,FRAMINGHAM,MA,017010000,REBECCA,SHERWOOD
AMERIPRIDE SERVICES INC,1180343,2024,,,,2021,CE,2955,2024,Triennial-2024,,,NM25,280 GREENWOOD ST,,WORCESTER,MA,016130000,280 GREENWOOD ST,SUITE 1A,WORCESTER,IN,462170000,REBECCA,ARMBRUSTER
AMETEK HCC AEGIS,1200042,2023,01-Apr-24,,AQ Source Registration Package (SR),2020,SE,396895,2023,Triennial-2023,,,NM25,50 WELBY RD,,NEW BEDFORD,MA,027450000,,,,,,CARLOS,CASTRO
AMGEN,1191921,2023,01-Apr-24,,AQ Source Registration Package (SR),2020,NE,364096,2023,Triennial-2023,,,SM25,360 BINNEY ST,BLDG 1000,CAMBRIDGE,MA,021420000,360 BINNEY ST,BLDG 1000,CAMBRIDGE,MA,021420000,ELIZABETH,GILMAN DUANE
AMHERST COLLEGE,0420003,2023,03-Jun-24,,SR and Greenhouse Gas (GHG),2022,WE,130123,2023,Annual-RES & Annual-GHG,GHGREQ,,SM80-R,151 COLLEGE ST,CO-GENERATION PLANT,AMHERST,MA,010020000,151 COLLEGE ST,CO-GENERATION PLANT,AMHERST,MA,010020000,RICHARD,MEARS
AMHERST LANDFILL AND RECYCLING CENTER,0420133,2023,01-Apr-24,,AQ Source Registration Package (SR),2020,WE,39020,2023,Triennial-2023,,,SM25,730 BELCHERTOWN RD,,AMHERST,MA,010040000,586 SOUTH PLEASANT STREET,,AMHERST,MA,010020000,GUILFORD,MOORING
ANALOG DEVICES INC,1190226,2023,03-Jun-24,,SR and Greenhouse Gas (GHG),2022,NE,131259,2023,Annual-RES & Annual-GHG,GHGREQ,,SM80-R,1 ANALOG WAY,,WILMINGTON,MA,018870000,1 ANALOG WAY,,WILMINGTON,MA,018870000,EMILY,KENNEY
ANALOGIC CORPORATION,1190042,2023,01-Apr-24,,AQ Source Registration Package (SR),2020,NE,131119,2023,Triennial-2023,,,SM25,8 CENTENNIAL DR,,PEABODY,MA,019600000,8 CENTENNIAL DR,,PEABODY,MA,019600000,CINDY,KEEGAN
ANCHOR OXFORD PLANT,1180140,2023,01-Apr-24,,AQ Source Registration Package (SR),2020,CE,380975,2023,Triennial-2023,,,NM50,204 OLD WEBSTER RD,,OXFORD,MA,015400000,204 OLD WEBSTER RD,,OXFORD,MA,015400000,MOE,LANGLOIS
ANDOVER ANIMAL HOSPITAL INC,1210304,2023,01-Apr-24,,AQ Source Registration Package (SR),2020,NE,137484,2023,Triennial-2023,,,NM25,233 LOWELL ST,,ANDOVER,MA,018100000,4360 NORTHLAKE BLVD SUITE 214,,PALM BEACH GARDENS,FL,334100000,DIANE,TOWER
ANIKA THERAPEUTICS INC,1193188,2024,,,,2021,NE,442361,2024,Triennial-2024,,,SM50,32 WIGGINS AVE,,BEDFORD,MA,017300000,32 WIGGINS AVE,,BEDFORD,MA,017300000,MICHAEL,DEROSA
ANIMAL RESCUE LEAGUE OF NEW BEDFORD,1200554,2024,,,,2021,SE,373879,2024,Triennial-2024,,,SM25,VENTURA DR,,DARTMOUTH,MA,027140000,31 VENTURA DR,,DARTMOUTH,MA,027470000,MELINDA,VENTURA
ANNA JAQUES HOSPITAL,1210225,2023,01-Apr-24,,AQ Source Registration Package (SR),2020,NE,132804,2023,Triennial-2023,,,SM25,25 HIGHLAND AVE,,NEWBURYPORT,MA,019500000,25 HIGHLAND AVE,,NEWBURYPORT,MA,019500000,DAVID,FOWLER
ANNA MARIA COLLEGE,1180797,2023,01-Apr-24,,AQ Source Registration Package (SR),2020,CE,132561,2023,Triennial-2023,,,NM25,SUNSET LN,,PAXTON,MA,016120000,SUNSET LN,,PAXTON,MA,016120000,MATTHEW,SIMPSON
ANP BELLINGHAM ENERGY COMPANY LLC,1201509,2023,01-May-24,,SR and Greenhouse Gas (GHG),2022,CE,297575,2023,Annual-OP & Annual-GHG,GHGREQ,,OP8,155 MAPLE ST,,BELLINGHAM,MA,020190000,155 MAPLE ST,,BELLINGHAM,MA,020190000,JOSEPH,NASTASIA
AOTCO METAL FINISHING LLC,1210151,2023,01-Apr-24,,AQ Source Registration Package (SR),2020,NE,130304,2023,Triennial-2023,,,SM79-7,11 SUBURBAN PARK DR,,BILLERICA,MA,018210000,11 SUBURBAN PARK DR,,BILLERICA,MA,018210000,MERYL,VELAZQUEZ
APPLIED GRAPHICS INC,1210094,2025,,,,2022,NE,53674,2025,Triennial-2025,,,SM50,61 SOUTH HUNT RD,,AMESBURY,MA,019130000,61 SOUTH HUNT RD,,AMESBURY,MA,019130000,DON,GREANEY
APPLIED MATERIALS INC,1190804,2023,03-Jun-24,,SR and Greenhouse Gas (GHG),2022,NE,135142,2023,Annual-RES & Annual-GHG,GHGREQ,,SM79-R,35 DORY RD,BLACKBURN INDUSTRIAL PARK,GLOUCESTER,MA,019300000,35 DORY ROAD,,GLOUCESTER,MA,019300000,EDWARD,AKERLEY
ARAMARK UNIFORM AND CAREER APPAREL LLC,1210124,2023,01-Apr-24,,AQ Source Registration Package (SR),2020,NE,53704,2023,Triennial-2023,,,NM25,110 GLENN ST,,LAWRENCE,MA,018430000,110 GLENN ST,,LAWRENCE,MA,018430000,REBECCA,ARMBRUSTER
ARC TECHNOLOGIES INCORPORATED,1210332,2024,,,,2021,NE,574976,2024,Triennial-2024,,,SM50,12 OAKLAND ST,,AMESBURY,MA,019130000,37 SOUTH HUNT ROAD,,AMESBURY,MA,019130000,PAUL,GELINAS
ARCLIN SURFACES LLC,0420166,2023,03-Jun-24,,SR and Greenhouse Gas (GHG),2022,WE,407641,2023,Annual-APC & Annual-GHG,GHGREQ,,SM79-7,82 DEER PARK DR,,EAST LONGMEADOW,MA,010280000,82 DEER PARK DR,,EAST LONGMEADOW,MA,010280000,BRAD,MORRISSEY
ARDENT MILLS LLC,1214000,2023,01-Apr-24,,AQ Source Registration Package (SR),2020,CE,51794,2023,Triennial-2023,,,NM25,35 NEMCO WAY,,AYER,MA,014320000,35 NEMCO WAY,,AYER,MA,014320000,JOE,KOCHAN
ARE MA REGION 88 HOLDING LP,1192800,2024,,,,2021,NE,310102,2024,Triennial-2024,,,SM25,401 PARK DR,,BOSTON,MA,022150000,401 PARK DR,SUITE 202,BOSTON,MA,022150000,PAUL,WALSH
ARE MA REGION NO 107 OWNER LLC,1194088,2025,,,,2022,NE,634653,2025,Triennial-2025,,,NM50,100 BINNEY ST,,CAMBRIDGE,MA,021420000,26 NORTH EUCLID AVE,,PASADENA,CA,911010000,JEFFREY,COOK
ARE MA REGION NO 110 LLC,1191745,2023,01-Apr-24,Call,SR and Greenhouse Gas (GHG),2019,NE,305434,2023,Triennial-2023 & Annual-GHG,GHGREQ,,SM80-7,35 GATEHOUSE DR,,WALTHAM,MA,024510000,215 FIRST ST,STE 100,CAMBRIDGE,MA,021420000,GINENA,DU
ARE MA REGION NO 53 LLC,1193736,2023,01-Apr-24,,AQ Source Registration Package (SR),2020,NE,555499,2023,Triennial-2023,,,NM25,640 MEMORIAL DR,,CAMBRIDGE,MA,021390000,ARE ATTN: JEFF COOK,"700 TECHNOLOGY SQUARE, SUITE 101",CAMBRIDGE,MA,021390000,JEFF,COOK
ARE MA REGION NO 75 LLC,1191773,2023,01-Apr-24,,AQ Source Registration Package (SR),2020,NE,334213,2023,Triennial-2023,,,SM25,311 ARSENAL ST,,WATERTOWN,MA,024720000,400 TALCOTT AVE,ATTN: THOMAS BRYTE,WATERTOWN,MA,024720000,THOMAS,BRYTE
ARE TECH SQUARE LLC,1191861,2023,01-Apr-24,,AQ Source Registration Package (SR),2020,NE,357453,2023,Triennial-2023,,,NM50,100 TECHNOLOGY SQ,,CAMBRIDGE,MA,021390000,400 TECHNOLOGY SQ,ATTN: TED OLEARY,CAMBRIDGE,MA,021390000,TED,OLEARY
ARE-MA REGION NO 97 LLC,1210309,2023,01-Apr-24,,AQ Source Registration Package (SR),2020,NE,207873,2023,Triennial-2023,,,SM50,100 MINUTEMAN RD,,ANDOVER,MA,018100000,,,,,,CLIFF,MIGNEAULT
ARGUS REALITY,1200097,2023,03-Jun-24,,AQ Source Registration Package (SR),2022,SE,54267,2023,Annual-RES,,,SM79-R,109 HOWE ST,,FALL RIVER,MA,027240000,109 HOWE ST,,FALL RIVER,MA,027240000,HUGH,DORSKY
ARLIN MFG CO INC,1210743,2023,01-Apr-24,,AQ Source Registration Package (SR),2020,NE,181896,2023,Triennial-2023,,,SM50,239 INDUSTRIAL AVE E,,LOWELL,MA,018520000,,,,,,PAUL,MITCHELL
ARMORY ST LANDFILL WESTERN DISPOSAL AREA,0420967,2023,01-Apr-24,,AQ Source Registration Package (SR),2020,WE,39757,2023,Triennial-2023,,,NM50,CASS ST,,SPRINGFIELD,MA,011020000,SPRINGFIELD DPW,70 TAPLEY ST BUILDING E,SPRINGFIELD,MA,011040000,SCOTT,DONELON
ARRANTA BIO MA LLC,1210403,2024,,Call,,2021,CE,427964,2024,Triennial-2024,,,SM25,1414 MASSACHUSETTS AVE,,BOXBOROUGH,MA,017190000,1414 MASSACHUSETTS AVE,SUITE 4,BOXBOROUGH,MA,017190000,WAYNE,ROBERTSON
ASHLAND TECHNOLOGY CENTER,1190725,2023,01-Apr-24,Call,AQ Source Registration Package (SR),2011,NE,207816,2023,Triennial-2023,,,SM25,200 HOMER AVE,101 UNION STREET,ASHLAND,MA,017210000,303 CONGRESS ST,C/O NAI HUNNEMAN,BOSTON,MA,022100000,BRIAN,POITRAS
ASPEN AEROGELS INC,1180466,2023,01-Apr-24,,AQ Source Registration Package (SR),2020,CE,391327,2023,Triennial-2023,,,SM25,30 FORBES RD,BLDG B,NORTHBOROUGH,MA,015320000,,,,,,MATTHEW,MILLIKEN
ASSOCIATED ELECTRO MECHANICS INC,0420241,2023,01-Apr-24,,AQ Source Registration Package (SR),2020,WE,130257,2023,Triennial-2023,,,NM25,185 ROWLAND ST,,SPRINGFIELD,MA,011070000,PO BOX 2650,,SPRINGFIELD,MA,011010000,ROLAND,LEBEAU
ASSOCIATES OF CAPE COD INC,1200522,2023,01-Apr-24,,AQ Source Registration Package (SR),2020,SE,361037,2023,Triennial-2023,,,SM79-7,124 BERNARD EAST SAINT JEAN DR,,FALMOUTH,MA,025400000,124 BERNARD EAST SAINT JEAN DR,,FALMOUTH,MA,025400000,MICHAEL,LEWANDOWSKI
ASTELLAS INSTITUTE FOR REGENERATIVE MED,1181604,2025,,,,2022,CE,131958,2025,Triennial-2025,,,NM25,9 TECHNOLOGY DR,,WESTBOROUGH,MA,015810000,9 TECHNOLOGY DR,,WESTBOROUGH,MA,015810000,WILLIAM,TONERY
AT&T BLACKSTONE,1180189,2023,01-Apr-24,,AQ Source Registration Package (SR),2020,CE,226458,2023,Triennial-2023,,,NM25,295 MENDON ST,,BLACKSTONE,MA,015040000,PO BOX 5095,ROOM 4W200M,SAN RAMON,CA,945830000,SEAN,MCFARLANE
AT&T CAMBRIDGE,1191263,2023,03-Jun-24,,AQ Source Registration Package (SR),2022,NE,257313,2023,Annual-RES,,,SM79-R,250 BENT ST,,CAMBRIDGE,MA,021410000,5005 EXECUTIVE PARKWAY,2N200D,SAN RAMON,CA,945830000,SEAN,MCFARLANE
AT&T FRAMINGHAM,1191265,2023,03-Jun-24,,AQ Source Registration Package (SR),2022,NE,9395,2023,Annual-RES,,,SM79-R,825 WAVERLY ST,,FRAMINGHAM,MA,017010000,5005 EXECUTIVE PARKWAY,2N200D,SAN RAMON,CA,945830000,SEAN,MCFARLANE
AT&T LITTLETON,1180185,2023,01-Apr-24,,AQ Source Registration Package (SR),2020,CE,107547,2023,Triennial-2023,,,NM25,451 NEWTOWN RD,,LITTLETON,MA,014600000,PO BOX 5095,ROOM 4W200M,SAN RAMON,CA,945830000,SEAN,MCFARLANE
AT&T SPRINGFIELD,0420035,2023,03-Jun-24,,AQ Source Registration Package (SR),2022,WE,254611,2023,Annual-RES,,,SM79-R,351 BRIDGE ST,,SPRINGFIELD,MA,011010000,5005 EXECUTIVE PARKWAY,2N200D,SAN RAMON,CA,945830000,SEAN,MCFARLANE
AT&T WORCESTER,1180183,2023,01-Apr-24,,AQ Source Registration Package (SR),2020,CE,9394,2023,Triennial-2023,,,NM25,175 MAIN ST,,WORCESTER,MA,016080000,PO BOX 5095,ROOM 4W200M,SAN RAMON,CA,945830000,SEAN,MCFARLANE
ATHOL HIGH SCHOOL,1180144,2023,01-Apr-24,Call,AQ Source Registration Package (SR),2020,WE,51068,2023,Triennial-2023,,,NM50,2363 MAIN ST,,ATHOL,MA,013310000,2363 MAIN STREET,,ATHOL,MA,013310000,ROBERT,ROULEAU
ATI ALLEGHENY LUDLUM INC,1200155,2024,,,,2021,SE,130045,2024,Triennial-2024,,,NM25,1357 EAST RODNEY FRENCH BLVD,,NEW BEDFORD,MA,027440000,100 RIVER ROAD,,BRACKENRIDGE,PA,150140000,DEBORAH,CALDERAZZO